{"text_format":"1","workbook":"xlsx","n_sheets":8,"sheets":["Benvenuto","Lotto8_C6400_1","Lotto8_C6400_2","Lotto8_C6400_3","Altre_Opzioni","Riepilogo_Ordine","ConfigurationTS4L8","Tabella_prezzi"],"not_rendered":{"charts":0,"images":9,"macros":1,"external_links":1,"defined_names":29,"comments":0,"pivot_tables":0},"unopened":[],"bounds":{"document_bytes":16777216,"sheet_cells":100000,"rows_first":2000,"rows_last":500,"rows_between":2000,"halvings":0,"cell_chars":16384,"cell_head_chars":4096},"cells_cut":0,"cells_raw":0,"read":"whole","date_system":"1900"}

{"sheet":"Benvenuto","index":0,"n_rows":8,"n_cols":17,"rows_kept":8,"cut":false,"hidden":false,"merged":[[2,4,42,13],[2,15,2,16],[4,15,4,16],[6,15,6,16]]}
[]
[]
[null,null,null,null,null,null,null,null,null,null,null,null,null,null,null,"LEGENDA"]
[null,null,null,null,null,null,null,null,null,null,null,null,null,null,null,"Campi Non Editabili","Campi Editabili"]
[]
[null,null,null,null,null,null,null,null,null,null,null,null,null,null,null,"Opzioni 20%","Qtà 20%"]
[]
[null,null,null,null,null,null,null,null,null,null,null,null,null,null,null,"Errore nella Selezione","Verifica Positiva"]

{"sheet":"Lotto8_C6400_1","index":1,"n_rows":81,"n_cols":21,"rows_kept":81,"cut":false,"hidden":false,"merged":[[1,9,2,9],[5,11,6,11],[59,14,60,15],[70,10,71,10],[38,14,39,14],[58,11,58,12],[11,10,12,10],[31,10,32,10],[33,14,37,14],[73,10,74,10],[80,9,80,12],[81,9,92,12],[34,9,35,9],[36,9,37,9],[59,10,60,10]]}
[]
[null,null,null,null,null,null,null,null,null,"Convenzione \nTecnologie Server 4 - Lotto 8",null,null,null,null,{"$f":"IF(O4>O6,\"Superata Quota 20%\",\"\")","v":""}]
[null,null,null,null,null,null,null,null,null,null,null,null,null,null,"Articoli 20% Totali"]
[null,null,null,null,null,null,null,null,null,null,null,null,"Totale Altre Opzioni",null,{"$f":"Riepilogo_Ordine!K51","v":0}]
[null,null,null,null,null,null,null,null,null,null,null,null,{"$f":"Altre_Opzioni!H3","v":0},null,"Quota Residua 20 %"]
[null,null,null,null,null,null,null,null,null,null,null,"Guida alla Convenzione","Totale Configurazione",null,{"$f":"Riepilogo_Ordine!G52","v":0}]
[null,null,null,null,null,null,null,null,null,null,null,null,{"$f":"M77+M78","v":0},null,"Totale Ordine\nIva Esclusa"]
[null,null,null,null,null,null,null,null,null,"DELL POWEREDGE C6400\n4 x C6525",null,"Quantità Server",0,null,{"$f":"Riepilogo_Ordine!K52","v":0}]
[]
[]
[]
[null,null,null,null,null,null,null,null,null,"Base"]
[null,null,null,null,null,null,null,null,null,"POWEREDGE C6400-R Enclosure ",null,{"$f":"IF($M$8>0,VLOOKUP(J13,ConfigurationTS4L8!1:3,13),\"\")","v":""},{"$f":"IF($M$8>0,1,\"\")","v":""},null,{"$f":"IF(M8>0,S13,\"\")","v":""},null,null,null,{"$f":"VLOOKUP($J13,TS4L8_SRV,10,FALSE)","v":10030.790000000001},null,{"$f":"VLOOKUP($J13,TS4L8_SRV,12,FALSE)","v":"L8N01"}]
[null,null,null,null,null,null,null,null,null,"PowerEdge C6525",null,null,{"$f":"IF($M$13>0,4,\"\")","v":4}]
[]
[null,null,null,null,null,null,null,null,null,"Chassis Configuration"]
[null,null,null,null,null,null,null,null,null,"Chassis with up to 24x2.5\" Drives"]
[]
[null,null,null,null,null,null,null,null,null,"Processor"]
[null,null,null,null,null,null,null,null,null,"AMD7413 2.65GHz,24C/48T,128M,180W,3200",null,{"$f":"VLOOKUP($J$20,TS4L8_CPU,13,FALSE)","v":"TS4L8-CPU"},{"$f":"VLOOKUP($J$20,TS4L8_CPU,7,FALSE)","v":4},null,null,null,null,null,{"$f":"VLOOKUP($J$20,TS4L8_CPU,11,FALSE)","v":0},{"$f":"VLOOKUP($J$20,TS4L8_CPU,11,FALSE)","v":0},{"$f":"VLOOKUP($J$20,TS4L8_CPU,11,FALSE)","v":0}]
{"$rows_left_out":62}
{"sheet":"Lotto8_C6400_2","index":2,"n_rows":81,"n_cols":21,"rows_kept":81,"cut":false,"hidden":false,"merged":[[1,9,2,9],[80,9,80,12],[81,9,92,12],[38,14,39,14],[58,11,58,12],[59,10,60,10],[59,14,60,15],[70,10,71,10],[73,10,74,10],[5,11,6,11],[11,10,12,10],[31,10,32,10],[33,14,37,14],[34,9,35,9],[36,9,37,9]]}
[]
[null,null,null,null,null,null,null,null,null,"Convenzione \nTecnologie Server 4 - Lotto 8",null,null,null,null,{"$f":"IF(O4>O6,\"Superata Quota 20%\",\"\")","v":""}]
[null,null,null,null,null,null,null,null,null,null,null,null,null,null,"Articoli 20% Totali"]
[null,null,null,null,null,null,null,null,null,null,null,null,"Totale Altre Opzioni",null,{"$f":"Riepilogo_Ordine!K51","v":0}]
[null,null,null,null,null,null,null,null,null,null,null,null,{"$f":"Altre_Opzioni!H3","v":0},null,"Quota Residua 20 %"]
[null,null,null,null,null,null,null,null,null,null,null,"Guida alla Convenzione","Totale Configurazione",null,{"$f":"Riepilogo_Ordine!G52","v":0}]
[null,null,null,null,null,null,null,null,null,null,null,null,{"$f":"M77+M78","v":0},null,"Totale Ordine\nIva Esclusa"]
[null,null,null,null,null,null,null,null,null,"DELL POWEREDGE C6400\n4 x C6525",null,"Quantità Server",0,null,{"$f":"Riepilogo_Ordine!K52","v":0}]
[]
[]
[]
[null,null,null,null,null,null,null,null,null,"Base"]
[null,null,null,null,null,null,null,null,null,"POWEREDGE C6400-R Enclosure ",null,{"$f":"IF($M$8>0,VLOOKUP(J13,ConfigurationTS4L8!1:3,13),\"\")","v":""},{"$f":"IF($M$8>0,1,\"\")","v":""},null,{"$f":"IF(M8>0,S13,\"\")","v":""},null,null,null,{"$f":"VLOOKUP($J13,TS4L8_SRV,10,FALSE)","v":10030.790000000001},null,{"$f":"VLOOKUP($J13,TS4L8_SRV,12,FALSE)","v":"L8N01"}]
[null,null,null,null,null,null,null,null,null,"PowerEdge C6525",null,null,{"$f":"IF($M$13>0,4,\"\")","v":4}]
[]
[null,null,null,null,null,null,null,null,null,"Chassis Configuration"]
[null,null,null,null,null,null,null,null,null,"Chassis with up to 24x2.5\" Drives"]
[]
[null,null,null,null,null,null,null,null,null,"Processor"]
[null,null,null,null,null,null,null,null,null,"AMD7413 2.65GHz,24C/48T,128M,180W,3200",null,{"$f":"VLOOKUP($J$20,TS4L8_CPU,13,FALSE)","v":"TS4L8-CPU"},{"$f":"VLOOKUP($J$20,TS4L8_CPU,7,FALSE)","v":4},null,null,null,null,null,{"$f":"VLOOKUP($J$20,TS4L8_CPU,11,FALSE)","v":0},{"$f":"VLOOKUP($J$20,TS4L8_CPU,11,FALSE)","v":0},{"$f":"VLOOKUP($J$20,TS4L8_CPU,11,FALSE)","v":0}]
{"$rows_left_out":62}
{"sheet":"Lotto8_C6400_3","index":3,"n_rows":81,"n_cols":21,"rows_kept":81,"cut":false,"hidden":false,"merged":[[1,9,2,9],[80,9,80,12],[81,9,92,12],[38,14,39,14],[58,11,58,12],[59,10,60,10],[59,14,60,15],[70,10,71,10],[73,10,74,10],[5,11,6,11],[11,10,12,10],[31,10,32,10],[33,14,37,14],[34,9,35,9],[36,9,37,9]]}
[]
[null,null,null,null,null,null,null,null,null,"Convenzione \nTecnologie Server 4 - Lotto 8",null,null,null,null,{"$f":"IF(O4>O6,\"Superata Quota 20%\",\"\")","v":""}]
[null,null,null,null,null,null,null,null,null,null,null,null,null,null,"Articoli 20% Totali"]
[null,null,null,null,null,null,null,null,null,null,null,null,"Totale Altre Opzioni",null,{"$f":"Riepilogo_Ordine!K51","v":0}]
[null,null,null,null,null,null,null,null,null,null,null,null,{"$f":"Altre_Opzioni!H3","v":0},null,"Quota Residua 20 %"]
[null,null,null,null,null,null,null,null,null,null,null,"Guida alla Convenzione","Totale Configurazione",null,{"$f":"Riepilogo_Ordine!G52","v":0}]
[null,null,null,null,null,null,null,null,null,null,null,null,{"$f":"M77+M78","v":0},null,"Totale Ordine\nIva Esclusa"]
[null,null,null,null,null,null,null,null,null,"DELL POWEREDGE C6400\n4 x C6525",null,"Quantità Server",0,null,{"$f":"Riepilogo_Ordine!K52","v":0}]
[]
[]
[]
[null,null,null,null,null,null,null,null,null,"Base"]
[null,null,null,null,null,null,null,null,null,"POWEREDGE C6400-R Enclosure ",null,{"$f":"IF($M$8>0,VLOOKUP(J13,ConfigurationTS4L8!1:3,13),\"\")","v":""},{"$f":"IF($M$8>0,1,\"\")","v":""},null,{"$f":"IF(M8>0,S13,\"\")","v":""},null,null,null,{"$f":"VLOOKUP($J13,TS4L8_SRV,10,FALSE)","v":10030.790000000001},null,{"$f":"VLOOKUP($J13,TS4L8_SRV,12,FALSE)","v":"L8N01"}]
[null,null,null,null,null,null,null,null,null,"PowerEdge C6525",null,null,{"$f":"IF($M$13>0,4,\"\")","v":4}]
[]
[null,null,null,null,null,null,null,null,null,"Chassis Configuration"]
[null,null,null,null,null,null,null,null,null,"Chassis with up to 24x2.5\" Drives"]
[]
[null,null,null,null,null,null,null,null,null,"Processor"]
[null,null,null,null,null,null,null,null,null,"AMD7413 2.65GHz,24C/48T,128M,180W,3200",null,{"$f":"VLOOKUP($J$20,TS4L8_CPU,13,FALSE)","v":"TS4L8-CPU"},{"$f":"VLOOKUP($J$20,TS4L8_CPU,7,FALSE)","v":4},null,null,null,null,null,{"$f":"VLOOKUP($J$20,TS4L8_CPU,11,FALSE)","v":0},{"$f":"VLOOKUP($J$20,TS4L8_CPU,11,FALSE)","v":0},{"$f":"VLOOKUP($J$20,TS4L8_CPU,11,FALSE)","v":0}]
{"$rows_left_out":62}
{"sheet":"Altre_Opzioni","index":4,"n_rows":19,"n_cols":14,"rows_kept":19,"cut":false,"hidden":false,"merged":[[9,5,10,5],[13,5,14,5],[17,5,18,5],[1,7,1,9],[5,5,6,5]]}
[]
[null,null,null,null,"Opzioni",null,null,"Totale altre opzioni"]
[null,null,null,null,null,null,null,{"$f":"SUM(J7:J19)","v":0}]
[]
[]
[null,null,null,null,"OpzRack"]
[null,null,null,null,{"$f":"ConfigurationTS4L8!A83","v":"Armadio Rack 42U"},null,{"$f":"VLOOKUP($E7,Altre_Opzioni,13,FALSE)","v":"TS4L8-RACK"},0,null,{"$f":"L7","v":0},null,{"$f":"VLOOKUP($E7,Altre_Opzioni,10,FALSE)*H7","v":0},{"$f":"VLOOKUP($E7,Altre_Opzioni,11,FALSE)","v":0},{"$f":"VLOOKUP($E7,Altre_Opzioni,12,FALSE)","v":"L8N22"}]
[]
[]
[null,null,null,null,"OpzUps (3000VA)"]
[null,null,null,null,{"$f":"ConfigurationTS4L8!A78","v":"Dispositivo UPS di tipo On-line doppia conversione, strutturato per il montaggio a rack da 19”"},null,{"$f":"VLOOKUP($E11,Altre_Opzioni,13,FALSE)","v":"TS4L8-UPS"},0,null,{"$f":"L11","v":0},null,{"$f":"VLOOKUP($E11,Altre_Opzioni,10,FALSE)*H11","v":0},{"$f":"VLOOKUP($E11,Altre_Opzioni,11,FALSE)*I11","v":0},{"$f":"VLOOKUP($E11,Altre_Opzioni,12,FALSE)","v":"L8N16"}]
[]
[]
[null,null,null,null,"OpzGUI"]
[null,null,null,null,{"$f":"ConfigurationTS4L8!A79","v":"Console KVM GUI da rack"},null,{"$f":"VLOOKUP($E15,Altre_Opzioni,13,FALSE)","v":"TS4L8-GUI"},0,null,{"$f":"L15","v":0},null,{"$f":"VLOOKUP($E15,Altre_Opzioni,10,FALSE)*H15","v":0},{"$f":"VLOOKUP($E15,Altre_Opzioni,11,FALSE)*H15","v":0},{"$f":"VLOOKUP($E15,Altre_Opzioni,12,FALSE)","v":"L8N17"}]
[]
[]
[null,null,null,null,"OpzKVM"]
[null,null,null,null,{"$f":"ConfigurationTS4L8!A80","v":"KVM Switch IP per GUI 16P"},null,{"$f":"VLOOKUP($E19,Altre_Opzioni,13,FALSE)","v":"TS4L8-SWKVM"},0,null,{"$f":"L19","v":0},null,{"$f":"VLOOKUP($E19,Altre_Opzioni,10,FALSE)*H19","v":0},{"$f":"VLOOKUP($E19,Altre_Opzioni,11,FALSE)*H19","v":0},{"$f":"VLOOKUP($E19,Altre_Opzioni,12,FALSE)","v":"L8N18"}]

{"sheet":"Riepilogo_Ordine","index":5,"n_rows":55,"n_cols":25,"rows_kept":55,"cut":false,"hidden":false,"merged":[[1,8,3,10],[7,7,7,8],[7,9,7,10],[4,10,5,10],[5,8,5,9],[1,5,1,7],[2,5,2,7],[3,5,3,7],[6,5,6,6],[7,5,7,6],[4,5,4,7],[5,5,5,7],[4,8,4,9],[6,7,6,8],[6,9,6,10],[49,5,49,6],[49,8,49,9],[50,8,50,9],[51,8,51,9],[52,5,52,6],[52,8,52,9],[8,5,8,6],[9,5,9,6],[11,5,11,10],[38,5,38,10],[9,7,9,8],[9,9,9,10],[8,7,8,8],[8,9,8,10]]}
[]
[null,null,null,null,null,"Convenzione \nTecnologie Server 4 - Lotto 8",null,null,{"$f":"IF(P8>0,\"Compilare i Dati Necessari (*) all'Ordine per Stampare in PDF\",\"Dati Completi\")","v":"Compilare i Dati Necessari (*) all'Ordine per Stampare in PDF"},null,null,null,null,null,null,null,null,null,null,null,null,null,null,null,"SI"]
[null,null,null,null,null,"Riepilogo Ordine Consip N° (*)",null,null,null,null,null,null,null,null,null,null,null,{"$f":"IF(Lotto8_C6400_1!M8>0,1,0)","v":0},{"$f":"IF(Lotto8_C6400_2!M8>0,1,0)","v":0},{"$f":"IF(Lotto8_C6400_3!M8>0,1,0)","v":0},null,{"$f":"SUM(R3:T3)","v":0},null,null,"SI"]
[null,null,null,null,null,null,null,null,null,null,null,null,null,null,null,null,null,null,null,null,null,null,null,null,"SI"]
[null,null,null,null,null,"Ente Ordinante (*)",null,null,"Data Ordine  (*)",null,null,null,null,null,null,"Ordine","Ente","data","Ref Cons","mail","tel","Ref Inst","mail","Tel","SI"]
[null,null,null,null,null,null,null,null,null,null,null,null,null,null,null,{"$f":"IF(F4>0,0,1)","v":1},{"$f":"IF(F6>0,0,1)","v":1},{"$f":"IF(I6>0,0,1)","v":1},{"$f":"IF(F8>0,0,1)","v":1},{"$f":"IF(H8>0,0,1)","v":1},{"$f":"IF(J8>0,0,1)","v":1},{"$f":"IF(F10>0,0,1)","v":1},{"$f":"IF(H10>0,0,1)","v":1},{"$f":"IF(J10>0,0,1)","v":1},"SI"]
[null,null,null,null,null,"Referente Consegna  (*)",null,"Mail  (*)",null,"Tel  (*)",null,null,null,null,null,null,null,null,null,null,null,null,null,null,"SI"]
[null,null,null,null,null,null,null,null,null,null,null,null,null,null,null,{"$f":"SUM(P6:X6)","v":9},null,null,null,null,null,null,null,null,"SI"]
[null,null,null,null,null,"Referente Installazione  (*)",null,"Mail  (*)",null,"Tel  (*)",null,null,null,null,null,null,null,null,null,null,null,null,null,null,"SI"]
[null,null,null,null,null,null,null,null,null,null,null,null,null,null,null,null,null,null,null,null,null,null,null,null,"SI"]
[null,null,null,null,null,null,null,null,null,null,null,null,null,null,null,null,null,null,null,null,null,null,null,null,"SI"]
[null,null,null,null,null,"Articoli in convenzione",null,null,null,null,null,null,null,null,null,null,null,"Config 1","Config 2","Config 3","Totale",null,null,null,"SI"]
[null,null,null,null,null,"Codice Produttore","Codice Convenzione","Descrizione","Qtà","Costo unitario","Costo Totale",null,null,null,null,"N°","Codice Convenzione",{"$f":"Lotto8_C6400_1!M8","v":0},{"$f":"Lotto8_C6400_2!M8","v":0},{"$f":"Lotto8_C6400_3!M8","v":0},null,null,null,null,"SI"]
[null,null,null,null,null,{"$f":"IF(I14=\"\",\"\",VLOOKUP(P14,Tabella_Prezzi,9,FALSE))","v":""},{"$f":"IF(I14=\"\",\"\",VLOOKUP(P14,Tabella_Prezzi,6,FALSE))","v":""},{"$f":"IF(I14=\"\",\"\",VLOOKUP(P14,Tabella_Prezzi,8,FALSE))","v":""},{"$f":"IF(U14>0,U14,\"\")","v":""},{"$f":"IF(I14=\"\",\"\",VLOOKUP(P14,Tabella_Prezzi,4,FALSE))","v":""},{"$f":"IF(F14=\"\",\"\",J14*I14)","v":""},null,null,null,null,"L8N01","TS4L8-SRV",{"$f":"COUNTIF(TS4L8_1,P14)*$R$13","v":0},{"$f":"COUNTIF(TS4L8_2,P14)*$S$13","v":0},{"$f":"COUNTIF(TS4L8_3,P14)*$T$13","v":0},{"$f":"SUM(R14:T14)","v":0},null,null,null,{"$f":"IF(I14<>\"\",\"SI\",\"NO\")","v":"NO"}]
[null,null,null,null,null,"","","",{"$f":"IF(U15>0,U15,\"\")","v":""},"",{"$f":"IF(F15=\"\",\"\",J15*I15)","v":""},null,null,null,null,"L8N02","TS4L8-CPU",{"$f":"COUNTIF(TS4L8_1,P15)*V19*$R$13","v":0},{"$f":"COUNTIF(TS4L8_2,P15)*W19*$S$13","v":0},{"$f":"COUNTIF(TS4L8_3,P15)*X19*$T$13","v":0},0,null,null,null,{"$f":"IF(I15<>\"\",\"SI\",\"NO\")","v":"NO"}]
[null,null,null,null,null,"","","","","","",null,null,null,null,"L8N03","TS4L8-RAM32",{"$f":"COUNTIF(TS4L8_1,P16)*Lotto8_C6400_1!M26*V19*$R$13","v":0},{"$f":"COUNTIF(TS4L8_2,P16)*Lotto8_C6400_2!M27*W19*S13","v":0},{"$f":"COUNTIF(TS4L8_3,P16)*Lotto8_C6400_3!M27*X19*T13","v":0},0,null,null,null,{"$f":"IF(I16<>\"\",\"SI\",\"NO\")","v":"NO"}]
[null,null,null,null,null,"","","","","","",null,null,null,null,"L8N04","TS4L8-RAM64",{"$f":"COUNTIF(TS4L8_1,P17)*Lotto8_C6400_1!M26*V19*$R$13","v":0},{"$f":"COUNTIF(TS4L8_2,P17)*Lotto8_C6400_2!M27*W19*S14","v":0},{"$f":"COUNTIF(TS4L8_3,P17)*Lotto8_C6400_3!M27*X19*T14","v":0},0,null,null,null,"NO"]
[null,null,null,null,null,"","","","","","",null,null,null,null,"L8N05","TS4L8-BaseT",{"$f":"COUNTIF(TS4L8_1,P18)*V19*$R$13","v":0},{"$f":"COUNTIF(TS4L8_2,P18)*W19*$S$13","v":0},{"$f":"COUNTIF(TS4L8_3,P18)*X19*$T$13","v":0},0,null,null,null,"NO"]
[null,null,null,null,null,"","","","","","",null,null,null,null,"L8N06","TS4L8-LAN10",{"$f":"COUNTIF(TS4L8_1,P19)*W19*$R$13","v":0},{"$f":"COUNTIF(TS4L8_2,P19)*W19*$S$13","v":0},{"$f":"COUNTIF(TS4L8_3,P19)*X19*$T$13","v":0},0,4,4,4,"NO"]
[null,null,null,null,null,"","","","","","",null,null,null,null,"L8N07","TS4L8-LAN25",{"$f":"COUNTIF(TS4L8_1,P20)*V19*$R$13","v":0},{"$f":"COUNTIF(TS4L8_2,P20)*W19*$S$13","v":0},{"$f":"COUNTIF(TS4L8_3,P20)*X19*$T$13","v":0},0,null,null,null,"NO"]
{"$rows_left_out":36}
{"sheet":"ConfigurationTS4L8","index":6,"n_rows":101,"n_cols":21,"rows_kept":101,"cut":false,"hidden":true,"merged":[]}
[1,2,3,4,5,6,7,8,9,10,11,12,13]
["POWEREDGE C6400-R Enclosure ",null,null,{"$f":"VLOOKUP($L$2,Tabella_prezzi!$A$1:$J$186,8,FALSE)","v":"DELL PowerEdge C6400 con 4 x DELL PowerEdge C6525"},null,null,1,{"$f":"VLOOKUP(L2,Tabella_prezzi!$A$1:$J$186,3,FALSE)","v":"Server rackable high-density"},{"$f":"VLOOKUP(L2,Tabella_prezzi!$A$1:$J$186,9,FALSE)","v":"L8N01-ServerC6525"},{"$f":"VLOOKUP(L2,Tabella_prezzi!$A$1:$J$186,4,FALSE)","v":10030.790000000001},null,"L8N01",{"$f":"VLOOKUP(L2,Tabella_prezzi!$A$1:$J$186,6,FALSE)","v":"TS4L8-SRV"},{"$f":"\"\"","v":""}]
[]
["TS4L8_CPU"]
["No Additional Processor",null,null,null,null,null,0,null,{"$f":"\"\"","v":""},null,null,{"$f":"\"\"","v":""},{"$f":"\"\"","v":""}]
[{"$f":"D6","v":"AMD7413 2.65GHz,24C/48T,128M,180W,3200"},null,null,{"$f":"VLOOKUP($L$6,Tabella_prezzi!$A$1:$J$186,8,FALSE)","v":"AMD7413 2.65GHz,24C/48T,128M,180W,3200"},null,null,4,{"$f":"VLOOKUP($L$6,Tabella_prezzi!$A$1:$J$186,3,FALSE)","v":"Kit n. 1 Processore aggiuntivo"},{"$f":"VLOOKUP($L$6,Tabella_prezzi!$A$1:$J$186,9,FALSE)","v":"L8N02-OpzCPU"},{"$f":"VLOOKUP($L$6,Tabella_Prezzi,4,FALSE)*4","v":2288.6799999999998},null,"L8N02",{"$f":"VLOOKUP($L$6,Tabella_prezzi!$A$1:$J$186,6,FALSE)","v":"TS4L8-CPU"}]
[]
["TS4L8_RAM (1CPU)"]
["128GB Totali per Nodo","Memory Capacity",null,{"$f":"Tabella_prezzi!$H$4","v":"32GB - 2Rx4 DDR4 RDIMM 3200MHz"},"*","AA799110",0,{"$f":"VLOOKUP(L9,Tabella_prezzi!$A$1:$J$186,3,FALSE)","v":"OpzRAM32GB"},{"$f":"VLOOKUP(L9,Tabella_prezzi!$A$1:$J$186,9,FALSE)","v":"L8N03-OpzRAM32GB"},{"$f":"VLOOKUP(L9,Tabella_prezzi!$A$1:$J$186,4,FALSE)*G9*4","v":0},null,"L8N03",{"$f":"VLOOKUP(L9,Tabella_prezzi!$A$1:$J$186,6,FALSE)","v":"TS4L8-RAM32"}]
["192GB Totali per Nodo","Memory Capacity",null,{"$f":"Tabella_prezzi!$H$4","v":"32GB - 2Rx4 DDR4 RDIMM 3200MHz"},"*","AA799110",2,{"$f":"VLOOKUP(L10,Tabella_prezzi!$A$1:$J$186,3,FALSE)","v":"OpzRAM32GB"},{"$f":"VLOOKUP(L10,Tabella_prezzi!$A$1:$J$186,9,FALSE)","v":"L8N03-OpzRAM32GB"},{"$f":"VLOOKUP(L10,Tabella_prezzi!$A$1:$J$186,4,FALSE)*G10*4","v":2109.12},null,"L8N03",{"$f":"VLOOKUP(L10,Tabella_prezzi!$A$1:$J$186,6,FALSE)","v":"TS4L8-RAM32"}]
["256GB Totali per Nodo","Memory Capacity",null,{"$f":"Tabella_prezzi!$H$4","v":"32GB - 2Rx4 DDR4 RDIMM 3200MHz"},null,"AA799110",4,{"$f":"VLOOKUP(L11,Tabella_prezzi!$A$1:$J$186,3,FALSE)","v":"OpzRAM32GB"},{"$f":"VLOOKUP(L11,Tabella_prezzi!$A$1:$J$186,9,FALSE)","v":"L8N03-OpzRAM32GB"},{"$f":"VLOOKUP(L11,Tabella_prezzi!$A$1:$J$186,4,FALSE)*G11*4","v":4218.24},null,"L8N03",{"$f":"VLOOKUP(L11,Tabella_prezzi!$A$1:$J$186,6,FALSE)","v":"TS4L8-RAM32"}]
["320GB Totali per Nodo","Memory Capacity",null,{"$f":"Tabella_prezzi!$H$4","v":"32GB - 2Rx4 DDR4 RDIMM 3200MHz"},null,"AA799110",6,{"$f":"VLOOKUP(L12,Tabella_prezzi!$A$1:$J$186,3,FALSE)","v":"OpzRAM32GB"},{"$f":"VLOOKUP(L12,Tabella_prezzi!$A$1:$J$186,9,FALSE)","v":"L8N03-OpzRAM32GB"},{"$f":"VLOOKUP(L12,Tabella_prezzi!$A$1:$J$186,4,FALSE)*G12*4","v":6327.36},null,"L8N03",{"$f":"VLOOKUP(L12,Tabella_prezzi!$A$1:$J$186,6,FALSE)","v":"TS4L8-RAM32"}]
["384GB Totali per Nodo","Memory Capacity",null,{"$f":"Tabella_prezzi!$H$4","v":"32GB - 2Rx4 DDR4 RDIMM 3200MHz"},null,"AA799110",8,{"$f":"VLOOKUP(L13,Tabella_prezzi!$A$1:$J$186,3,FALSE)","v":"OpzRAM32GB"},{"$f":"VLOOKUP(L13,Tabella_prezzi!$A$1:$J$186,9,FALSE)","v":"L8N03-OpzRAM32GB"},{"$f":"VLOOKUP(L13,Tabella_prezzi!$A$1:$J$186,4,FALSE)*G13*4","v":8436.48},null,"L8N03",{"$f":"VLOOKUP(L13,Tabella_prezzi!$A$1:$J$186,6,FALSE)","v":"TS4L8-RAM32"}]
["448GB Totali per Nodo","Memory Capacity",null,{"$f":"Tabella_prezzi!$H$4","v":"32GB - 2Rx4 DDR4 RDIMM 3200MHz"},null,"AA799110",10,{"$f":"VLOOKUP(L14,Tabella_prezzi!$A$1:$J$186,3,FALSE)","v":"OpzRAM32GB"},{"$f":"VLOOKUP(L14,Tabella_prezzi!$A$1:$J$186,9,FALSE)","v":"L8N03-OpzRAM32GB"},{"$f":"VLOOKUP(L14,Tabella_prezzi!$A$1:$J$186,4,FALSE)*G14*4","v":10545.599999999999},null,"L8N03",{"$f":"VLOOKUP(L14,Tabella_prezzi!$A$1:$J$186,6,FALSE)","v":"TS4L8-RAM32"}]
["512GB Totali per Nodo","Memory Capacity",null,{"$f":"Tabella_prezzi!$H$4","v":"32GB - 2Rx4 DDR4 RDIMM 3200MHz"},null,"AA799110",12,{"$f":"VLOOKUP(L15,Tabella_prezzi!$A$1:$J$186,3,FALSE)","v":"OpzRAM32GB"},{"$f":"VLOOKUP(L15,Tabella_prezzi!$A$1:$J$186,9,FALSE)","v":"L8N03-OpzRAM32GB"},{"$f":"VLOOKUP(L15,Tabella_prezzi!$A$1:$J$186,4,FALSE)*G15*4","v":12654.72},null,"L8N03",{"$f":"VLOOKUP(L15,Tabella_prezzi!$A$1:$J$186,6,FALSE)","v":"TS4L8-RAM32"}]
[]
["128GB Totali (1 x 64GB DIMM + 2 x 32GB DIMM per Nodo) ⚠","Memory Capacity",null,"32GB RDIMM, 3200MT/s, Dual Rank","*","AA799087",2,{"$f":"VLOOKUP(L17,Tabella_prezzi!$A$1:$J$186,3,FALSE)","v":"OpzRAM32GB"},{"$f":"VLOOKUP(L17,Tabella_prezzi!$A$1:$J$186,9,FALSE)","v":"L8N03-OpzRAM32GB"},{"$f":"VLOOKUP(L17,Tabella_prezzi!$A$1:$J$186,4,FALSE)*G17*4","v":2109.12},null,"L8N03",{"$f":"VLOOKUP(L17,Tabella_prezzi!$A$1:$J$186,6,FALSE)","v":"TS4L8-RAM32"}]
["256GB Totali (1 x 64GB DIMM + 6 x 32GB DIMM per Nodo) ⚠","Memory Capacity",null,"32GB RDIMM, 3200MT/s, Dual Rank","*","AA799087",6,{"$f":"VLOOKUP(L18,Tabella_prezzi!$A$1:$J$186,3,FALSE)","v":"OpzRAM32GB"},{"$f":"VLOOKUP(L18,Tabella_prezzi!$A$1:$J$186,9,FALSE)","v":"L8N03-OpzRAM32GB"},{"$f":"VLOOKUP(L18,Tabella_prezzi!$A$1:$J$186,4,FALSE)*G18*4","v":6327.36},null,"L8N03",{"$f":"VLOOKUP(L18,Tabella_prezzi!$A$1:$J$186,6,FALSE)","v":"TS4L8-RAM32"}]
["512GB Totali (1 x 64GB DIMM + 14 x 32GB DIMM per Nodo) ⚠","Memory Capacity",null,"32GB RDIMM, 3200MT/s, Dual Rank","*","AA799087",6,{"$f":"VLOOKUP(L19,Tabella_prezzi!$A$1:$J$186,3,FALSE)","v":"OpzRAM32GB"},{"$f":"VLOOKUP(L19,Tabella_prezzi!$A$1:$J$186,9,FALSE)","v":"L8N03-OpzRAM32GB"},{"$f":"VLOOKUP(L19,Tabella_prezzi!$A$1:$J$186,4,FALSE)*G19*4","v":6327.36},null,"L8N03",{"$f":"VLOOKUP(L19,Tabella_prezzi!$A$1:$J$186,6,FALSE)","v":"TS4L8-RAM32"}]
[]
{"$rows_left_out":82}
{"sheet":"Tabella_prezzi","index":7,"n_rows":33,"n_cols":11,"rows_kept":33,"cut":false,"hidden":true,"merged":[[10,0,11,0],[10,1,11,1],[10,2,11,2],[10,3,11,3],[6,5,7,5],[10,5,11,5],[8,0,9,0],[8,1,9,1],[8,2,9,2],[8,3,9,3],[8,4,9,4],[8,5,9,5],[6,0,7,0],[6,1,7,1],[6,2,7,2],[6,3,7,3],[19,0,20,0],[19,1,20,1],[19,2,20,2],[19,3,20,3],[19,4,20,4],[10,4,11,4],[6,4,7,4],[19,6,20,6],[10,7,11,7],[10,8,11,8],[19,5,20,5],[19,7,20,7],[19,8,20,8],[6,7,7,7],[6,8,7,8],[8,7,9,7],[8,8,9,8]]}
["N°",null,"Attributo","Valore inserito","N°","Codice Convenzione","Qty:","Description:","Sku Number:","Sku Number:"]
["L8N01",1,"Server rackable high-density",10030.790000000001,"L8N01","TS4L8-SRV",1,"DELL PowerEdge C6400 con 4 x DELL PowerEdge C6525","L8N01-ServerC6525",null,"DELL"]
["L8N02",2,"Kit n. 1 Processore aggiuntivo",572.16999999999996,"L8N02","TS4L8-CPU",1,"AMD7413 2.65GHz,24C/48T,128M,180W,3200","L8N02-OpzCPU","338-BWBE","DELL"]
["L8N03",3,"OpzRAM32GB",263.64,"L8N03","TS4L8-RAM32",1,"32GB - 2Rx4 DDR4 RDIMM 3200MHz","L8N03-OpzRAM32GB","AA799087","DELL"]
["L8N04",4,"OpzRAM64GB",311.08,"L8N04","TS4L8-RAM64",1,"64GB - 2RX4 DDR4 RDIMM 3200MHz","L8N04-OpzRAM64GB","AA799110","DELL"]
["L8N05",5,"Opz10Gigabit BaseT",144.43,"L8N05","TS4L8-LAN_BaseT",1,"Intel X710-T2L Dual Port 10GbE BASE-T Adapter, PCIe Low Profile + Optics","L8N05-Opz10Gigabit BaseT","540-BBHB","DELL"]
["L8N06",6,"OpzGigabit10Gbps",149.99,"L8N06","TS4L8-LAN10-L",1,"Intel Ethernet XXV710 Dual Port 10 SFP28 Adapter, PCIe Low Profile + optics","L8N06-OpzGigabit10GbpsLP","540-BBML","DELL"]
[null,null,null,null,null,null,2,null,null,"407-BCBN","DELL"]
["L8N07",7,"OpzGigabit25Gbps",233.31,"L8N07","TS4L8-LAN25-L",1,"Intel Ethernet XXV710 Dual Port 25GbE SFP28 Adapter, PCIe Low Profile + Optics","L8N07-OpzGigabit25GbpsLP","540-BCNJ","DELL"]
[null,null,null,null,null,null,2,null,null,"407-BCHI","DELL"]
["L8N08",8,"OpzGigabit10Gbps CNA",149.99,"L8N08","TS4L8-CNA10-L",1,"QLogic FastLinQ 41262 Dual Port 25Gb SFP28 Adapter, Low Profile + Optics","L8N08-OpzCNA10GbpsLP","540-BCNS","DELL"]
[null,null,null,null,null,null,2,null,null,"407-BCBN","DELL"]
["L8N09",9,"OpzHDD1TB",83.33,"L8N09","TS4L8-HDD1TB",1,"1.2TB 10K RPM SAS ISE 12Gbps 512n 2.5in Hot-plug Hard Drive","L8N09-OpzHDD1TB","400-ATJL","DELL"]
["L8N10",10,"OpzHDD2TB",166.65,"L8N10","TS4L8-HDD2TB",1,"2.4TB 10k 512e SAS ISE 12Gbps 2.5in Hot Plug Hard Drive","L8N10-OpzHDD2TB","400-ATII","DELL"]
["L8N11",11,"OpzSSD-RI1,6TB",466.62,"L8N11","TS4L8-RI1600GB",1,"1.92TB SSD SAS ISE RI 12Gbps 512e 2.5in Hot-Plug 1 DWP","L8N11-OpzSSD-RI1,6TB","400-BFZC","DELL"]
["L8N12",12,"OpzSSD-RI3,8TB",944.35,"L8N12","TS4L8-RI3,8TB",1,"3.84TB SSD SAS ISE RI 12Gbps 512e 2.5in PM6 Hot-Plug 1 DWPD","L8N12-OpzSSD-RI3,8TB","400-AZIH","DELL"]
["L8N13",13,"OpzSSD-MU1.6TB",636.29999999999995,"L8N13","TS4L8-MU1.6TB",1,"1.6TB SSD SAS ISE MU 12Gbps 512e 2.5in Hot-Plug PM6 3 DWPD","L8N13-OpzSSD-MU1.6TB","400-BBPN","DELL"]
["L8N14",14,"OpzSSD-RI800GB",318.14999999999998,"L8N14","TS4L8-RI800GB",1,"960GB SSD SAS ISE RI 12Gbps 512e 2.5in Hot-Plug 1 DWPD","L8N14-OpzSSD-RI800GB","400-BCNN","DELL"]
["L8N15",15,"OpzSSD-MU800GB",371.18,"L8N15","TS4L8-MU800GB",1,"SSD 960GB SAS RI 12Gbps 2.5in Hot-plug, 1 DWPD","L8N15-OpzSSD-RI400GB","400-BKYR","DELL"]
["L8N16",16,"OpzUps (3000VA)",386.02,"L8N16","TS4L8-UPS",1,"Dispositivo UPS di tipo On-line doppia conversione, strutturato per il montaggio a rack da 19”","L8N16-OpzUps","RPMM9/3K","DELL"]
{"$rows_left_out":13}