{"text_format":"1","workbook":"xlsx","n_sheets":7,"sheets":["Lotto7_R7525_1","Lotto7_R7525_2","Lotto7_R7525_3","Altre_Opzioni","Riepilogo_Ordine","ConfigurationTS3L4","Tabella_prezzi"],"not_rendered":{"charts":0,"images":8,"macros":1,"external_links":1,"defined_names":85,"comments":0,"pivot_tables":0},"unopened":[],"bounds":{"document_bytes":16777216,"sheet_cells":100000,"rows_first":2000,"rows_last":500,"rows_between":2000,"halvings":0,"cell_chars":16384,"cell_head_chars":4096},"cells_cut":0,"cells_raw":0,"read":"whole","date_system":"1900"}

{"sheet":"Lotto7_R7525_1","index":0,"n_rows":154,"n_cols":31,"rows_kept":154,"cut":false,"hidden":false,"merged":[[8,8,8,10],[8,11,8,12],[9,8,9,10],[9,11,9,12],[11,8,11,10],[11,11,11,12],[48,7,49,7],[12,8,12,10],[12,11,12,12],[14,8,14,10],[14,11,14,12],[15,8,15,10],[15,11,15,12],[18,8,19,8],[21,8,22,8],[22,12,25,12],[27,8,28,8],[45,8,46,8],[154,7,165,10],[135,8,136,8],[69,8,70,8],[71,12,73,13],[72,8,73,8],[132,8,133,8],[138,8,139,8],[153,7,153,10]]}
[]
[null,null,null,null,null,null,null,"Convenzione \nTecnologie Server 4 - Lotto 7",null,{"$f":"IF(T100>1,\"ERRORE NELLA CONFIGURAZIONE\",\"\")","v":""}]
[null,null,null,null,null,null,null,null,null,null,null,null,"Quota massima 20 %"]
[null,null,null,null,null,null,null,null,null,"Guida alla Convenzione","Totale Singola Configurazione",null,{"$f":"Riepilogo_Ordine!G59","v":0}]
[null,null,null,null,null,null,null,null,null,null,{"$f":"K152","v":0},null,"Totale Ordine \nIva Esclusa"]
[null,null,null,null,null,null,null,"DELL POWEREDGE R7525\nGPU Ready",null,"Quantità Server",0,null,{"$f":"Riepilogo_Ordine!J60","v":0}]
[]
[]
[null,null,null,null,null,null,null,"N° Ordine Consip","Amministrazione",null,null,"Data"]
[]
[]
[null,null,null,null,null,null,null,"Nom. Referente Consegna","Email Consegna",null,null,"Tel."]
[]
[]
[null,null,null,null,null,null,null,"Nom. Referente Installazione","Email Installazione","Tel.",null,"Tel."]
[]
[]
[]
[null,null,null,null,null,null,null,"Base",null,null,null,null,null,null,null,null,null,null,null,null,"PowerEdge R7525 Server (General Purpose)"]
[null,null,null,null,null,null,null,"PowerEdge R7525 Server (GPU Double-Wide Ready)",null,{"$f":"IF($K$6>0,\"TS4L7-SRV\",\"\")","v":""},{"$f":"IF($K$6>0,1,\"\")","v":""},null,{"$f":"Q20","v":4047.7},null,null,null,{"$f":"IF($U$20=\"nVME\",VLOOKUP($H$20,TS3L4_ALL,10,FALSE)*1.04,VLOOKUP($H$20,TS3L4_ALL,10,FALSE))","v":4047.7},null,{"$f":"VLOOKUP($H20,TS3L4_ALL,12,FALSE)","v":"L7N01"},null,{"$f":"IF(H20=ConfigurationTS3L4!A4,\"GPU\",\"\")","v":"GPU"},{"$f":"IF(H20=ConfigurationTS3L4!A11,\"Vsan\",\"\")","v":""},{"$f":"IF(J23=\"TS3L4-GPUSW\",1,IF(J23=\"TS3L4-GPUDW\",1,\"\"))","v":""}]
[]
[null,null,null,null,null,null,null,"Chassis Configuration"]
[null,null,null,null,null,null,null,{"$f":"IF(K32=1,VLOOKUP($H$20,TS3L4_Chassis,3,FALSE),VLOOKUP($H$20,TS3L4_Chassis,2,FALSE))","v":"Chassis with Up to 16 x 2.5 Hard Drives for 2CPU, GPU Double-Wide Configuration"},null,{"$f":"IF($K$32=1,VLOOKUP($H$20,TS3L4_Chassis,8,FALSE),VLOOKUP($H$20,TS3L4_Chassis,9,FALSE))","v":"Kit upgrade chassies for Server GPU Double-Wide Ready"},{"$f":"IF(H20=U19,VLOOKUP($H$20,TS3L4_Chassis,6,FALSE),VLOOKUP($H$20,TS3L4_Chassis,7,FALSE))","v":1},null,{"$f":"IF(J23=\"TS3L4-VSAN\",\"ATTENZIONE SELEZIONARE UNA COMPONENTE PER IL BOOT A SCELTA TRA ''ISDM Module'' \noppure \n''BOSS Controller Card''\",\"\")","v":""},null,null,null,{"$f":"VLOOKUP($H20,TS3L4_Chassis,11,FALSE)","v":0},null,{"$f":"VLOOKUP($H20,TS3L4_Chassis,12,FALSE)","v":"L7N37"},null,"Chassis with Up to 24 x 2.5'' Hard Drives for 2CPU Configuration",1]
[]
[null,null,null,null,null,null,null,"Trusted Platform Module (TPM)"]
[null,null,null,null,null,null,null,"Trusted Platform Module 2.0 V3"]
[]
[null,null,null,null,null,null,null,"Processor"]
[null,null,null,null,null,null,null,"AMD EPYC 7313 3.0GHz, 16C/32T, 128M Cache (155W) DDR4-3200",null,{"$f":"IF(K23=1,VLOOKUP($H$29,TS3L4_CPU8core,13,FALSE),VLOOKUP($H$29,TS3L4_CPU8core,13,FALSE))","v":""},{"$f":"IF(K23=1,VLOOKUP($H$29,TS3L4_CPU8core,7,FALSE),VLOOKUP($H$29,TS3L4_CPU8core,7,FALSE))","v":0},null,null,null,null,null,{"$f":"IF(K23=1,VLOOKUP($H$29,TS3L4_CPU8core,10,FALSE),VLOOKUP($H$29,TS3L4_CPU8core,10,FALSE))","v":0},{"$f":"IF(K23=1,VLOOKUP($H$29,TS3L4_CPU8core,11,FALSE),VLOOKUP($H$29,TS3L4_CPU8core,11,FALSE))","v":0},{"$f":"IF(R29=0,0,VLOOKUP($H29,TS3L4_CPU8core,12,FALSE))","v":0}]
[]
[null,null,null,null,null,null,null,"Additional Processor"]
[null,null,null,null,null,null,null,"AMD EPYC 7313 3.0GHz, 16C/32T, 128M Cache (155W) DDR4-3200",null,{"$f":"IF(K23=1,VLOOKUP($H$29,TS3L4_CPU,13,FALSE),VLOOKUP($H$32,TS3L4_CPU,13,FALSE))","v":"TS4L7-CPU"},{"$f":"IF(K23=1,VLOOKUP($H$29,TS3L4_CPU,7,FALSE),VLOOKUP($H$32,TS3L4_CPU,7,FALSE))","v":1},null,{"$f":"Q32","v":680.84},null,null,null,{"$f":"IF(K23=1,VLOOKUP($H$29,TS3L4_CPU,10,FALSE),VLOOKUP($H$32,TS3L4_CPU,10,FALSE))","v":680.84},{"$f":"IF(K23=1,VLOOKUP($H$29,TS3L4_CPU,11,FALSE),VLOOKUP($H$32,TS3L4_CPU,11,FALSE))","v":0},{"$f":"IF(K23=1,VLOOKUP(H29,TS3L4_ALL,12,FALSE),VLOOKUP($H32,TS3L4_CPU,12,FALSE))","v":"L7N02"},null,{"$f":"IF(K23=1,\"AMD EPYC 7313 3.0GHz, 16C/32T, 128M Cache (155W) DDR4-3200\",H32)","v":"AMD EPYC 7313 3.0GHz, 16C/32T, 128M Cache (155W) DDR4-3200"}]
[null,null,null,null,null,null,null,null,null,null,null,null,null,null,null,null,null,null,{"$f":"IF(J33=\"TS3L4-CPU\",\"L4N02\",0)","v":0},null,{"$f":"VLOOKUP($S$32,Tabella_prezzi!$A$1:$L$382,4,FALSE)","v":680.84},{"$f":"VLOOKUP($S$32,Tabella_prezzi!$A$1:$L$382,7,FALSE)","v":1}]
[null,null,null,null,null,null,null,"Memory Capacity (GB)",null,null,{"$f":"IF(AND(K32=0,H35>512),\"Selezionare Quantità RAM Corretta\",\"\")","v":""}]
[null,null,null,null,null,null,null,256,null,{"$f":"IFERROR(U35,\"TS3L4-RAM64\")","v":"TS4L7-WINSRVSTD"},{"$f":"IFERROR(V35,IF($U$20=\"VxFlex\",5,1))","v":0},null,{"$f":"Q35","v":0},null,null,null,{"$f":"IFERROR(W35,444)","v":0},null,{"$f":"IFERROR(X35,\"L4N04\")","v":"L7N03"},null,{"$f":"IF($K$32=1,VLOOKUP($H$35,ConfigurationTS3L4!A45:M65,13,FALSE),VLOOKUP($H$35,TS3L4_RAM1CPU,13,FALSE))","v":"TS4L7-WINSRVSTD"},{"$f":"IF($K$32=1,VLOOKUP($H$35,ConfigurationTS3L4!A45:M65,7,FALSE),VLOOKUP($H$35,TS3L4_RAM1CPU,7,FALSE))","v":0},{"$f":"IF($K$32=1,VLOOKUP($H$35,ConfigurationTS3L4!A45:M65,10,FALSE),VLOOKUP($H$35,TS3L4_RAM1CPU,10,FALSE))","v":0},{"$f":"IF($K$32=1,VLOOKUP($H$35,ConfigurationTS3L4!A45:M65,12,FALSE),VLOOKUP($H$35,TS3L4_RAM1CPU,12,FALSE))","v":"L7N03"},null,"384GB",{"$f":"IF(U20=\"VxFlex\",0,1)","v":1},{"$f":"IF(U20=\"VxFlex\",VLOOKUP(H35,ConfigurationTS3L4!A69:A72,1,FALSE),\"192GB\")","v":"192GB"},{"$f":"IFERROR(AB35,1)","v":"192GB"},{"$f":"IF(H35=\"256\",1,0)","v":0},{"$f":"AD35*K23","v":0}]
[]
[null,null,null,null,null,null,null,"Operating System STANDARD",null,null,{"$f":"IF(AND(K32=0,K38>3),\"Selezionare Numero Corretto di Licenze\",IF(AND(H38=\"Ubuntu Server 22.04 LTS 64 Bit\",K38>1),\"Selezionare Numero Corretto di Licenze\",\"\"))","v":""}]
[null,null,null,null,null,null,null,"No Operating System",null,{"$f":"VLOOKUP($H$38,TS3L4_OS,13,FALSE)","v":""},null,null,{"$f":"Q38","v":0},null,null,null,{"$f":"VLOOKUP($H$38,TS3L4_OS,10,FALSE)*K38","v":0},{"$f":"VLOOKUP($H$38,TS3L4_OS,11,FALSE)","v":0},{"$f":"VLOOKUP($H38,TS3L4_ALL,12,FALSE)","v":""}]
[null,null,null,null,null,null,null,"Windows Server 2022 Standard Edition, Add License,2CORE",null,{"$f":"VLOOKUP($H$39,TS3L4_OS,13,FALSE)","v":"TS4L7-WINSRV2C"},null,null,{"$f":"Q39","v":0},null,null,null,{"$f":"VLOOKUP($H$39,TS3L4_OS,10,FALSE)*K39","v":0},{"$f":"VLOOKUP($H$38,TS3L4_OS,11,FALSE)","v":0},{"$f":"VLOOKUP($H39,TS3L4_ALL,12,FALSE)","v":"L7N26"}]
[]
[]
[null,null,null,null,null,null,null,"Operating System Device CAL / User CAL"]
[null,null,null,null,null,null,null,"1-pack of Windows Server 2022/2019 Device CALs (STD or DC)",null,{"$f":"VLOOKUP($H$43,ConfigurationTS3L4!A79:W80,13,FALSE)","v":"TS4L7-WINDEVCAL"},null,null,{"$f":"Q43","v":0},null,null,null,{"$f":"VLOOKUP($H$43,ConfigurationTS3L4!A79:N80,10,FALSE)*K43","v":0},{"$f":"VLOOKUP($H$38,TS3L4_OS,11,FALSE)","v":0},{"$f":"VLOOKUP($H43,TS3L4_ALL,12,FALSE)","v":"L7N24"}]
[null,null,null,null,null,null,null,"1-pack of Windows Server 2022/2019 User CALs (STD or DC)",null,{"$f":"VLOOKUP($H$44,ConfigurationTS3L4!A80:W81,13,FALSE)","v":"TS4L7-WINUSRCAL"},null,null,{"$f":"Q44","v":0},null,null,null,{"$f":"VLOOKUP($H$44,ConfigurationTS3L4!A80:N81,10,FALSE)*K44","v":0},{"$f":"VLOOKUP($H$38,TS3L4_OS,11,FALSE)","v":0},{"$f":"VLOOKUP($H44,TS3L4_ALL,12,FALSE)","v":"L7N25"}]
[]
[null,null,null,null,null,null,null,"Disk Controller"]
[null,null,null,null,null,{"$f":"IF($J$23=\"TS3L4-VSAN\",\"vSAN HCL\",\"\")","v":""},null,"PERC H745 Controller",null,{"$f":"IF(H23=\"Chassis with Up to 24 x 2.5'' Hard Drives for 2CPU Configuration\",\"TS3L4-HBA335i-L\",IF(U20=\"VxFlex\",\"TS3L4-HBA355i-L\",VLOOKUP($H47,TS3L4_CRTL,13,FALSE)))","v":0},{"$f":"IF(H23=\"Chassis with Up to 24 x 2.5'' Hard Drives for 2CPU Configuration\",\"1\",IF(U20=\"VxFlex\",\"1\",VLOOKUP($H47,TS3L4_CRTL,7,FALSE)))","v":""},null,null,null,null,null,{"$f":"IF(H47=ConfigurationTS3L4!A48,0,VLOOKUP($H47,TS3L4_CRTL,10,FALSE))","v":0},{"$f":"IF(H23=\"Chassis with Up to 24 x 2.5'' Hard Drives for 2CPU Configuration\",180,IF(U20=\"VxFlex\",180,IF(M5=\"\",0,VLOOKUP($H47,TS3L4_CRTL,11,FALSE))))","v":0},{"$f":"IF(H23=\"Chassis with Up to 24 x 2.5'' Hard Drives for 2CPU Configuration\",\"L4N34\",IF(U20=\"VxFlex\",\"L4N34\",IF(M5=\"\",\"\",VLOOKUP($H47,TS3L4_ALL,12,FALSE))))","v":"L7N44"},null,{"$f":"IF(J47=\"TS3L4-HBA330-L\",1,0)","v":0},{"$f":"IF(H47=\"PERC H740P RAID Controller, 8GB NV Cache\",1,0)","v":0},{"$f":"IF(X47=1,X47*U47,V47*U47)","v":0},{"$f":"IF(M5=\"\",1,0)","v":0}]
[]
[null,null,null,null,null,null,null,"Hard Drivers Bays n° 16 - 2 bay occupate dai dischi 960GB SSD di base",null,"Usati","Disponibili",null,null,null,null,null,null,null,null,{"$f":"IF(H23=\"Chassis with Up to 24 x 2.5'' Hard Drives for 2CPU Configuration\",ConfigurationTS3L4!$A$126,IF($M$5=\"\",ConfigurationTS3L4!$A$125,ConfigurationTS3L4!$A$125:$A$126))","v":{"$error":"#VALUE!"}}]
[null,null,null,null,null,null,null,null,null,{"$f":"K52+K54+K56+K62+K64+K58+K60","v":2},{"$f":"16-J50","v":14}]
[]
[null,null,null,null,null,{"$f":"IF($J$23=\"TS3L4-VSAN\",\"vSAN HCL\",\"\")","v":""},null,{"$f":"ConfigurationTS3L4!A86","v":"2.4TB 10k SAS ISE 12Gbps"},null,{"$f":"VLOOKUP($H52,TS3L4_HDD,13,FALSE)","v":"TS4L7-HDD2TB"},null,null,{"$f":"Q52","v":0},null,null,null,{"$f":"VLOOKUP($H52,TS3L4_HDD,10,FALSE)*K52","v":0},{"$f":"VLOOKUP($H52,TS3L4_HDD,11,FALSE)","v":0},{"$f":"VLOOKUP($H52,TS3L4_ALL,12,FALSE)","v":"L7N12"}]
[]
[null,null,null,null,null,{"$f":"IF($J$23=\"TS3L4-VSAN\",\"vSAN HCL\",\"\")","v":""},null,{"$f":"ConfigurationTS3L4!A87","v":"1.2TB 10K RPM SAS ISE 12Gbps"},null,{"$f":"VLOOKUP($H54,TS3L4_HDD,13,FALSE)","v":"TS4L7-HDD1TB"},null,null,{"$f":"Q54","v":0},null,null,null,{"$f":"VLOOKUP($H54,TS3L4_HDD,10,FALSE)*K54","v":0},{"$f":"VLOOKUP($H54,TS3L4_HDD,11,FALSE)","v":0},{"$f":"VLOOKUP($H54,TS3L4_ALL,12,FALSE)","v":"L7N13"}]
[]
[null,null,null,null,null,{"$f":"IF($J$23=\"TS3L4-VSAN\",\"vSAN HCL\",\"\")","v":""},null,{"$f":"ConfigurationTS3L4!A88","v":"3.84TB SSD SAS ISE RI 12Gbps"},null,{"$f":"VLOOKUP($H56,TS3L4_HDD,13,FALSE)","v":"TS4L7-SSD-RI3,8TB"},null,null,{"$f":"Q56","v":0},null,null,null,{"$f":"VLOOKUP($H56,TS3L4_HDD,10,FALSE)*K56","v":0},{"$f":"VLOOKUP($H56,TS3L4_HDD,11,FALSE)","v":0},{"$f":"VLOOKUP($H56,TS3L4_ALL,12,FALSE)","v":"L7N14"}]
[]
[null,null,null,null,null,{"$f":"IF($J$23=\"TS3L4-VSAN\",\"vSAN HCL\",\"\")","v":""},null,{"$f":"ConfigurationTS3L4!A89","v":"1.92TB SSD SAS ISE RI 12Gbps"},null,{"$f":"VLOOKUP($H58,TS3L4_HDD,13,FALSE)","v":"TS4L7-SSD-RI1,6TB"},null,null,{"$f":"Q58","v":0},null,null,null,{"$f":"IF(K58>2,(VLOOKUP($H58,TS3L4_HDD,10,FALSE)*(K58-2)),0)","v":0},{"$f":"VLOOKUP($H58,TS3L4_HDD,11,FALSE)","v":0},{"$f":"VLOOKUP($H58,TS3L4_ALL,12,FALSE)","v":"L7N16"}]
[]
[null,null,null,null,null,{"$f":"IF($J$23=\"TS3L4-VSAN\",\"vSAN HCL\",\"\")","v":""},null,{"$f":"ConfigurationTS3L4!A90","v":"1.6TB SSD SAS ISE MU 12Gbp"},null,{"$f":"VLOOKUP($H60,TS3L4_HDD,13,FALSE)","v":"TS4L7-SSD-MU1,6TB"},null,null,{"$f":"Q60","v":0},null,null,null,{"$f":"VLOOKUP($H60,TS3L4_HDD,10,FALSE)*K60","v":0},{"$f":"VLOOKUP($H60,TS3L4_HDD,11,FALSE)","v":0},{"$f":"VLOOKUP($H60,TS3L4_ALL,12,FALSE)","v":"L7N17"}]
[]
[null,null,null,null,null,{"$f":"IF($J$23=\"TS3L4-VSAN\",\"vSAN HCL\",\"\")","v":""},null,{"$f":"ConfigurationTS3L4!A91","v":"960GB SSD SAS ISE RI 12Gbps"},null,{"$f":"VLOOKUP($H62,TS3L4_HDD,13,FALSE)","v":"TS4L7-SSD-RI800GB"},2,null,{"$f":"Q62","v":0},null,null,null,{"$f":"IF(K62>2,(VLOOKUP($H62,TS3L4_HDD,10,FALSE)*(K62-2)),0)","v":0},{"$f":"VLOOKUP($H62,TS3L4_HDD,11,FALSE)*K62","v":0},{"$f":"VLOOKUP($H62,TS3L4_ALL,12,FALSE)","v":"L7N18"}]
[]
[null,null,null,null,null,{"$f":"IF($J$23=\"TS3L4-VSAN\",\"vSAN HCL\",\"\")","v":""},null,{"$f":"ConfigurationTS3L4!A92","v":"800GB SSD SAS ISE Mix Use 12Gbps"},null,{"$f":"VLOOKUP($H64,TS3L4_HDD,13,FALSE)","v":"TS4L7-SSD-MU800GB"},null,null,{"$f":"Q64","v":0},null,null,null,{"$f":"VLOOKUP($H64,TS3L4_HDD,10,FALSE)*K64","v":0},{"$f":"VLOOKUP($H64,TS3L4_HDD,11,FALSE)*K64","v":0},{"$f":"VLOOKUP($H64,TS3L4_ALL,12,FALSE)","v":"L7N19"}]
[]
[null,null,null,null,null,null,null,"BOSS controller card"]
[null,null,null,null,null,null,null,"No Boss card",null,{"$f":"IF(R67>0,VLOOKUP($H67,TS3L4_ISDM,13,FALSE),\"\")","v":""},{"$f":"VLOOKUP($H67,TS3L4_ISDM,7,FALSE)","v":""},null,null,null,null,null,{"$f":"VLOOKUP($H67,TS3L4_ISDM,10,FALSE)","v":0},{"$f":"VLOOKUP($H67,TS3L4_ISDM,11,FALSE)","v":0},{"$f":"VLOOKUP($H67,TS3L4_ALL,12,FALSE)","v":""}]
[]
[]
[null,null,null,null,null,{"$f":"IF(M70=\"\",\"\",T71)","v":""},null,"Power Supply",{"$f":"IF(M70=\"\",\"\",T71)","v":""}]
[null,null,null,null,null,null,null,{"$f":"ConfigurationTS3L4!A101","v":"Dual, Hot-Plug, Power Supply 2400W Redundant, D"},null,{"$f":"VLOOKUP($H71,TS3L4_PSU,13,FALSE)","v":"TS4L7-PSU2400W"},{"$f":"VLOOKUP($H71,TS3L4_PSU,7,FALSE)","v":1},null,null,null,null,null,{"$f":"VLOOKUP($H71,TS3L4_PSU,10,FALSE)","v":0},{"$f":"VLOOKUP($H71,TS3L4_PSU,11,FALSE)","v":0},{"$f":"VLOOKUP($H71,TS3L4_ALL,12,FALSE)","v":"L7N49"},"⚠",{"$f":"IF(M70=\"\",ConfigurationTS3L4!A565,ConfigurationTS3L4!A566)","v":"_C14C13"}]
[]
[null,null,null,null,null,null,null,"Embedded Systems Management"]
[null,null,null,null,null,null,null,"iDRAC9,Enterprise"]
[]
[]
[null,null,null,null,null,null,null,null,null,null,null,null,null,null,null,null,null,null,null,{"$f":"IF($J$23=\"TS3L4-GPUDW\",\"1\",IF($J$23=\"TS3L4-GPUSW\",\"20\",IF($K$32=1,\"300\",\"4000\")))","v":"300"},{"$f":"IF($J$23=\"TS3L4-GPUDW\",\"DW\",IF($J$23=\"TS3L4-GPUSW\",\"SW\",IF($J$23=\"TS3L4-PWRFLEX\",\"PX\",IF($K$32=1,\"2CPU\",\"1CPU\"))))","v":"2CPU"}]
[null,null,null,null,null,null,null,"PCI Slot 1 Processor 1 x8 PCIe Gen4 for HL/FH",null,null,null,null,null,null,null,null,null,null,null,null,{"$f":"IF(U77=\"DW\",\"DW\",IF(U77=\"SW\",\"SW\",0))","v":0},"Selected","1CPU","2CPU","PX","DW","SW"]
[null,null,null,null,null,null,null,"",null,{"$f":"IF($U$20=\"VxFlex\",\"TS3L4-MCX4DP\",VLOOKUP($H79,TS3L4_ALL,13,))","v":""},{"$f":"IF($U$20=\"VxFlex\",1,VLOOKUP($H79,TS3L4_ALL,7,FALSE))","v":""},null,{"$f":"Q79","v":0},null,null,null,{"$f":"VLOOKUP($H79,TS3L4_ALL,10,FALSE)","v":0},{"$f":"IF($U$20=\"VxFlex\",419,VLOOKUP($H79,TS3L4_ALL,11,FALSE))","v":0},{"$f":"IF($U$20=\"VxFlex\",\"L4N94\",VLOOKUP($H79,TS3L4_ALL,12,FALSE))","v":""},null,{"$f":"IF(S79=\"L4N56\",\"DW\",IF(S79=\"L4N57\",\"DW\",IF(S79=\"L4N58\",\"DW\",IF(S79=\"L4N55\",\"SW\",\"CPU\"))))","v":"CPU"},{"$f":"HLOOKUP($N$77,$R$78:$V$101,2,FALSE)","v":"CPU"},"TS3L2_PCI_A","TS3L2_PCI_A","TS3L2_PCI_A","TS3L2_PCI_A","TS3L2_PCI_A",null,"PCI-1",{"$f":"IF($U$77=\"SW\",ConfigurationTS3L4!$A$329:$A$348,IF($U$77=\"DW\",ConfigurationTS3L4!$A$278:$A$301,ConfigurationTS3L4!$A$198:$A$220))","v":{"$error":"#VALUE!"}}]
[null,null,null,null,null,null,null,null,null,null,null,null,{"$f":"IF(S79=\"L4N33\",IF($T$100>1,\"ERRORE: SOLO UNA BOSS CARD PUO' ESSERE CONFIGURATA\",\"\"),\"\")","v":""},null,null,null,null,null,null,null,null,{"$f":"HLOOKUP($N$77,$R$78:$V$101,3,FALSE)","v":0},{"$f":"VLOOKUP(H79,TS3L4_PCI_A,12,FALSE)","v":""},{"$f":"VLOOKUP(H79,TS3L4_PCI_A,12,FALSE)","v":""},{"$f":"VLOOKUP(H79,TS3L4_PCI_A,12,FALSE)","v":""},{"$f":"VLOOKUP(H79,TS3L4_PCI_A,12,FALSE)","v":""},{"$f":"VLOOKUP(H79,TS3L4_PCI_A,12,FALSE)","v":""}]
[null,null,null,null,null,null,null,"PCI Slot 2 Processor 1 x16 PCIe Gen4 for DW/FH"]
[null,null,null,null,null,null,null,"AMD MI100,300W PCIe, 32GB Passive, Double Wide, GPU",null,{"$f":"IF(H20=\"PowerEdge R7525 Server (General Purpose)\",\"\",VLOOKUP($H82,TS3L4_ALL,13,FALSE))","v":"TS4L7-GPU"},{"$f":"IF(H20=\"PowerEdge R7525 Server (General Purpose)\",\"\",VLOOKUP($H82,TS3L4_ALL,7,FALSE))","v":1},null,{"$f":"Q82","v":6264.37},null,null,null,{"$f":"IF(H20=\"PowerEdge R7525 Server (General Purpose)\",0,VLOOKUP($H82,TS3L4_ALL,10,FALSE))","v":6264.37},{"$f":"VLOOKUP($H82,TS3L4_ALL,11,FALSE)","v":0},{"$f":"VLOOKUP($H82,TS3L4_ALL,12,FALSE)","v":"L7N15"},{"$f":"IF(K82=\"\",\"OK\",IF(U82+K82=2,\"Errore\",\"OK\"))","v":"OK"},{"$f":"IF(U79=\"dw\",1,0)","v":0},{"$f":"HLOOKUP($N$77,$R$78:$V$101,5,FALSE)","v":0},"TS3L2_PCI_A","TS3L2_PCI_A","TS3L2_PCI_A","TS3L2_PCI_A","TS3L2_PCI_A",null,"PCI-2"]
[null,null,null,null,null,null,null,null,null,null,null,null,null,null,null,null,null,null,null,null,null,{"$f":"HLOOKUP($N$77,$R$78:$V$101,6,FALSE)","v":0},{"$f":"VLOOKUP(H82,TS3L4_PCI_A,12,FALSE)","v":{"$error":"#N/A"}},{"$f":"VLOOKUP(H82,TS3L4_PCI_A,12,FALSE)","v":{"$error":"#N/A"}},{"$f":"VLOOKUP(H82,TS3L4_PCI_A,12,FALSE)","v":{"$error":"#N/A"}},{"$f":"VLOOKUP(H82,TS3L4_PCI_A,12,FALSE)","v":{"$error":"#N/A"}},{"$f":"VLOOKUP(H82,TS3L4_PCI_A,12,FALSE)","v":{"$error":"#N/A"}}]
[null,null,null,null,null,null,null,"PCI Slot 3 Processor 1 x16 PCIe Gen4 for HL/LP"]
[null,null,null,null,null,null,null,"",null,{"$f":"VLOOKUP($H85,TS3L4_ALL,13,FALSE)","v":""},{"$f":"VLOOKUP($H85,TS3L4_ALL,7,FALSE)","v":""},null,{"$f":"Q85","v":0},null,null,null,{"$f":"IF($U$20=\"VxFlex\",748,VLOOKUP($H85,TS3L4_ALL,11,FALSE))","v":0},{"$f":"VLOOKUP($H85,TS3L4_ALL,11,FALSE)","v":0},{"$f":"IF($U$20=\"VxFlex\",\"L4N33\",VLOOKUP($H85,TS3L4_ALL,12,FALSE))","v":""},null,null,{"$f":"HLOOKUP($N$77,$R$78:$V$101,8,FALSE)","v":0},"TS3L2_PCI_A","TS3L2_PCI_A","TS3L2_PCI_A","TS3L2_PCI_A","TS3L2_PCI_A",null,"PCI-3"]
[null,null,null,null,null,null,null,null,null,null,null,null,null,null,null,null,null,null,null,null,null,{"$f":"HLOOKUP($N$77,$R$78:$V$101,9,FALSE)","v":0},{"$f":"VLOOKUP(H85,TS3L4_PCI_A,12,FALSE)","v":""},{"$f":"VLOOKUP(H85,TS3L4_PCI_A,12,FALSE)","v":""},{"$f":"VLOOKUP(H85,TS3L4_PCI_A,12,FALSE)","v":""},{"$f":"VLOOKUP(H85,TS3L4_PCI_A,12,FALSE)","v":""},{"$f":"VLOOKUP(H85,TS3L4_PCI_A,12,FALSE)","v":""}]
[null,null,null,null,null,null,null,"PCI Slot 4 Processor 2 x8 PCIe Gen4 for HL/FH",{"$f":"IF($U$77=\"SW\",\"GPU Slot\",IF($U$77=\"DW\",\"GPU Slot\",\"\"))","v":""}]
[null,null,null,null,null,null,null,"",null,{"$f":"VLOOKUP($H88,TS3L4_ALL,13,FALSE)","v":""},{"$f":"VLOOKUP($H88,TS3L4_ALL,7,FALSE)","v":""},null,{"$f":"Q88","v":0},null,null,null,{"$f":"VLOOKUP($H88,TS3L4_ALL,10,FALSE)","v":0},{"$f":"VLOOKUP($H88,TS3L4_ALL,11,FALSE)","v":0},{"$f":"VLOOKUP($H88,TS3L4_ALL,12,FALSE)","v":""},null,{"$f":"IF(S88=\"L4N56\",\"DW\",IF(S88=\"L4N57\",\"DW\",IF(S88=\"L4N108\",\"DW\",IF(S88=\"L4N55\",\"SW\",1))))","v":1},{"$f":"HLOOKUP($N$77,$R$78:$V$101,11,FALSE)","v":1},"-","TS3L2_PCI_B","TS3L2_PCI_I","TS3L2_PCI_F","TS3L2_PCI_H",null,"PCI-4"]
[null,null,null,null,null,null,null,null,null,null,null,null,{"$f":"IF(S88=\"L4N33\",IF($T$100>1,\"ERRORE: SOLO UNA BOSS CARD PUO' ESSERE CONFIGURATA\",\"\"),\"\")","v":""},null,null,null,null,null,null,null,null,{"$f":"HLOOKUP($N$77,$R$78:$V$101,12,FALSE)","v":0},{"$f":"VLOOKUP(H88,TS3L4_PCI_A,12,FALSE)","v":""},{"$f":"VLOOKUP(H88,TS3L4_PCI_B,12,FALSE)","v":""},{"$f":"VLOOKUP(H88,TS3L4_PCI_I,12,FALSE)","v":""},{"$f":"VLOOKUP(H88,TS3L4_PCI_F,12,FALSE)","v":""},{"$f":"VLOOKUP(H88,TS3L4_PCI_H,12,FALSE)","v":""}]
[null,null,null,null,null,null,null,"PCI Slot 5 Processor 2 x16 PCIe Gen4 for DW/FH"]
[null,null,null,null,null,null,null,"AMD MI100,300W PCIe, 32GB Passive, Double Wide, GPU",null,{"$f":"IF(H20=\"PowerEdge R7525 Server (General Purpose)\",\"\",VLOOKUP($H91,TS3L4_ALL,13,FALSE))","v":"TS4L7-GPU"},{"$f":"IF(H20=\"PowerEdge R7525 Server (General Purpose)\",\"\",VLOOKUP($H91,TS3L4_ALL,7,FALSE))","v":1},null,{"$f":"Q91","v":6264.37},null,null,null,{"$f":"IF(H20=\"PowerEdge R7525 Server (General Purpose)\",0,VLOOKUP($H91,TS3L4_ALL,10,FALSE))","v":6264.37},{"$f":"VLOOKUP($H91,TS3L4_ALL,11,FALSE)","v":0},{"$f":"VLOOKUP($H91,TS3L4_ALL,12,FALSE)","v":"L7N15"},{"$f":"IF(K91=\"\",\"OK\",IF(U91+K91=2,\"Errore\",\"OK\"))","v":"OK"},{"$f":"IF(U88=\"dw\",1,0)","v":0},{"$f":"HLOOKUP($N$77,$R$78:$V$101,14,FALSE)","v":0},"-","TS3L2_PCI_A","TS3L2_PCI_I","TS3L2_PCI_A","TS3L2_PCI_L",null,"PCI-5"]
[null,null,null,null,null,null,null,null,null,null,null,null,null,null,null,null,null,null,null,null,null,{"$f":"HLOOKUP($N$77,$R$78:$V$101,15,FALSE)","v":0},{"$f":"VLOOKUP(H91,TS3L4_PCI_A,12,FALSE)","v":{"$error":"#N/A"}},{"$f":"VLOOKUP(H91,TS3L4_PCI_A,12,FALSE)","v":{"$error":"#N/A"}},{"$f":"VLOOKUP(H91,TS3L4_PCI_I,12,FALSE)","v":{"$error":"#N/A"}},{"$f":"VLOOKUP(H91,TS3L4_PCI_A,12,FALSE)","v":{"$error":"#N/A"}},{"$f":"VLOOKUP(H91,TS3L4_PCI_L,12,FALSE)","v":{"$error":"#N/A"}}]
[null,null,null,null,null,null,null,"PCI Slot 6 Processor 2 x16 PCIe Gen4 for HL/LP"]
[null,null,null,null,null,null,null,"",null,{"$f":"VLOOKUP($H94,TS3L4_ALL,13,FALSE)","v":""},{"$f":"IF($U$20=\"VxFlex\",1,VLOOKUP($H94,TS3L4_ALL,7,FALSE))","v":""},null,{"$f":"Q94","v":0},null,null,null,{"$f":"IF($U$20=\"VxFlex\",419,VLOOKUP($H94,TS3L4_ALL,11,FALSE))","v":0},null,{"$f":"VLOOKUP($H94,TS3L4_ALL,12,FALSE)","v":""},null,null,{"$f":"HLOOKUP($N$77,$R$78:$V$101,17,FALSE)","v":0},"TS3L2_PCI_C","TS3L2_PCI_C","TS3L2_PCI_C","TS3L2_PCI_C","TS3L2_PCI_C",null,"PCI-6"]
[null,null,null,null,null,null,null,null,null,null,null,null,null,null,null,null,null,null,null,null,null,{"$f":"HLOOKUP($N$77,$R$78:$V$101,18,FALSE)","v":0},{"$f":"VLOOKUP(H94,TS3L4_PCI_C,12,FALSE)","v":""},{"$f":"VLOOKUP(H94,TS3L4_PCI_C,12,FALSE)","v":""},{"$f":"VLOOKUP(H94,TS3L4_PCI_C,12,FALSE)","v":""},{"$f":"VLOOKUP(H94,TS3L4_PCI_C,12,FALSE)","v":""},{"$f":"VLOOKUP(H94,TS3L4_PCI_C,12,FALSE)","v":""}]
[null,null,null,null,null,null,null,"PCI Slot 7 Processor 2 x16 PCIe Gen4 for DW/FH"]
[null,null,null,null,null,null,null,"",null,{"$f":"IF(H20=\"PowerEdge R7525 Server (General Purpose)\",\"\",VLOOKUP($H97,TS3L4_ALL,13,FALSE))","v":""},{"$f":"IF(H20=\"PowerEdge R7525 Server (General Purpose)\",\"\",VLOOKUP($H97,TS3L4_ALL,7,FALSE))","v":""},null,{"$f":"Q97","v":0},null,null,null,{"$f":"IF(H20=\"PowerEdge R7525 Server (General Purpose)\",0,VLOOKUP($H97,TS3L4_ALL,10,FALSE))","v":0},{"$f":"VLOOKUP($H97,TS3L4_ALL,11,FALSE)","v":0},{"$f":"VLOOKUP($H97,TS3L4_ALL,12,FALSE)","v":""},{"$f":"IF(K97=\"\",\"OK\",IF(U97+K97=2,\"Errore\",\"OK\"))","v":"OK"},{"$f":"IF(U100=\"dw\",1,0)","v":0},{"$f":"HLOOKUP($N$77,$R$78:$V$101,20,FALSE)","v":0},"-","TS3L2_PCI_A","TS3L2_PCI_I","TS3L2_PCI_A","TS3L2_PCI_L",null,"PCI-7"]
[null,null,null,null,null,null,null,null,null,null,null,null,{"$f":"IF(S97=\"L4N33\",IF($T$100>1,\"ERRORE: SOLO UNA BOSS CARD PUO' ESSERE CONFIGURATA\",\"\"),\"\")","v":""},null,null,null,null,null,null,null,null,{"$f":"HLOOKUP($N$77,$R$78:$V$101,21,FALSE)","v":0},{"$f":"VLOOKUP(H97,TS3L4_PCI_A,12,FALSE)","v":""},{"$f":"VLOOKUP(H97,TS3L4_PCI_A,12,FALSE)","v":""},{"$f":"VLOOKUP(H97,TS3L4_PCI_I,12,FALSE)","v":""},{"$f":"VLOOKUP(H97,TS3L4_PCI_A,12,FALSE)","v":""},{"$f":"VLOOKUP(H97,TS3L4_PCI_L,12,FALSE)","v":""}]
[null,null,null,null,null,null,null,"PCI Slot 9 Processor 1 x16  ",null,null,null,null,null,null,null,null,null,null,null,"boss card"]
[null,null,null,null,null,null,null,"",null,{"$f":"VLOOKUP($H100,TS3L4_ALL,13,FALSE)","v":""},{"$f":"VLOOKUP($H100,TS3L4_ALL,7,FALSE)","v":""},null,{"$f":"Q100","v":0},null,null,null,{"$f":"VLOOKUP($H100,TS3L4_ALL,10,FALSE)","v":0},{"$f":"VLOOKUP($H100,TS3L4_ALL,11,FALSE)","v":0},{"$f":"VLOOKUP($H100,TS3L4_ALL,12,FALSE)","v":""},{"$f":"COUNTIF(S79:S100,\"L4N33\")","v":0},{"$f":"IF(S100=\"L4N56\",\"DW\",IF(S100=\"L4N57\",\"DW\",IF(S100=\"L4N108\",\"DW\",IF(S100=\"L4N55\",\"SW\",1))))","v":1},{"$f":"HLOOKUP($N$77,$R$78:$V$101,23,FALSE)","v":1},"-","TS3L2_PCI_D","TS3L2_PCI_I","TS3L2_PCI_E","TS3L2_PCI_G",null,"PCI-8"]
[null,null,null,null,null,null,null,null,null,null,null,null,{"$f":"IF(S100=\"L4N33\",IF($T$100>1,\"ERRORE: SOLO UNA BOSS CARD PUO' ESSERE CONFIGURATA\",\"\"),\"\")","v":""},null,null,null,null,null,null,null,null,{"$f":"HLOOKUP($N$77,$R$78:$V$101,24,FALSE)","v":0},{"$f":"VLOOKUP(H100,TS3L4_PCI_A,12,FALSE)","v":""},{"$f":"VLOOKUP(H100,TS3L4_PCI_D,12,FALSE)","v":""},{"$f":"VLOOKUP(H100,TS3L4_PCI_I,12,FALSE)","v":""},{"$f":"VLOOKUP(H100,TS3L4_PCI_E,12,FALSE)","v":""},{"$f":"VLOOKUP(H100,TS3L4_PCI_G,12,FALSE)","v":""}]
[null,null,null,null,null,null,null,"SFP+ Transceivers"]
[null,null,null,null,null,null,null,"Transceiver, SFP+ SR Optic for SFP+ ports (Intel X710)",null,{"$f":"IF(R103>0,VLOOKUP($H103,ConfigurationTS3L4!$A$1:$M$4870,13,FALSE),\"\")","v":""},null,null,null,null,null,null,0,{"$f":"IF(K103>0,VLOOKUP($H103,TS3L4_ALL,11,FALSE)*(K103),0)","v":0},{"$f":"IF(K103>0,VLOOKUP($H103,TS3L4_ALL,12,FALSE),0)","v":0}]
[]
[null,null,null,null,null,null,null,"SFP+ Direct Attach Cables (Twinax)"]
[null,null,null,null,null,null,null,"Cable, SFP+ to SFP+, 10GbE, Copper Twinax Direct Attach Cable, 3 Meter",null,{"$f":"IF(R106>0,VLOOKUP($H106,ConfigurationTS3L4!$A$1:$M$4870,13,FALSE),\"\")","v":""},null,null,null,null,null,null,0,{"$f":"IF(K106>0,VLOOKUP($H106,TS3L4_ALL,11,FALSE)*K106,0)","v":0},{"$f":"IF(K106>0,VLOOKUP($H106,TS3L4_ALL,12,FALSE),0)","v":0}]
[]
[null,null,null,null,null,null,null,"QSFP28 Transceivers"]
[null,null,null,null,null,null,null,"Dell EMC PowerEdge QSFP28 SR4 100GbE 85C optic",null,{"$f":"IF(R109>0,VLOOKUP($H109,ConfigurationTS3L4!$A$1:$M$4870,13,FALSE),\"\")","v":""},null,null,null,null,null,null,0,{"$f":"IF(K109>0,VLOOKUP($H109,TS3L4_ALL,11,FALSE)*K109,0)","v":0},{"$f":"IF(K109>0,VLOOKUP($H109,TS3L4_ALL,12,FALSE),0)","v":0}]
[]
[null,null,null,null,null,null,null,"Mellanox LinkX 100Gb/s Passive Copper Cables"]
[null,null,null,null,null,null,null,"Mellanox LinkX 100Gb/s Passive Copper Cables - attacco cavo diretto - 3 m - nero",null,{"$f":"IF(R112>0,VLOOKUP($H112,ConfigurationTS3L4!$A$1:$M$4870,13,FALSE),\"\")","v":""},null,null,null,null,null,null,0,{"$f":"IF(K112>0,VLOOKUP($H112,TS3L4_ALL,11,FALSE)*K112,0)","v":0},{"$f":"IF(K112>0,VLOOKUP($H112,TS3L4_ALL,12,FALSE),0)","v":0}]
[]
[null,null,null,null,null,null,null,"Mellanox LinkX 100Gb/s VCSEL-Based Active Optical Cables - cavo InfiniBand - 10 m",null,{"$f":"IF(R114>0,VLOOKUP($H114,ConfigurationTS3L4!$A$1:$M$4870,13,FALSE),\"\")","v":""},null,null,null,null,null,null,0,{"$f":"IF(K114>0,VLOOKUP($H114,TS3L4_ALL,11,FALSE)*K114,0)","v":0},{"$f":"IF(K114>0,VLOOKUP($H114,TS3L4_ALL,12,FALSE),0)","v":0}]
[]
[null,null,null,null,null,null,null,"Cavi RJ45"]
[null,null,null,null,null,null,null,"Cavo “patch” di 3 mt RJ45 certificato per gigabit ethernet",null,{"$f":"IF(R117>0,VLOOKUP($H117,ConfigurationTS3L4!$A$1:$M$4870,13,FALSE),\"\")","v":""},null,null,null,null,null,null,0,{"$f":"IF(K117>0,VLOOKUP($H117,TS3L4_ALL,11,FALSE)*(K117),0)","v":0},{"$f":"IF(K117>0,VLOOKUP($H117,TS3L4_ALL,12,FALSE),0)","v":0}]
[]
[null,null,null,null,null,null,null,"Cavi LC-LC"]
[null,null,null,null,null,null,null,"Dell Networking Cable, OM4 LC/LC Fiber Cable, 3 Meter",null,{"$f":"IF(R120>0,VLOOKUP($H120,ConfigurationTS3L4!$A$1:$M$4870,13,FALSE),\"\")","v":""},null,null,null,null,null,null,0,{"$f":"IF(K120>0,VLOOKUP($H120,TS3L4_ALL,11,FALSE)*(K120),0)","v":0},{"$f":"IF(K120>0,VLOOKUP($H120,TS3L4_ALL,12,FALSE),0)","v":0}]
[]
[null,null,null,null,null,null,null,"Cavi DAC"]
[null,null,null,null,null,null,null,"Dell Networking, Cable, SFP+ to SFP+, 10GbE, Copper Twinax Direct Attach Cable, 3 Meter",null,{"$f":"IF(R123>0,VLOOKUP($H123,ConfigurationTS3L4!$A$1:$M$4870,13,FALSE),\"\")","v":""},null,null,null,null,null,null,0,{"$f":"IF(K123>0,VLOOKUP($H123,TS3L4_ALL,11,FALSE)*(K123),0)","v":0},{"$f":"IF(K123>0,VLOOKUP($H123,TS3L4_ALL,12,FALSE),0)","v":0}]
[null,null,null,null,null,null,null,"Mellanox LinkX 100Gb/s Passive Copper DAC 3m per scheda TS3L4-CONX6DP",null,{"$f":"IF(R124>0,VLOOKUP($H124,ConfigurationTS3L4!$A$1:$M$4870,13,FALSE),\"\")","v":""},null,null,null,null,null,null,0,{"$f":"IF(K124>0,VLOOKUP($H124,TS3L4_ALL,11,FALSE)*(K124),0)","v":0},{"$f":"IF(K124>0,VLOOKUP($H124,TS3L4_ALL,12,FALSE),0)","v":0}]
[null,null,null,null,null,null,null,"Dell Cable SFP28 to SFP28 25GbE Passive Copper Twinax Direct Attach Cable 3 Meter ",null,{"$f":"IF(R125>0,VLOOKUP($H125,ConfigurationTS3L4!$A$1:$M$4870,13,FALSE),\"\")","v":""},null,null,null,null,null,null,0,{"$f":"IF(K125>0,VLOOKUP($H125,TS3L4_ALL,11,FALSE)*(K125),0)","v":0},{"$f":"IF(K125>0,VLOOKUP($H125,TS3L4_ALL,12,FALSE),0)","v":0}]
[null,null,null,null,null,null,null,null,null,null,null,null,null,null,null,null,null,null,null,null,null,{"$f":"IF($U$20=\"VxFlex\",ConfigurationTS3L4!$A$275,IF($U$100=\"DW\",ConfigurationTS3L4!$A$372,IF($U$77=\"1CPU\",ConfigurationTS3L4!$A$105:$A$106,ConfigurationTS3L4!$A$198:$A$220)))","v":{"$error":"#VALUE!"}}]
[null,null,null,null,null,null,null,"Cable Management Arm"]
[null,null,null,null,null,null,null,"No ",null,{"$f":"IF($U$20=\"VxFlex\",\"TS3L4-BZLSTD\",VLOOKUP($H128,TS3L4_ALL,13,))","v":""},{"$f":"IF($U$20=\"VxFlex\",1,VLOOKUP($H128,TS3L4_ALL,7,FALSE))","v":""},null,null,null,null,null,{"$f":"VLOOKUP($H128,TS3L4_ALL,10,FALSE)","v":0},{"$f":"IF($U$20=\"VxFlex\",42,VLOOKUP($H128,TS3L4_ALL,11,FALSE))","v":0},{"$f":"IF($U$20=\"VxFlex\",\"L4N69\",VLOOKUP($H128,TS3L4_ALL,12,FALSE))","v":""}]
[]
[null,null,null,null,null,null,null,"Bezel"]
[null,null,null,null,null,null,null,"No Bezel",null,{"$f":"IF($U$20=\"VxFlex\",\"TS3L4-BZLSTD\",VLOOKUP($H131,TS3L4_ALL,13,))","v":""},{"$f":"IF($U$20=\"VxFlex\",1,VLOOKUP($H131,TS3L4_ALL,7,FALSE))","v":""},null,null,null,null,null,{"$f":"VLOOKUP($H131,TS3L4_ALL,10,FALSE)","v":0},{"$f":"IF($U$20=\"VxFlex\",42,VLOOKUP($H131,TS3L4_ALL,11,FALSE))","v":0},{"$f":"IF($U$20=\"VxFlex\",\"L4N69\",VLOOKUP($H131,TS3L4_ALL,12,FALSE))","v":""}]
[]
[null,null,null,null,null,null,null,"Garanzia"]
[null,null,null,null,null,null,null,"Estensione della manutenzione in garanzia per ulteriori 24 mesi",null,{"$f":"VLOOKUP($H134,TS3L4_WARRANTY,13,FALSE)","v":"TS4L7-OpzEst24"},{"$f":"VLOOKUP($H134,TS3L4_ALL,7,FALSE)","v":1},null,{"$f":"Q134","v":183.01},null,null,null,{"$f":"VLOOKUP($H134,TS3L4_WARRANTY,10,FALSE)","v":183.01},{"$f":"VLOOKUP($H134,TS3L4_WARRANTY,11,FALSE)","v":0},{"$f":"VLOOKUP($H134,TS3L4_ALL,12,FALSE)","v":"L7N29"}]
[]
[null,null,null,null,null,null,null,"Garanzia GPU",null,null,{"$f":"IF(AND(H137=\"Estensione della manutenzione GPU in garanzia per ulteriori 24 mesi\",K134=\"\"),\"Selezionare estensione garanzia 60 Mesi\",\"\")","v":""}]
[null,null,null,null,null,null,null,"Estensione della manutenzione GPU in garanzia per ulteriori 24 mesi",null,{"$f":"IF(K134=\"\",\"\",VLOOKUP($H137,TS4L7_GPUWAR,13,FALSE))","v":"TS4L7-OpzEst24GPU"},{"$f":"IF(K134=\"\",0,IF(S137=\"\",0,U137))","v":2},null,{"$f":"Q137","v":231.08},null,null,null,{"$f":"IF(H20=\"PowerEdge R7525 Server (General Purpose)\",0,IF(K134=\"\",0,VLOOKUP($H137,TS4L7_GPUWAR,10,FALSE)))*K137","v":231.08},{"$f":"VLOOKUP($H137,TS4L7_GPUWAR,11,FALSE)","v":0},{"$f":"IF(H20=\"PowerEdge R7525 Server (General Purpose)\",\"\",VLOOKUP($H137,TS4L7_GPUWAR,12,FALSE))","v":"L7N31"},"L7N15",{"$f":"COUNTIF(TS4L7_1,T137)","v":2}]
[]
[null,null,null,null,null,null,null,"Hard Disk Retention",null,null,{"$f":"IF(AND(H140=\"Hard Disk Retention 60 mesi\",K134=\"\"),\"Selezionare Estensione Garanzia 60 Mesi\",\"\")","v":""}]
[null,null,null,null,null,null,null,"Hard Disk Retention 60 mesi",null,{"$f":"IFERROR(U140,VLOOKUP(H140,TS3L4_ALL,13,FALSE))","v":"TS4L7-HDRTN60"},{"$f":"IF(H140=\"\",\"\",1)","v":1},null,{"$f":"Q140","v":41.81},null,null,null,{"$f":"IFERROR(V140,VLOOKUP(H140,TS3L4_ALL,10,FALSE))","v":41.81},{"$f":"IFERROR(W140,VLOOKUP(H140,TS3L4_ALL,11,FALSE))","v":0},{"$f":"IFERROR(X140,VLOOKUP(H140,TS3L4_ALL,12,FALSE))","v":"L7N28b"},null,{"$f":"IF(K134+K140=2,VLOOKUP(\"Hard Disk Retention 60 mesi\",TS3L4_ALL,13,FALSE),VLOOKUP(H140,TS3L4_ALL,13,FALSE))","v":"TS4L7-HDRTN60"},{"$f":"IF(K134+K140=2,VLOOKUP(\"Hard Disk Retention 60 mesi\",TS3L4_ALL,10,FALSE),VLOOKUP(H140,TS3L4_ALL,10,FALSE))","v":41.81},{"$f":"IF(K134+K140=2,VLOOKUP(\"Hard Disk Retention (60 mesi)\",TS3L4_ALL,11,FALSE),VLOOKUP(H140,TS3L4_ALL,11,FALSE))","v":{"$error":"#N/A"}},{"$f":"IF(K134+K140=2,VLOOKUP(\"Hard Disk Retention 60 mesi\",TS3L4_ALL,12,FALSE),VLOOKUP(H140,TS3L4_ALL,12,FALSE))","v":"L7N28b"}]
[]
[]
[null,null,null,null,null,null,null,"UPS"]
[null,null,null,null,null,null,null,"IO SONO UN UPS",null,{"$f":"VLOOKUP($H144,TS3L4_UPS,13,FALSE)","v":{"$error":"#NAME?"}},{"$f":"VLOOKUP($H144,TS3L4_UPS,7,FALSE)","v":{"$error":"#NAME?"}},null,null,null,null,null,{"$f":"VLOOKUP($H144,TS3L4_UPS,10,FALSE)","v":{"$error":"#NAME?"}},{"$f":"VLOOKUP($H144,TS3L4_UPS,11,FALSE)","v":{"$error":"#NAME?"}},{"$f":"VLOOKUP($H144,TS3L4_ALL,12,FALSE)","v":{"$error":"#N/A"}}]
[]
[null,null,null,null,null,null,null,"Kit Graphical User Interface"]
[null,null,null,null,null,null,null,"",null,{"$f":"VLOOKUP($H147,TS3L4_GUI,13,FALSE)","v":{"$error":"#NAME?"}},{"$f":"VLOOKUP($H147,TS3L4_GUI,7,FALSE)","v":{"$error":"#NAME?"}},null,null,null,null,null,{"$f":"VLOOKUP($H147,TS3L4_GUI,10,FALSE)","v":{"$error":"#NAME?"}},{"$f":"VLOOKUP($H147,TS3L4_GUI,11,FALSE)","v":{"$error":"#NAME?"}},{"$f":"VLOOKUP($H147,TS3L4_ALL,12,FALSE)","v":""}]
[]
[]
[null,null,null,null,null,null,null,null,null,"Configurazione",{"$f":"SUM(Q20:Q140)*K6","v":0}]
[null,null,null,null,null,null,null,null,null,0.2,{"$f":"SUM(R20:R140)*K6","v":0},null,"Quota massima 20 %"]
[null,null,null,null,null,null,null,null,null,"Totale",{"$f":"SUM(K150:K151)","v":0},null,{"$f":"Riepilogo_Ordine!G59","v":0}]
[]
[null,null,null,null,null,null,null,"NOTE"]

{"sheet":"Lotto7_R7525_2","index":1,"n_rows":154,"n_cols":31,"rows_kept":154,"cut":false,"hidden":false,"merged":[[154,7,165,10],[69,8,70,8],[71,12,73,13],[72,8,73,8],[132,8,133,8],[138,8,139,8],[153,7,153,10],[135,8,136,8],[48,7,49,7],[12,8,12,10],[12,11,12,12],[14,8,14,10],[14,11,14,12],[15,8,15,10],[15,11,15,12],[18,8,19,8],[21,8,22,8],[22,12,25,12],[27,8,28,8],[45,8,46,8],[8,8,8,10],[8,11,8,12],[9,8,9,10],[9,11,9,12],[11,8,11,10],[11,11,11,12]]}
[]
[null,null,null,null,null,null,null,"Convenzione \nTecnologie Server 4 - Lotto 7",null,{"$f":"IF(T100>1,\"ERRORE NELLA CONFIGURAZIONE\",\"\")","v":""}]
[null,null,null,null,null,null,null,null,null,null,null,null,"Quota massima 20 %"]
[null,null,null,null,null,null,null,null,null,"Guida alla Convenzione","Totale Singola Configurazione",null,{"$f":"Riepilogo_Ordine!G59","v":0}]
[null,null,null,null,null,null,null,{"$f":"IF($J$23=\"TS4L7-VSAN\",\"vSAN Server Ready\",IF($J$23=\"TS4L7-GPUDW\",\"GPU Double-Wide Server Ready\",IF($J$23=\"TS4L7-GPUSW\",\"GPU Single-Wide Server Ready\",IF(N20=\"VxFlex\",\"PowerFlex Server\",\"\"))))","v":""},null,null,{"$f":"K152","v":0},null,"Totale Ordine \nIva Esclusa"]
[null,null,null,null,null,null,null,"DELL POWEREDGE R7525\nGPU Ready",null,"Quantità Server",0,null,{"$f":"Riepilogo_Ordine!J60","v":0}]
[]
[]
[null,null,null,null,null,null,null,"N° Ordine Consip","Amministrazione",null,null,"Data"]
[]
[]
[null,null,null,null,null,null,null,"Nom. Referente Consegna","Email Consegna",null,null,"Tel."]
[]
[]
[null,null,null,null,null,null,null,"Nom. Referente Installazione","Email Installazione","Tel.",null,"Tel."]
[]
[]
[]
[null,null,null,null,null,null,null,"Base",null,null,null,null,null,null,null,null,null,null,null,null,"PowerEdge R7525 Server (General Purpose)"]
[null,null,null,null,null,null,null,"PowerEdge R7525 Server (GPU Double-Wide Ready)",null,{"$f":"IF($K$6>0,\"TS4L7-SRV\",\"\")","v":""},{"$f":"IF($K$6>0,1,\"\")","v":""},null,{"$f":"Q20","v":4047.7},null,null,null,{"$f":"IF($U$20=\"nVME\",VLOOKUP($H$20,TS3L4_ALL,10,FALSE)*1.04,VLOOKUP($H$20,TS3L4_ALL,10,FALSE))","v":4047.7},null,{"$f":"VLOOKUP($H20,TS3L4_ALL,12,FALSE)","v":"L7N01"},null,{"$f":"IF(H20=ConfigurationTS3L4!A4,\"GPU\",\"\")","v":"GPU"},{"$f":"IF(H20=ConfigurationTS3L4!A11,\"Vsan\",\"\")","v":""},{"$f":"IF(J23=\"TS3L4-GPUSW\",1,IF(J23=\"TS3L4-GPUDW\",1,\"\"))","v":""}]
[]
[null,null,null,null,null,null,null,"Chassis Configuration"]
[null,null,null,null,null,null,null,{"$f":"IF(K32=1,VLOOKUP($H$20,TS3L4_Chassis,3,FALSE),VLOOKUP($H$20,TS3L4_Chassis,2,FALSE))","v":"Chassis with Up to 16 x 2.5 Hard Drives for 2CPU, GPU Double-Wide Configuration"},null,{"$f":"IF($K$32=1,VLOOKUP($H$20,TS3L4_Chassis,8,FALSE),VLOOKUP($H$20,TS3L4_Chassis,9,FALSE))","v":"Kit upgrade chassies for Server GPU Double-Wide Ready"},{"$f":"IF(H20=U19,VLOOKUP($H$20,TS3L4_Chassis,6,FALSE),VLOOKUP($H$20,TS3L4_Chassis,7,FALSE))","v":1},null,{"$f":"IF(J23=\"TS3L4-VSAN\",\"ATTENZIONE SELEZIONARE UNA COMPONENTE PER IL BOOT A SCELTA TRA ''ISDM Module'' \noppure \n''BOSS Controller Card''\",\"\")","v":""},null,null,null,{"$f":"VLOOKUP($H20,TS3L4_Chassis,11,FALSE)","v":0},null,{"$f":"VLOOKUP($H20,TS3L4_Chassis,12,FALSE)","v":"L7N37"},null,"Chassis with Up to 24 x 2.5'' Hard Drives for 2CPU Configuration",1]
[]
[null,null,null,null,null,null,null,"Trusted Platform Module (TPM)"]
[null,null,null,null,null,null,null,"Trusted Platform Module 2.0 V3"]
[]
[null,null,null,null,null,null,null,"Processor"]
[null,null,null,null,null,null,null,"AMD EPYC 7313 3.0GHz, 16C/32T, 128M Cache (155W) DDR4-3200",null,{"$f":"IF(K23=1,VLOOKUP($H$29,TS3L4_CPU8core,13,FALSE),VLOOKUP($H$29,TS3L4_CPU8core,13,FALSE))","v":""},{"$f":"IF(K23=1,VLOOKUP($H$29,TS3L4_CPU8core,7,FALSE),VLOOKUP($H$29,TS3L4_CPU8core,7,FALSE))","v":0},null,null,null,null,null,{"$f":"IF(K23=1,VLOOKUP($H$29,TS3L4_CPU8core,10,FALSE),VLOOKUP($H$29,TS3L4_CPU8core,10,FALSE))","v":0},{"$f":"IF(K23=1,VLOOKUP($H$29,TS3L4_CPU8core,11,FALSE),VLOOKUP($H$29,TS3L4_CPU8core,11,FALSE))","v":0},{"$f":"IF(R29=0,0,VLOOKUP($H29,TS3L4_CPU8core,12,FALSE))","v":0}]
[]
[null,null,null,null,null,null,null,"Additional Processor"]
[null,null,null,null,null,null,null,"AMD EPYC 7313 3.0GHz, 16C/32T, 128M Cache (155W) DDR4-3200",null,{"$f":"IF(K23=1,VLOOKUP($H$29,TS3L4_CPU,13,FALSE),VLOOKUP($H$32,TS3L4_CPU,13,FALSE))","v":"TS4L7-CPU"},{"$f":"IF(K23=1,VLOOKUP($H$29,TS3L4_CPU,7,FALSE),VLOOKUP($H$32,TS3L4_CPU,7,FALSE))","v":1},null,{"$f":"Q32","v":680.84},null,null,null,{"$f":"IF(K23=1,VLOOKUP($H$29,TS3L4_CPU,10,FALSE),VLOOKUP($H$32,TS3L4_CPU,10,FALSE))","v":680.84},{"$f":"IF(K23=1,VLOOKUP($H$29,TS3L4_CPU,11,FALSE),VLOOKUP($H$32,TS3L4_CPU,11,FALSE))","v":0},{"$f":"IF(K23=1,VLOOKUP(H29,TS3L4_ALL,12,FALSE),VLOOKUP($H32,TS3L4_CPU,12,FALSE))","v":"L7N02"},null,{"$f":"IF(K23=1,\"AMD EPYC 7313 3.0GHz, 16C/32T, 128M Cache (155W) DDR4-3200\",H32)","v":"AMD EPYC 7313 3.0GHz, 16C/32T, 128M Cache (155W) DDR4-3200"}]
[null,null,null,null,null,null,null,null,null,null,null,null,null,null,null,null,null,null,{"$f":"IF(J33=\"TS3L4-CPU\",\"L4N02\",0)","v":0},null,{"$f":"VLOOKUP($S$32,Tabella_prezzi!$A$1:$L$382,4,FALSE)","v":680.84},{"$f":"VLOOKUP($S$32,Tabella_prezzi!$A$1:$L$382,7,FALSE)","v":1}]
[null,null,null,null,null,null,null,"Memory Capacity (GB)",null,null,{"$f":"IF(AND(K32=0,H35>512),\"Selezionare Quantità RAM Corretta\",\"\")","v":""}]
[null,null,null,null,null,null,null,256,null,{"$f":"IFERROR(U35,\"TS3L4-RAM64\")","v":"TS4L7-WINSRVSTD"},{"$f":"IFERROR(V35,IF($U$20=\"VxFlex\",5,1))","v":0},null,{"$f":"Q35","v":0},null,null,null,{"$f":"IFERROR(W35,444)","v":0},null,{"$f":"IFERROR(X35,\"L4N04\")","v":"L7N03"},null,{"$f":"IF($K$32=1,VLOOKUP($H$35,ConfigurationTS3L4!A45:M65,13,FALSE),VLOOKUP($H$35,TS3L4_RAM1CPU,13,FALSE))","v":"TS4L7-WINSRVSTD"},{"$f":"IF($K$32=1,VLOOKUP($H$35,ConfigurationTS3L4!A45:M65,7,FALSE),VLOOKUP($H$35,TS3L4_RAM1CPU,7,FALSE))","v":0},{"$f":"IF($K$32=1,VLOOKUP($H$35,ConfigurationTS3L4!A45:M65,10,FALSE),VLOOKUP($H$35,TS3L4_RAM1CPU,10,FALSE))","v":0},{"$f":"IF($K$32=1,VLOOKUP($H$35,ConfigurationTS3L4!A45:M65,12,FALSE),VLOOKUP($H$35,TS3L4_RAM1CPU,12,FALSE))","v":"L7N03"},null,"384GB",{"$f":"IF(U20=\"VxFlex\",0,1)","v":1},{"$f":"IF(U20=\"VxFlex\",VLOOKUP(H35,ConfigurationTS3L4!A69:A72,1,FALSE),\"192GB\")","v":"192GB"},{"$f":"IFERROR(AB35,1)","v":"192GB"},{"$f":"IF(H35=\"256\",1,0)","v":0},{"$f":"AD35*K23","v":0}]
[]
[null,null,null,null,null,null,null,"Operating System STANDARD",null,null,{"$f":"IF(AND(K32=0,K38>3),\"Selezionare Numero Corretto di Licenze\",IF(AND(H38=\"Ubuntu Server 22.04 LTS 64 Bit\",K38>1),\"Selezionare Numero Corretto di Licenze\",\"\"))","v":""}]
[null,null,null,null,null,null,null,"No Operating System",null,{"$f":"VLOOKUP($H$38,TS3L4_OS,13,FALSE)","v":""},null,null,{"$f":"Q38","v":0},null,null,null,{"$f":"VLOOKUP($H$38,TS3L4_OS,10,FALSE)*K38","v":0},{"$f":"VLOOKUP($H$38,TS3L4_OS,11,FALSE)","v":0},{"$f":"VLOOKUP($H38,TS3L4_ALL,12,FALSE)","v":""}]
[null,null,null,null,null,null,null,"Windows Server 2022 Standard Edition, Add License,2CORE",null,{"$f":"VLOOKUP($H$39,TS3L4_OS,13,FALSE)","v":"TS4L7-WINSRV2C"},null,null,{"$f":"Q39","v":0},null,null,null,{"$f":"VLOOKUP($H$39,TS3L4_OS,10,FALSE)*K39","v":0},{"$f":"VLOOKUP($H$38,TS3L4_OS,11,FALSE)","v":0},{"$f":"VLOOKUP($H39,TS3L4_ALL,12,FALSE)","v":"L7N26"}]
[]
[]
[null,null,null,null,null,null,null,"Operating System Device CAL / User CAL"]
[null,null,null,null,null,null,null,"1-pack of Windows Server 2022/2019 Device CALs (STD or DC)",null,{"$f":"VLOOKUP($H$43,ConfigurationTS3L4!A79:W80,13,FALSE)","v":"TS4L7-WINDEVCAL"},null,null,{"$f":"Q43","v":0},null,null,null,{"$f":"VLOOKUP($H$43,ConfigurationTS3L4!A79:N80,10,FALSE)*K43","v":0},{"$f":"VLOOKUP($H$38,TS3L4_OS,11,FALSE)","v":0},{"$f":"VLOOKUP($H43,TS3L4_ALL,12,FALSE)","v":"L7N24"}]
[null,null,null,null,null,null,null,"1-pack of Windows Server 2022/2019 User CALs (STD or DC)",null,{"$f":"VLOOKUP($H$44,ConfigurationTS3L4!A80:W81,13,FALSE)","v":"TS4L7-WINUSRCAL"},null,null,{"$f":"Q44","v":0},null,null,null,{"$f":"VLOOKUP($H$44,ConfigurationTS3L4!A80:N81,10,FALSE)*K44","v":0},{"$f":"VLOOKUP($H$38,TS3L4_OS,11,FALSE)","v":0},{"$f":"VLOOKUP($H44,TS3L4_ALL,12,FALSE)","v":"L7N25"}]
[]
[null,null,null,null,null,null,null,"Disk Controller"]
[null,null,null,null,null,{"$f":"IF($J$23=\"TS3L4-VSAN\",\"vSAN HCL\",\"\")","v":""},null,"PERC H745 Controller",null,{"$f":"IF(H23=\"Chassis with Up to 24 x 2.5'' Hard Drives for 2CPU Configuration\",\"TS3L4-HBA335i-L\",IF(U20=\"VxFlex\",\"TS3L4-HBA355i-L\",VLOOKUP($H47,TS3L4_CRTL,13,FALSE)))","v":0},{"$f":"IF(H23=\"Chassis with Up to 24 x 2.5'' Hard Drives for 2CPU Configuration\",\"1\",IF(U20=\"VxFlex\",\"1\",VLOOKUP($H47,TS3L4_CRTL,7,FALSE)))","v":""},null,null,null,null,null,{"$f":"IF(H47=ConfigurationTS3L4!A48,0,VLOOKUP($H47,TS3L4_CRTL,10,FALSE))","v":0},{"$f":"IF(H23=\"Chassis with Up to 24 x 2.5'' Hard Drives for 2CPU Configuration\",180,IF(U20=\"VxFlex\",180,IF(M5=\"\",0,VLOOKUP($H47,TS3L4_CRTL,11,FALSE))))","v":0},{"$f":"IF(H23=\"Chassis with Up to 24 x 2.5'' Hard Drives for 2CPU Configuration\",\"L4N34\",IF(U20=\"VxFlex\",\"L4N34\",IF(M5=\"\",\"\",VLOOKUP($H47,TS3L4_ALL,12,FALSE))))","v":"L7N44"},null,{"$f":"IF(J47=\"TS3L4-HBA330-L\",1,0)","v":0},{"$f":"IF(H47=\"PERC H740P RAID Controller, 8GB NV Cache\",1,0)","v":0},{"$f":"IF(X47=1,X47*U47,V47*U47)","v":0},{"$f":"IF(M5=\"\",1,0)","v":0}]
[]
[null,null,null,null,null,null,null,"Hard Drivers Bays n° 16 - 2 bay occupate dai dischi 960GB SSD di base",null,"Usati","Disponibili",null,null,null,null,null,null,null,null,{"$f":"IF(H23=\"Chassis with Up to 24 x 2.5'' Hard Drives for 2CPU Configuration\",ConfigurationTS3L4!$A$126,IF($M$5=\"\",ConfigurationTS3L4!$A$125,ConfigurationTS3L4!$A$125:$A$126))","v":{"$error":"#VALUE!"}}]
[null,null,null,null,null,null,null,null,null,{"$f":"K52+K54+K56+K62+K64+K58+K60","v":2},{"$f":"16-J50","v":14}]
[]
[null,null,null,null,null,{"$f":"IF($J$23=\"TS3L4-VSAN\",\"vSAN HCL\",\"\")","v":""},null,{"$f":"ConfigurationTS3L4!A86","v":"2.4TB 10k SAS ISE 12Gbps"},null,{"$f":"VLOOKUP($H52,TS3L4_HDD,13,FALSE)","v":"TS4L7-HDD2TB"},null,null,{"$f":"Q52","v":0},null,null,null,{"$f":"VLOOKUP($H52,TS3L4_HDD,10,FALSE)*K52","v":0},{"$f":"VLOOKUP($H52,TS3L4_HDD,11,FALSE)","v":0},{"$f":"VLOOKUP($H52,TS3L4_ALL,12,FALSE)","v":"L7N12"}]
[]
[null,null,null,null,null,{"$f":"IF($J$23=\"TS3L4-VSAN\",\"vSAN HCL\",\"\")","v":""},null,{"$f":"ConfigurationTS3L4!A87","v":"1.2TB 10K RPM SAS ISE 12Gbps"},null,{"$f":"VLOOKUP($H54,TS3L4_HDD,13,FALSE)","v":"TS4L7-HDD1TB"},null,null,{"$f":"Q54","v":0},null,null,null,{"$f":"VLOOKUP($H54,TS3L4_HDD,10,FALSE)*K54","v":0},{"$f":"VLOOKUP($H54,TS3L4_HDD,11,FALSE)","v":0},{"$f":"VLOOKUP($H54,TS3L4_ALL,12,FALSE)","v":"L7N13"}]
[]
[null,null,null,null,null,{"$f":"IF($J$23=\"TS3L4-VSAN\",\"vSAN HCL\",\"\")","v":""},null,{"$f":"ConfigurationTS3L4!A88","v":"3.84TB SSD SAS ISE RI 12Gbps"},null,{"$f":"VLOOKUP($H56,TS3L4_HDD,13,FALSE)","v":"TS4L7-SSD-RI3,8TB"},null,null,{"$f":"Q56","v":0},null,null,null,{"$f":"VLOOKUP($H56,TS3L4_HDD,10,FALSE)*K56","v":0},{"$f":"VLOOKUP($H56,TS3L4_HDD,11,FALSE)","v":0},{"$f":"VLOOKUP($H56,TS3L4_ALL,12,FALSE)","v":"L7N14"}]
[]
[null,null,null,null,null,{"$f":"IF($J$23=\"TS3L4-VSAN\",\"vSAN HCL\",\"\")","v":""},null,{"$f":"ConfigurationTS3L4!A89","v":"1.92TB SSD SAS ISE RI 12Gbps"},null,{"$f":"VLOOKUP($H58,TS3L4_HDD,13,FALSE)","v":"TS4L7-SSD-RI1,6TB"},null,null,{"$f":"Q58","v":0},null,null,null,{"$f":"IF(K58>2,(VLOOKUP($H58,TS3L4_HDD,10,FALSE)*(K58-2)),0)","v":0},{"$f":"VLOOKUP($H58,TS3L4_HDD,11,FALSE)","v":0},{"$f":"VLOOKUP($H58,TS3L4_ALL,12,FALSE)","v":"L7N16"}]
[]
[null,null,null,null,null,{"$f":"IF($J$23=\"TS3L4-VSAN\",\"vSAN HCL\",\"\")","v":""},null,{"$f":"ConfigurationTS3L4!A90","v":"1.6TB SSD SAS ISE MU 12Gbp"},null,{"$f":"VLOOKUP($H60,TS3L4_HDD,13,FALSE)","v":"TS4L7-SSD-MU1,6TB"},null,null,{"$f":"Q60","v":0},null,null,null,{"$f":"VLOOKUP($H60,TS3L4_HDD,10,FALSE)*K60","v":0},{"$f":"VLOOKUP($H60,TS3L4_HDD,11,FALSE)","v":0},{"$f":"VLOOKUP($H60,TS3L4_ALL,12,FALSE)","v":"L7N17"}]
[]
[null,null,null,null,null,{"$f":"IF($J$23=\"TS3L4-VSAN\",\"vSAN HCL\",\"\")","v":""},null,{"$f":"ConfigurationTS3L4!A91","v":"960GB SSD SAS ISE RI 12Gbps"},null,{"$f":"VLOOKUP($H62,TS3L4_HDD,13,FALSE)","v":"TS4L7-SSD-RI800GB"},2,null,{"$f":"Q62","v":0},null,null,null,{"$f":"IF(K62>2,(VLOOKUP($H62,TS3L4_HDD,10,FALSE)*(K62-2)),0)","v":0},{"$f":"VLOOKUP($H62,TS3L4_HDD,11,FALSE)*K62","v":0},{"$f":"VLOOKUP($H62,TS3L4_ALL,12,FALSE)","v":"L7N18"}]
[]
[null,null,null,null,null,{"$f":"IF($J$23=\"TS3L4-VSAN\",\"vSAN HCL\",\"\")","v":""},null,{"$f":"ConfigurationTS3L4!A92","v":"800GB SSD SAS ISE Mix Use 12Gbps"},null,{"$f":"VLOOKUP($H64,TS3L4_HDD,13,FALSE)","v":"TS4L7-SSD-MU800GB"},null,null,{"$f":"Q64","v":0},null,null,null,{"$f":"VLOOKUP($H64,TS3L4_HDD,10,FALSE)*K64","v":0},{"$f":"VLOOKUP($H64,TS3L4_HDD,11,FALSE)*K64","v":0},{"$f":"VLOOKUP($H64,TS3L4_ALL,12,FALSE)","v":"L7N19"}]
[]
[null,null,null,null,null,null,null,"BOSS controller card"]
[null,null,null,null,null,null,null,"No Boss card",null,{"$f":"IF(R67>0,VLOOKUP($H67,TS3L4_ISDM,13,FALSE),\"\")","v":""},{"$f":"VLOOKUP($H67,TS3L4_ISDM,7,FALSE)","v":""},null,null,null,null,null,{"$f":"VLOOKUP($H67,TS3L4_ISDM,10,FALSE)","v":0},{"$f":"VLOOKUP($H67,TS3L4_ISDM,11,FALSE)","v":0},{"$f":"VLOOKUP($H67,TS3L4_ALL,12,FALSE)","v":""}]
[]
[]
[null,null,null,null,null,{"$f":"IF(M70=\"\",\"\",T71)","v":""},null,"Power Supply",{"$f":"IF(M70=\"\",\"\",T71)","v":""}]
[null,null,null,null,null,null,null,{"$f":"ConfigurationTS3L4!A101","v":"Dual, Hot-Plug, Power Supply 2400W Redundant, D"},null,{"$f":"VLOOKUP($H71,TS3L4_PSU,13,FALSE)","v":"TS4L7-PSU2400W"},{"$f":"VLOOKUP($H71,TS3L4_PSU,7,FALSE)","v":1},null,null,null,null,null,{"$f":"VLOOKUP($H71,TS3L4_PSU,10,FALSE)","v":0},{"$f":"VLOOKUP($H71,TS3L4_PSU,11,FALSE)","v":0},{"$f":"VLOOKUP($H71,TS3L4_ALL,12,FALSE)","v":"L7N49"},"⚠",{"$f":"IF(M70=\"\",ConfigurationTS3L4!A565,ConfigurationTS3L4!A566)","v":"_C14C13"}]
[]
[null,null,null,null,null,null,null,"Embedded Systems Management"]
[null,null,null,null,null,null,null,"iDRAC9,Enterprise"]
[]
[]
[null,null,null,null,null,null,null,null,null,null,null,null,null,null,null,null,null,null,null,{"$f":"IF($J$23=\"TS3L4-GPUDW\",\"1\",IF($J$23=\"TS3L4-GPUSW\",\"20\",IF($K$32=1,\"300\",\"4000\")))","v":"300"},{"$f":"IF($J$23=\"TS3L4-GPUDW\",\"DW\",IF($J$23=\"TS3L4-GPUSW\",\"SW\",IF($J$23=\"TS3L4-PWRFLEX\",\"PX\",IF($K$32=1,\"2CPU\",\"1CPU\"))))","v":"2CPU"}]
[null,null,null,null,null,null,null,"PCI Slot 1 Processor 1 x8 PCIe Gen4 for HL/FH",null,null,null,null,null,null,null,null,null,null,null,null,{"$f":"IF(U77=\"DW\",\"DW\",IF(U77=\"SW\",\"SW\",0))","v":0},"Selected","1CPU","2CPU","PX","DW","SW"]
[null,null,null,null,null,null,null,"",null,{"$f":"IF($U$20=\"VxFlex\",\"TS3L4-MCX4DP\",VLOOKUP($H79,TS3L4_ALL,13,))","v":""},{"$f":"IF($U$20=\"VxFlex\",1,VLOOKUP($H79,TS3L4_ALL,7,FALSE))","v":""},null,{"$f":"Q79","v":0},null,null,null,{"$f":"VLOOKUP($H79,TS3L4_ALL,10,FALSE)","v":0},{"$f":"IF($U$20=\"VxFlex\",419,VLOOKUP($H79,TS3L4_ALL,11,FALSE))","v":0},{"$f":"IF($U$20=\"VxFlex\",\"L4N94\",VLOOKUP($H79,TS3L4_ALL,12,FALSE))","v":""},null,{"$f":"IF(S79=\"L4N56\",\"DW\",IF(S79=\"L4N57\",\"DW\",IF(S79=\"L4N58\",\"DW\",IF(S79=\"L4N55\",\"SW\",\"CPU\"))))","v":"CPU"},{"$f":"HLOOKUP($N$77,$R$78:$V$101,2,FALSE)","v":"CPU"},"TS3L2_PCI_A","TS3L2_PCI_A","TS3L2_PCI_A","TS3L2_PCI_A","TS3L2_PCI_A",null,"PCI-1",{"$f":"IF($U$77=\"SW\",ConfigurationTS3L4!$A$329:$A$348,IF($U$77=\"DW\",ConfigurationTS3L4!$A$278:$A$301,ConfigurationTS3L4!$A$198:$A$220))","v":{"$error":"#VALUE!"}}]
[null,null,null,null,null,null,null,null,null,null,null,null,{"$f":"IF(S79=\"L4N33\",IF($T$100>1,\"ERRORE: SOLO UNA BOSS CARD PUO' ESSERE CONFIGURATA\",\"\"),\"\")","v":""},null,null,null,null,null,null,null,null,{"$f":"HLOOKUP($N$77,$R$78:$V$101,3,FALSE)","v":0},{"$f":"VLOOKUP(H79,TS3L4_PCI_A,12,FALSE)","v":""},{"$f":"VLOOKUP(H79,TS3L4_PCI_A,12,FALSE)","v":""},{"$f":"VLOOKUP(H79,TS3L4_PCI_A,12,FALSE)","v":""},{"$f":"VLOOKUP(H79,TS3L4_PCI_A,12,FALSE)","v":""},{"$f":"VLOOKUP(H79,TS3L4_PCI_A,12,FALSE)","v":""}]
[null,null,null,null,null,null,null,"PCI Slot 2 Processor 1 x16 PCIe Gen4 for DW/FH"]
[null,null,null,null,null,null,null,"AMD MI100,300W PCIe, 32GB Passive, Double Wide, GPU",null,{"$f":"VLOOKUP($H82,TS3L4_ALL,13,FALSE)","v":"TS4L7-GPU"},{"$f":"IF(H20=\"PowerEdge R7525 Server (General Purpose)\",\"\",VLOOKUP($H82,TS3L4_ALL,7,FALSE))","v":1},null,{"$f":"Q82","v":6264.37},null,null,null,{"$f":"VLOOKUP($H82,TS3L4_ALL,10,FALSE)","v":6264.37},{"$f":"VLOOKUP($H82,TS3L4_ALL,11,FALSE)","v":0},{"$f":"VLOOKUP($H82,TS3L4_ALL,12,FALSE)","v":"L7N15"},{"$f":"IF(K82=\"\",\"OK\",IF(U82+K82=2,\"Errore\",\"OK\"))","v":"OK"},{"$f":"IF(U79=\"dw\",1,0)","v":0},{"$f":"HLOOKUP($N$77,$R$78:$V$101,5,FALSE)","v":0},"TS3L2_PCI_A","TS3L2_PCI_A","TS3L2_PCI_A","TS3L2_PCI_A","TS3L2_PCI_A",null,"PCI-2"]
[null,null,null,null,null,null,null,null,null,null,null,null,null,null,null,null,null,null,null,null,null,{"$f":"HLOOKUP($N$77,$R$78:$V$101,6,FALSE)","v":0},{"$f":"VLOOKUP(H82,TS3L4_PCI_A,12,FALSE)","v":{"$error":"#N/A"}},{"$f":"VLOOKUP(H82,TS3L4_PCI_A,12,FALSE)","v":{"$error":"#N/A"}},{"$f":"VLOOKUP(H82,TS3L4_PCI_A,12,FALSE)","v":{"$error":"#N/A"}},{"$f":"VLOOKUP(H82,TS3L4_PCI_A,12,FALSE)","v":{"$error":"#N/A"}},{"$f":"VLOOKUP(H82,TS3L4_PCI_A,12,FALSE)","v":{"$error":"#N/A"}}]
[null,null,null,null,null,null,null,"PCI Slot 3 Processor 1 x16 PCIe Gen4 for HL/LP"]
[null,null,null,null,null,null,null,"",null,{"$f":"VLOOKUP($H85,TS3L4_ALL,13,FALSE)","v":""},{"$f":"VLOOKUP($H85,TS3L4_ALL,7,FALSE)","v":""},null,{"$f":"Q85","v":0},null,null,null,{"$f":"IF($U$20=\"VxFlex\",748,VLOOKUP($H85,TS3L4_ALL,11,FALSE))","v":0},{"$f":"VLOOKUP($H85,TS3L4_ALL,11,FALSE)","v":0},{"$f":"IF($U$20=\"VxFlex\",\"L4N33\",VLOOKUP($H85,TS3L4_ALL,12,FALSE))","v":""},null,null,{"$f":"HLOOKUP($N$77,$R$78:$V$101,8,FALSE)","v":0},"TS3L2_PCI_A","TS3L2_PCI_A","TS3L2_PCI_A","TS3L2_PCI_A","TS3L2_PCI_A",null,"PCI-3"]
[null,null,null,null,null,null,null,null,null,null,null,null,null,null,null,null,null,null,null,null,null,{"$f":"HLOOKUP($N$77,$R$78:$V$101,9,FALSE)","v":0},{"$f":"VLOOKUP(H85,TS3L4_PCI_A,12,FALSE)","v":""},{"$f":"VLOOKUP(H85,TS3L4_PCI_A,12,FALSE)","v":""},{"$f":"VLOOKUP(H85,TS3L4_PCI_A,12,FALSE)","v":""},{"$f":"VLOOKUP(H85,TS3L4_PCI_A,12,FALSE)","v":""},{"$f":"VLOOKUP(H85,TS3L4_PCI_A,12,FALSE)","v":""}]
[null,null,null,null,null,null,null,"PCI Slot 4 Processor 2 x8 PCIe Gen4 for HL/FH",{"$f":"IF($U$77=\"SW\",\"GPU Slot\",IF($U$77=\"DW\",\"GPU Slot\",\"\"))","v":""}]
[null,null,null,null,null,null,null,"",null,{"$f":"VLOOKUP($H88,TS3L4_ALL,13,FALSE)","v":""},{"$f":"VLOOKUP($H88,TS3L4_ALL,7,FALSE)","v":""},null,{"$f":"Q88","v":0},null,null,null,{"$f":"VLOOKUP($H88,TS3L4_ALL,10,FALSE)","v":0},{"$f":"VLOOKUP($H88,TS3L4_ALL,11,FALSE)","v":0},{"$f":"VLOOKUP($H88,TS3L4_ALL,12,FALSE)","v":""},null,{"$f":"IF(S88=\"L4N56\",\"DW\",IF(S88=\"L4N57\",\"DW\",IF(S88=\"L4N108\",\"DW\",IF(S88=\"L4N55\",\"SW\",1))))","v":1},{"$f":"HLOOKUP($N$77,$R$78:$V$101,11,FALSE)","v":1},"-","TS3L2_PCI_B","TS3L2_PCI_I","TS3L2_PCI_F","TS3L2_PCI_H",null,"PCI-4"]
[null,null,null,null,null,null,null,null,null,null,null,null,{"$f":"IF(S88=\"L4N33\",IF($T$100>1,\"ERRORE: SOLO UNA BOSS CARD PUO' ESSERE CONFIGURATA\",\"\"),\"\")","v":""},null,null,null,null,null,null,null,null,{"$f":"HLOOKUP($N$77,$R$78:$V$101,12,FALSE)","v":0},{"$f":"VLOOKUP(H88,TS3L4_PCI_A,12,FALSE)","v":""},{"$f":"VLOOKUP(H88,TS3L4_PCI_B,12,FALSE)","v":""},{"$f":"VLOOKUP(H88,TS3L4_PCI_I,12,FALSE)","v":""},{"$f":"VLOOKUP(H88,TS3L4_PCI_F,12,FALSE)","v":""},{"$f":"VLOOKUP(H88,TS3L4_PCI_H,12,FALSE)","v":""}]
[null,null,null,null,null,null,null,"PCI Slot 5 Processor 2 x16 PCIe Gen4 for DW/FH"]
[null,null,null,null,null,null,null,"AMD MI100,300W PCIe, 32GB Passive, Double Wide, GPU",null,{"$f":"VLOOKUP($H91,TS3L4_ALL,13,FALSE)","v":"TS4L7-GPU"},{"$f":"IF(H20=\"PowerEdge R7525 Server (General Purpose)\",\"\",VLOOKUP($H91,TS3L4_ALL,7,FALSE))","v":1},null,{"$f":"Q91","v":6264.37},null,null,null,{"$f":"VLOOKUP($H91,TS3L4_ALL,10,FALSE)","v":6264.37},{"$f":"VLOOKUP($H91,TS3L4_ALL,11,FALSE)","v":0},{"$f":"VLOOKUP($H91,TS3L4_ALL,12,FALSE)","v":"L7N15"},{"$f":"IF(K91=\"\",\"OK\",IF(U91+K91=2,\"Errore\",\"OK\"))","v":"OK"},{"$f":"IF(U88=\"dw\",1,0)","v":0},{"$f":"HLOOKUP($N$77,$R$78:$V$101,14,FALSE)","v":0},"-","TS3L2_PCI_A","TS3L2_PCI_I","TS3L2_PCI_A","TS3L2_PCI_L",null,"PCI-5"]
[null,null,null,null,null,null,null,null,null,null,null,null,null,null,null,null,null,null,null,null,null,{"$f":"HLOOKUP($N$77,$R$78:$V$101,15,FALSE)","v":0},{"$f":"VLOOKUP(H91,TS3L4_PCI_A,12,FALSE)","v":{"$error":"#N/A"}},{"$f":"VLOOKUP(H91,TS3L4_PCI_A,12,FALSE)","v":{"$error":"#N/A"}},{"$f":"VLOOKUP(H91,TS3L4_PCI_I,12,FALSE)","v":{"$error":"#N/A"}},{"$f":"VLOOKUP(H91,TS3L4_PCI_A,12,FALSE)","v":{"$error":"#N/A"}},{"$f":"VLOOKUP(H91,TS3L4_PCI_L,12,FALSE)","v":{"$error":"#N/A"}}]
[null,null,null,null,null,null,null,"PCI Slot 6 Processor 2 x16 PCIe Gen4 for HL/LP"]
[null,null,null,null,null,null,null,"",null,{"$f":"VLOOKUP($H94,TS3L4_ALL,13,FALSE)","v":""},{"$f":"IF($U$20=\"VxFlex\",1,VLOOKUP($H94,TS3L4_ALL,7,FALSE))","v":""},null,{"$f":"Q94","v":0},null,null,null,{"$f":"IF($U$20=\"VxFlex\",419,VLOOKUP($H94,TS3L4_ALL,11,FALSE))","v":0},null,{"$f":"VLOOKUP($H94,TS3L4_ALL,12,FALSE)","v":""},null,null,{"$f":"HLOOKUP($N$77,$R$78:$V$101,17,FALSE)","v":0},"TS3L2_PCI_C","TS3L2_PCI_C","TS3L2_PCI_C","TS3L2_PCI_C","TS3L2_PCI_C",null,"PCI-6"]
[null,null,null,null,null,null,null,null,null,null,null,null,null,null,null,null,null,null,null,null,null,{"$f":"HLOOKUP($N$77,$R$78:$V$101,18,FALSE)","v":0},{"$f":"VLOOKUP(H94,TS3L4_PCI_C,12,FALSE)","v":""},{"$f":"VLOOKUP(H94,TS3L4_PCI_C,12,FALSE)","v":""},{"$f":"VLOOKUP(H94,TS3L4_PCI_C,12,FALSE)","v":""},{"$f":"VLOOKUP(H94,TS3L4_PCI_C,12,FALSE)","v":""},{"$f":"VLOOKUP(H94,TS3L4_PCI_C,12,FALSE)","v":""}]
[null,null,null,null,null,null,null,"PCI Slot 7 Processor 2 x16 PCIe Gen4 for DW/FH"]
[null,null,null,null,null,null,null,"",null,{"$f":"VLOOKUP($H97,TS3L4_ALL,13,FALSE)","v":""},{"$f":"IF(H20=\"PowerEdge R7525 Server (General Purpose)\",\"\",VLOOKUP($H97,TS3L4_ALL,7,FALSE))","v":""},null,{"$f":"Q97","v":0},null,null,null,{"$f":"VLOOKUP($H97,TS3L4_ALL,10,FALSE)","v":0},{"$f":"VLOOKUP($H97,TS3L4_ALL,11,FALSE)","v":0},{"$f":"VLOOKUP($H97,TS3L4_ALL,12,FALSE)","v":""},{"$f":"IF(K97=\"\",\"OK\",IF(U97+K97=2,\"Errore\",\"OK\"))","v":"OK"},{"$f":"IF(U100=\"dw\",1,0)","v":0},{"$f":"HLOOKUP($N$77,$R$78:$V$101,20,FALSE)","v":0},"-","TS3L2_PCI_A","TS3L2_PCI_I","TS3L2_PCI_A","TS3L2_PCI_L",null,"PCI-7"]
[null,null,null,null,null,null,null,null,null,null,null,null,{"$f":"IF(S97=\"L4N33\",IF($T$100>1,\"ERRORE: SOLO UNA BOSS CARD PUO' ESSERE CONFIGURATA\",\"\"),\"\")","v":""},null,null,null,null,null,null,null,null,{"$f":"HLOOKUP($N$77,$R$78:$V$101,21,FALSE)","v":0},{"$f":"VLOOKUP(H97,TS3L4_PCI_A,12,FALSE)","v":""},{"$f":"VLOOKUP(H97,TS3L4_PCI_A,12,FALSE)","v":""},{"$f":"VLOOKUP(H97,TS3L4_PCI_I,12,FALSE)","v":""},{"$f":"VLOOKUP(H97,TS3L4_PCI_A,12,FALSE)","v":""},{"$f":"VLOOKUP(H97,TS3L4_PCI_L,12,FALSE)","v":""}]
[null,null,null,null,null,null,null,"PCI Slot 9 Processor 1 x16  ",null,null,null,null,null,null,null,null,null,null,null,"boss card"]
[null,null,null,null,null,null,null,"",null,{"$f":"VLOOKUP($H100,TS3L4_ALL,13,FALSE)","v":""},{"$f":"VLOOKUP($H100,TS3L4_ALL,7,FALSE)","v":""},null,{"$f":"Q100","v":0},null,null,null,{"$f":"VLOOKUP($H100,TS3L4_ALL,10,FALSE)","v":0},{"$f":"VLOOKUP($H100,TS3L4_ALL,11,FALSE)","v":0},{"$f":"VLOOKUP($H100,TS3L4_ALL,12,FALSE)","v":""},{"$f":"COUNTIF(S79:S100,\"L4N33\")","v":0},{"$f":"IF(S100=\"L4N56\",\"DW\",IF(S100=\"L4N57\",\"DW\",IF(S100=\"L4N108\",\"DW\",IF(S100=\"L4N55\",\"SW\",1))))","v":1},{"$f":"HLOOKUP($N$77,$R$78:$V$101,23,FALSE)","v":1},"-","TS3L2_PCI_D","TS3L2_PCI_I","TS3L2_PCI_E","TS3L2_PCI_G",null,"PCI-8"]
[null,null,null,null,null,null,null,null,null,null,null,null,{"$f":"IF(S100=\"L4N33\",IF($T$100>1,\"ERRORE: SOLO UNA BOSS CARD PUO' ESSERE CONFIGURATA\",\"\"),\"\")","v":""},null,null,null,null,null,null,null,null,{"$f":"HLOOKUP($N$77,$R$78:$V$101,24,FALSE)","v":0},{"$f":"VLOOKUP(H100,TS3L4_PCI_A,12,FALSE)","v":""},{"$f":"VLOOKUP(H100,TS3L4_PCI_D,12,FALSE)","v":""},{"$f":"VLOOKUP(H100,TS3L4_PCI_I,12,FALSE)","v":""},{"$f":"VLOOKUP(H100,TS3L4_PCI_E,12,FALSE)","v":""},{"$f":"VLOOKUP(H100,TS3L4_PCI_G,12,FALSE)","v":""}]
[null,null,null,null,null,null,null,"SFP+ Transceivers"]
[null,null,null,null,null,null,null,"Transceiver, SFP+ SR Optic for SFP+ ports (Intel X710)",null,{"$f":"IF(R103>0,VLOOKUP($H103,ConfigurationTS3L4!$A$1:$M$4870,13,FALSE),\"\")","v":""},null,null,null,null,null,null,0,{"$f":"IF(K103>0,VLOOKUP($H103,TS3L4_ALL,11,FALSE)*(K103),0)","v":0},{"$f":"IF(K103>0,VLOOKUP($H103,TS3L4_ALL,12,FALSE),0)","v":0}]
[]
[null,null,null,null,null,null,null,"SFP+ Direct Attach Cables (Twinax)"]
[null,null,null,null,null,null,null,"Cable, SFP+ to SFP+, 10GbE, Copper Twinax Direct Attach Cable, 3 Meter",null,{"$f":"IF(R106>0,VLOOKUP($H106,ConfigurationTS3L4!$A$1:$M$4870,13,FALSE),\"\")","v":""},null,null,null,null,null,null,0,{"$f":"IF(K106>0,VLOOKUP($H106,TS3L4_ALL,11,FALSE)*K106,0)","v":0},{"$f":"IF(K106>0,VLOOKUP($H106,TS3L4_ALL,12,FALSE),0)","v":0}]
[]
[null,null,null,null,null,null,null,"QSFP28 Transceivers"]
[null,null,null,null,null,null,null,"Dell EMC PowerEdge QSFP28 SR4 100GbE 85C optic",null,{"$f":"IF(R109>0,VLOOKUP($H109,ConfigurationTS3L4!$A$1:$M$4870,13,FALSE),\"\")","v":""},null,null,null,null,null,null,0,{"$f":"IF(K109>0,VLOOKUP($H109,TS3L4_ALL,11,FALSE)*K109,0)","v":0},{"$f":"IF(K109>0,VLOOKUP($H109,TS3L4_ALL,12,FALSE),0)","v":0}]
[]
[null,null,null,null,null,null,null,"Mellanox LinkX 100Gb/s Passive Copper Cables"]
[null,null,null,null,null,null,null,"Mellanox LinkX 100Gb/s Passive Copper Cables - attacco cavo diretto - 3 m - nero",null,{"$f":"IF(R112>0,VLOOKUP($H112,ConfigurationTS3L4!$A$1:$M$4870,13,FALSE),\"\")","v":""},null,null,null,null,null,null,0,{"$f":"IF(K112>0,VLOOKUP($H112,TS3L4_ALL,11,FALSE)*K112,0)","v":0},{"$f":"IF(K112>0,VLOOKUP($H112,TS3L4_ALL,12,FALSE),0)","v":0}]
[]
[null,null,null,null,null,null,null,"Mellanox LinkX 100Gb/s VCSEL-Based Active Optical Cables - cavo InfiniBand - 10 m",null,{"$f":"IF(R114>0,VLOOKUP($H114,ConfigurationTS3L4!$A$1:$M$4870,13,FALSE),\"\")","v":""},null,null,null,null,null,null,0,{"$f":"IF(K114>0,VLOOKUP($H114,TS3L4_ALL,11,FALSE)*K114,0)","v":0},{"$f":"IF(K114>0,VLOOKUP($H114,TS3L4_ALL,12,FALSE),0)","v":0}]
[]
[null,null,null,null,null,null,null,"Cavi RJ45"]
[null,null,null,null,null,null,null,"Cavo “patch” di 3 mt RJ45 certificato per gigabit ethernet",null,{"$f":"IF(R117>0,VLOOKUP($H117,ConfigurationTS3L4!$A$1:$M$4870,13,FALSE),\"\")","v":""},null,null,null,null,null,null,0,{"$f":"IF(K117>0,VLOOKUP($H117,TS3L4_ALL,11,FALSE)*(K117),0)","v":0},{"$f":"IF(K117>0,VLOOKUP($H117,TS3L4_ALL,12,FALSE),0)","v":0}]
[]
[null,null,null,null,null,null,null,"Cavi LC-LC"]
[null,null,null,null,null,null,null,"Dell Networking Cable, OM4 LC/LC Fiber Cable, 3 Meter",null,{"$f":"IF(R120>0,VLOOKUP($H120,ConfigurationTS3L4!$A$1:$M$4870,13,FALSE),\"\")","v":""},null,null,null,null,null,null,0,{"$f":"IF(K120>0,VLOOKUP($H120,TS3L4_ALL,11,FALSE)*(K120),0)","v":0},{"$f":"IF(K120>0,VLOOKUP($H120,TS3L4_ALL,12,FALSE),0)","v":0}]
[]
[null,null,null,null,null,null,null,"Cavi DAC"]
[null,null,null,null,null,null,null,"Dell Networking, Cable, SFP+ to SFP+, 10GbE, Copper Twinax Direct Attach Cable, 3 Meter",null,{"$f":"IF(R123>0,VLOOKUP($H123,ConfigurationTS3L4!$A$1:$M$4870,13,FALSE),\"\")","v":""},null,null,null,null,null,null,0,{"$f":"IF(K123>0,VLOOKUP($H123,TS3L4_ALL,11,FALSE)*(K123),0)","v":0},{"$f":"IF(K123>0,VLOOKUP($H123,TS3L4_ALL,12,FALSE),0)","v":0}]
[null,null,null,null,null,null,null,"Mellanox LinkX 100Gb/s Passive Copper DAC 3m per scheda TS3L4-CONX6DP",null,{"$f":"IF(R124>0,VLOOKUP($H124,ConfigurationTS3L4!$A$1:$M$4870,13,FALSE),\"\")","v":""},null,null,null,null,null,null,0,{"$f":"IF(K124>0,VLOOKUP($H124,TS3L4_ALL,11,FALSE)*(K124),0)","v":0},{"$f":"IF(K124>0,VLOOKUP($H124,TS3L4_ALL,12,FALSE),0)","v":0}]
[null,null,null,null,null,null,null,"Dell Cable SFP28 to SFP28 25GbE Passive Copper Twinax Direct Attach Cable 3 Meter ",null,{"$f":"IF(R125>0,VLOOKUP($H125,ConfigurationTS3L4!$A$1:$M$4870,13,FALSE),\"\")","v":""},null,null,null,null,null,null,0,{"$f":"IF(K125>0,VLOOKUP($H125,TS3L4_ALL,11,FALSE)*(K125),0)","v":0},{"$f":"IF(K125>0,VLOOKUP($H125,TS3L4_ALL,12,FALSE),0)","v":0}]
[null,null,null,null,null,null,null,null,null,null,null,null,null,null,null,null,null,null,null,null,null,{"$f":"IF($U$20=\"VxFlex\",ConfigurationTS3L4!$A$275,IF($U$100=\"DW\",ConfigurationTS3L4!$A$372,IF($U$77=\"1CPU\",ConfigurationTS3L4!$A$105:$A$106,ConfigurationTS3L4!$A$198:$A$220)))","v":{"$error":"#VALUE!"}}]
[null,null,null,null,null,null,null,"Cable Management Arm"]
[null,null,null,null,null,null,null,"No ",null,{"$f":"IF($U$20=\"VxFlex\",\"TS3L4-BZLSTD\",VLOOKUP($H128,TS3L4_ALL,13,))","v":""},{"$f":"IF($U$20=\"VxFlex\",1,VLOOKUP($H128,TS3L4_ALL,7,FALSE))","v":""},null,null,null,null,null,{"$f":"VLOOKUP($H128,TS3L4_ALL,10,FALSE)","v":0},{"$f":"IF($U$20=\"VxFlex\",42,VLOOKUP($H128,TS3L4_ALL,11,FALSE))","v":0},{"$f":"IF($U$20=\"VxFlex\",\"L4N69\",VLOOKUP($H128,TS3L4_ALL,12,FALSE))","v":""}]
[]
[null,null,null,null,null,null,null,"Bezel"]
[null,null,null,null,null,null,null,"No Bezel",null,{"$f":"IF($U$20=\"VxFlex\",\"TS3L4-BZLSTD\",VLOOKUP($H131,TS3L4_ALL,13,))","v":""},{"$f":"IF($U$20=\"VxFlex\",1,VLOOKUP($H131,TS3L4_ALL,7,FALSE))","v":""},null,null,null,null,null,{"$f":"VLOOKUP($H131,TS3L4_ALL,10,FALSE)","v":0},{"$f":"IF($U$20=\"VxFlex\",42,VLOOKUP($H131,TS3L4_ALL,11,FALSE))","v":0},{"$f":"IF($U$20=\"VxFlex\",\"L4N69\",VLOOKUP($H131,TS3L4_ALL,12,FALSE))","v":""}]
[]
[null,null,null,null,null,null,null,"Garanzia"]
[null,null,null,null,null,null,null,"Estensione della manutenzione in garanzia per ulteriori 24 mesi",null,{"$f":"VLOOKUP($H134,TS3L4_WARRANTY,13,FALSE)","v":"TS4L7-OpzEst24"},{"$f":"VLOOKUP($H134,TS3L4_ALL,7,FALSE)","v":1},null,{"$f":"Q134","v":183.01},null,null,null,{"$f":"VLOOKUP($H134,TS3L4_WARRANTY,10,FALSE)","v":183.01},{"$f":"VLOOKUP($H134,TS3L4_WARRANTY,11,FALSE)","v":0},{"$f":"VLOOKUP($H134,TS3L4_ALL,12,FALSE)","v":"L7N29"}]
[]
[null,null,null,null,null,null,null,"Garanzia GPU",null,null,{"$f":"IF(AND(H137=\"Estensione della manutenzione GPU in garanzia per ulteriori 24 mesi\",K134=\"\"),\"Selezionare estensione garanzia 60 Mesi\",\"\")","v":""}]
[null,null,null,null,null,null,null,"Estensione della manutenzione GPU in garanzia per ulteriori 24 mesi",null,{"$f":"VLOOKUP($H137,TS4L7_GPUWAR,13,FALSE)","v":"TS4L7-OpzEst24GPU"},{"$f":"IF(K134=\"\",0,IF(S137=\"\",0,U137))","v":2},null,{"$f":"Q137","v":231.08},null,null,null,{"$f":"IF(H20=\"PowerEdge R7525 Server (General Purpose)\",0,IF(K134=\"\",0,VLOOKUP($H137,TS4L7_GPUWAR,10,FALSE)))*K137","v":231.08},{"$f":"VLOOKUP($H137,TS4L7_GPUWAR,11,FALSE)","v":0},{"$f":"VLOOKUP($H137,TS4L7_GPUWAR,12,FALSE)","v":"L7N31"},"L7N15",{"$f":"COUNTIF(TS4L7_2,T137)","v":2}]
[]
[null,null,null,null,null,null,null,"Hard Disk Retention",null,null,{"$f":"IF(AND(H140=\"Hard Disk Retention 60 mesi\",K134=\"\"),\"Selezionare Estensione Garanzia 60 Mesi\",\"\")","v":""}]
[null,null,null,null,null,null,null,"Hard Disk Retention 60 mesi",null,{"$f":"IFERROR(U140,VLOOKUP(H140,TS3L4_ALL,13,FALSE))","v":"TS4L7-HDRTN60"},{"$f":"IF(H140=\"\",\"\",1)","v":1},null,{"$f":"Q140","v":41.81},null,null,null,{"$f":"IFERROR(V140,VLOOKUP(H140,TS3L4_ALL,10,FALSE))","v":41.81},{"$f":"IFERROR(W140,VLOOKUP(H140,TS3L4_ALL,11,FALSE))","v":0},{"$f":"IFERROR(X140,VLOOKUP(H140,TS3L4_ALL,12,FALSE))","v":"L7N28b"},null,{"$f":"IF(K134+K140=2,VLOOKUP(\"Hard Disk Retention 60 mesi\",TS3L4_ALL,13,FALSE),VLOOKUP(H140,TS3L4_ALL,13,FALSE))","v":"TS4L7-HDRTN60"},{"$f":"IF(K134+K140=2,VLOOKUP(\"Hard Disk Retention 60 mesi\",TS3L4_ALL,10,FALSE),VLOOKUP(H140,TS3L4_ALL,10,FALSE))","v":41.81},{"$f":"IF(K134+K140=2,VLOOKUP(\"Hard Disk Retention (60 mesi)\",TS3L4_ALL,11,FALSE),VLOOKUP(H140,TS3L4_ALL,11,FALSE))","v":{"$error":"#N/A"}},{"$f":"IF(K134+K140=2,VLOOKUP(\"Hard Disk Retention 60 mesi\",TS3L4_ALL,12,FALSE),VLOOKUP(H140,TS3L4_ALL,12,FALSE))","v":"L7N28b"}]
[]
[]
[null,null,null,null,null,null,null,"UPS"]
[null,null,null,null,null,null,null,"IO SONO UN UPS",null,{"$f":"VLOOKUP($H144,TS3L4_UPS,13,FALSE)","v":{"$error":"#NAME?"}},{"$f":"VLOOKUP($H144,TS3L4_UPS,7,FALSE)","v":{"$error":"#NAME?"}},null,null,null,null,null,{"$f":"VLOOKUP($H144,TS3L4_UPS,10,FALSE)","v":{"$error":"#NAME?"}},{"$f":"VLOOKUP($H144,TS3L4_UPS,11,FALSE)","v":{"$error":"#NAME?"}},{"$f":"VLOOKUP($H144,TS3L4_ALL,12,FALSE)","v":{"$error":"#N/A"}}]
[]
[null,null,null,null,null,null,null,"Kit Graphical User Interface"]
[null,null,null,null,null,null,null,"",null,{"$f":"VLOOKUP($H147,TS3L4_GUI,13,FALSE)","v":{"$error":"#NAME?"}},{"$f":"VLOOKUP($H147,TS3L4_GUI,7,FALSE)","v":{"$error":"#NAME?"}},null,null,null,null,null,{"$f":"VLOOKUP($H147,TS3L4_GUI,10,FALSE)","v":{"$error":"#NAME?"}},{"$f":"VLOOKUP($H147,TS3L4_GUI,11,FALSE)","v":{"$error":"#NAME?"}},{"$f":"VLOOKUP($H147,TS3L4_ALL,12,FALSE)","v":""}]
[]
[]
[null,null,null,null,null,null,null,null,null,"Configurazione",{"$f":"SUM(Q20:Q140)*K6","v":0}]
[null,null,null,null,null,null,null,null,null,0.2,{"$f":"SUM(R20:R140)*K6","v":0},null,"Quota massima 20 %"]
[null,null,null,null,null,null,null,null,null,"Totale",{"$f":"SUM(K150:K151)","v":0},null,{"$f":"K150*20%-K151","v":0}]
[]
[null,null,null,null,null,null,null,"NOTE"]

{"sheet":"Lotto7_R7525_3","index":2,"n_rows":154,"n_cols":31,"rows_kept":154,"cut":false,"hidden":false,"merged":[[154,7,165,10],[69,8,70,8],[71,12,73,13],[72,8,73,8],[132,8,133,8],[138,8,139,8],[153,7,153,10],[135,8,136,8],[48,7,49,7],[12,8,12,10],[12,11,12,12],[14,8,14,10],[14,11,14,12],[15,8,15,10],[15,11,15,12],[18,8,19,8],[21,8,22,8],[22,12,25,12],[27,8,28,8],[45,8,46,8],[8,8,8,10],[8,11,8,12],[9,8,9,10],[9,11,9,12],[11,8,11,10],[11,11,11,12]]}
[]
[null,null,null,null,null,null,null,"Convenzione \nTecnologie Server 4 - Lotto 7",null,{"$f":"IF(T100>1,\"ERRORE NELLA CONFIGURAZIONE\",\"\")","v":""}]
[null,null,null,null,null,null,null,null,null,null,null,null,"Quota massima 20 %"]
[null,null,null,null,null,null,null,null,null,"Guida alla Convenzione","Totale Singola Configurazione",null,{"$f":"Riepilogo_Ordine!G59","v":0}]
[null,null,null,null,null,null,null,{"$f":"IF($J$23=\"TS4L7-VSAN\",\"vSAN Server Ready\",IF($J$23=\"TS4L7-GPUDW\",\"GPU Double-Wide Server Ready\",IF($J$23=\"TS4L7-GPUSW\",\"GPU Single-Wide Server Ready\",IF(N20=\"VxFlex\",\"PowerFlex Server\",\"\"))))","v":""},null,null,{"$f":"K152","v":0},null,"Totale Ordine \nIva Esclusa"]
[null,null,null,null,null,null,null,"DELL POWEREDGE R7525\nGPU Ready",null,"Quantità Server",0,null,{"$f":"Riepilogo_Ordine!J60","v":0}]
[]
[]
[null,null,null,null,null,null,null,"N° Ordine Consip","Amministrazione",null,null,"Data"]
[]
[]
[null,null,null,null,null,null,null,"Nom. Referente Consegna","Email Consegna",null,null,"Tel."]
[]
[]
[null,null,null,null,null,null,null,"Nom. Referente Installazione","Email Installazione","Tel.",null,"Tel."]
[]
[]
[]
[null,null,null,null,null,null,null,"Base",null,null,null,null,null,null,null,null,null,null,null,null,"PowerEdge R7525 Server (General Purpose)"]
[null,null,null,null,null,null,null,"PowerEdge R7525 Server (GPU Double-Wide Ready)",null,{"$f":"IF($K$6>0,\"TS4L7-SRV-U\",\"\")","v":""},{"$f":"IF($K$6>0,1,\"\")","v":""},null,{"$f":"Q20","v":4047.7},null,null,null,{"$f":"IF($U$20=\"nVME\",VLOOKUP($H$20,TS3L4_ALL,10,FALSE)*1.04,VLOOKUP($H$20,TS3L4_ALL,10,FALSE))","v":4047.7},null,{"$f":"VLOOKUP($H20,TS3L4_ALL,12,FALSE)","v":"L7N01"},null,{"$f":"IF(H20=ConfigurationTS3L4!A4,\"GPU\",\"\")","v":"GPU"},{"$f":"IF(H20=ConfigurationTS3L4!A11,\"Vsan\",\"\")","v":""},{"$f":"IF(J23=\"TS3L4-GPUSW\",1,IF(J23=\"TS3L4-GPUDW\",1,\"\"))","v":""}]
[]
[null,null,null,null,null,null,null,"Chassis Configuration"]
[null,null,null,null,null,null,null,{"$f":"IF(K32=1,VLOOKUP($H$20,TS3L4_Chassis,3,FALSE),VLOOKUP($H$20,TS3L4_Chassis,2,FALSE))","v":"Chassis with Up to 16 x 2.5 Hard Drives for 2CPU, GPU Double-Wide Configuration"},null,{"$f":"IF($K$32=1,VLOOKUP($H$20,TS3L4_Chassis,8,FALSE),VLOOKUP($H$20,TS3L4_Chassis,9,FALSE))","v":"Kit upgrade chassies for Server GPU Double-Wide Ready"},{"$f":"IF(H20=U19,VLOOKUP($H$20,TS3L4_Chassis,6,FALSE),VLOOKUP($H$20,TS3L4_Chassis,7,FALSE))","v":1},null,{"$f":"IF(J23=\"TS3L4-VSAN\",\"ATTENZIONE SELEZIONARE UNA COMPONENTE PER IL BOOT A SCELTA TRA ''ISDM Module'' \noppure \n''BOSS Controller Card''\",\"\")","v":""},null,null,null,{"$f":"VLOOKUP($H20,TS3L4_Chassis,11,FALSE)","v":0},null,{"$f":"VLOOKUP($H20,TS3L4_Chassis,12,FALSE)","v":"L7N37"},null,"Chassis with Up to 24 x 2.5'' Hard Drives for 2CPU Configuration",1]
[]
[null,null,null,null,null,null,null,"Trusted Platform Module (TPM)"]
[null,null,null,null,null,null,null,"Trusted Platform Module 2.0 V3"]
[]
[null,null,null,null,null,null,null,"Processor"]
[null,null,null,null,null,null,null,"AMD EPYC 7313 3.0GHz, 16C/32T, 128M Cache (155W) DDR4-3200",null,{"$f":"IF(K23=1,VLOOKUP($H$29,TS3L4_CPU8core,13,FALSE),VLOOKUP($H$29,TS3L4_CPU8core,13,FALSE))","v":""},{"$f":"IF(K23=1,VLOOKUP($H$29,TS3L4_CPU8core,7,FALSE),VLOOKUP($H$29,TS3L4_CPU8core,7,FALSE))","v":0},null,null,null,null,null,{"$f":"IF(K23=1,VLOOKUP($H$29,TS3L4_CPU8core,10,FALSE),VLOOKUP($H$29,TS3L4_CPU8core,10,FALSE))","v":0},{"$f":"IF(K23=1,VLOOKUP($H$29,TS3L4_CPU8core,11,FALSE),VLOOKUP($H$29,TS3L4_CPU8core,11,FALSE))","v":0},{"$f":"IF(R29=0,0,VLOOKUP($H29,TS3L4_CPU8core,12,FALSE))","v":0}]
[]
[null,null,null,null,null,null,null,"Additional Processor"]
[null,null,null,null,null,null,null,"AMD EPYC 7313 3.0GHz, 16C/32T, 128M Cache (155W) DDR4-3200",null,{"$f":"IF(K23=1,VLOOKUP($H$29,TS3L4_CPU,13,FALSE),VLOOKUP($H$32,TS3L4_CPU,13,FALSE))","v":"TS4L7-CPU"},{"$f":"IF(K23=1,VLOOKUP($H$29,TS3L4_CPU,7,FALSE),VLOOKUP($H$32,TS3L4_CPU,7,FALSE))","v":1},null,{"$f":"Q32","v":680.84},null,null,null,{"$f":"IF(K23=1,VLOOKUP($H$29,TS3L4_CPU,10,FALSE),VLOOKUP($H$32,TS3L4_CPU,10,FALSE))","v":680.84},{"$f":"IF(K23=1,VLOOKUP($H$29,TS3L4_CPU,11,FALSE),VLOOKUP($H$32,TS3L4_CPU,11,FALSE))","v":0},{"$f":"IF(K23=1,VLOOKUP(H29,TS3L4_ALL,12,FALSE),VLOOKUP($H32,TS3L4_CPU,12,FALSE))","v":"L7N02"},null,{"$f":"IF(K23=1,\"AMD EPYC 7313 3.0GHz, 16C/32T, 128M Cache (155W) DDR4-3200\",H32)","v":"AMD EPYC 7313 3.0GHz, 16C/32T, 128M Cache (155W) DDR4-3200"}]
[null,null,null,null,null,null,null,null,null,null,null,null,null,null,null,null,null,null,{"$f":"IF(J33=\"TS3L4-CPU\",\"L4N02\",0)","v":0},null,{"$f":"VLOOKUP($S$32,Tabella_prezzi!$A$1:$L$382,4,FALSE)","v":680.84},{"$f":"VLOOKUP($S$32,Tabella_prezzi!$A$1:$L$382,7,FALSE)","v":1}]
[null,null,null,null,null,null,null,"Memory Capacity (GB)",null,null,{"$f":"IF(AND(K32=0,H35>512),\"Selezionare Quantità RAM Corretta\",\"\")","v":""}]
[null,null,null,null,null,null,null,256,null,{"$f":"IFERROR(U35,\"TS3L4-RAM64\")","v":"TS4L7-WINSRVSTD"},{"$f":"IFERROR(V35,IF($U$20=\"VxFlex\",5,1))","v":0},null,{"$f":"Q35","v":0},null,null,null,{"$f":"IFERROR(W35,444)","v":0},null,{"$f":"IFERROR(X35,\"L4N04\")","v":"L7N03"},null,{"$f":"IF($K$32=1,VLOOKUP($H$35,ConfigurationTS3L4!A45:M65,13,FALSE),VLOOKUP($H$35,TS3L4_RAM1CPU,13,FALSE))","v":"TS4L7-WINSRVSTD"},{"$f":"IF($K$32=1,VLOOKUP($H$35,ConfigurationTS3L4!A45:M65,7,FALSE),VLOOKUP($H$35,TS3L4_RAM1CPU,7,FALSE))","v":0},{"$f":"IF($K$32=1,VLOOKUP($H$35,ConfigurationTS3L4!A45:M65,10,FALSE),VLOOKUP($H$35,TS3L4_RAM1CPU,10,FALSE))","v":0},{"$f":"IF($K$32=1,VLOOKUP($H$35,ConfigurationTS3L4!A45:M65,12,FALSE),VLOOKUP($H$35,TS3L4_RAM1CPU,12,FALSE))","v":"L7N03"},null,"384GB",{"$f":"IF(U20=\"VxFlex\",0,1)","v":1},{"$f":"IF(U20=\"VxFlex\",VLOOKUP(H35,ConfigurationTS3L4!A69:A72,1,FALSE),\"192GB\")","v":"192GB"},{"$f":"IFERROR(AB35,1)","v":"192GB"},{"$f":"IF(H35=\"256\",1,0)","v":0},{"$f":"AD35*K23","v":0}]
[]
[null,null,null,null,null,null,null,"Operating System STANDARD",null,null,{"$f":"IF(AND(K32=0,K38>3),\"Selezionare Numero Corretto di Licenze\",IF(AND(H38=\"Ubuntu Server 22.04 LTS 64 Bit\",K38>1),\"Selezionare Numero Corretto di Licenze\",\"\"))","v":""}]
[null,null,null,null,null,null,null,"No Operating System",null,{"$f":"VLOOKUP($H$38,TS3L4_OS,13,FALSE)","v":""},null,null,{"$f":"Q38","v":0},null,null,null,{"$f":"VLOOKUP($H$38,TS3L4_OS,10,FALSE)*K38","v":0},{"$f":"VLOOKUP($H$38,TS3L4_OS,11,FALSE)","v":0},{"$f":"VLOOKUP($H38,TS3L4_ALL,12,FALSE)","v":""}]
[null,null,null,null,null,null,null,"Windows Server 2022 Standard Edition, Add License,2CORE",null,{"$f":"VLOOKUP($H$39,TS3L4_OS,13,FALSE)","v":"TS4L7-WINSRV2C"},null,null,{"$f":"Q39","v":0},null,null,null,{"$f":"VLOOKUP($H$39,TS3L4_OS,10,FALSE)*K39","v":0},{"$f":"VLOOKUP($H$38,TS3L4_OS,11,FALSE)","v":0},{"$f":"VLOOKUP($H39,TS3L4_ALL,12,FALSE)","v":"L7N26"}]
[]
[]
[null,null,null,null,null,null,null,"Operating System Device CAL / User CAL"]
[null,null,null,null,null,null,null,"1-pack of Windows Server 2022/2019 Device CALs (STD or DC)",null,{"$f":"VLOOKUP($H$43,ConfigurationTS3L4!A79:W80,13,FALSE)","v":"TS4L7-WINDEVCAL"},null,null,{"$f":"Q43","v":0},null,null,null,{"$f":"VLOOKUP($H$43,ConfigurationTS3L4!A79:N80,10,FALSE)*K43","v":0},{"$f":"VLOOKUP($H$38,TS3L4_OS,11,FALSE)","v":0},{"$f":"VLOOKUP($H43,TS3L4_ALL,12,FALSE)","v":"L7N24"}]
[null,null,null,null,null,null,null,"1-pack of Windows Server 2022/2019 User CALs (STD or DC)",null,{"$f":"VLOOKUP($H$44,ConfigurationTS3L4!A80:W81,13,FALSE)","v":"TS4L7-WINUSRCAL"},null,null,{"$f":"Q44","v":0},null,null,null,{"$f":"VLOOKUP($H$44,ConfigurationTS3L4!A80:N81,10,FALSE)*K44","v":0},{"$f":"VLOOKUP($H$38,TS3L4_OS,11,FALSE)","v":0},{"$f":"VLOOKUP($H44,TS3L4_ALL,12,FALSE)","v":"L7N25"}]
[]
[null,null,null,null,null,null,null,"Disk Controller"]
[null,null,null,null,null,{"$f":"IF($J$23=\"TS3L4-VSAN\",\"vSAN HCL\",\"\")","v":""},null,"PERC H745 Controller",null,{"$f":"IF(H23=\"Chassis with Up to 24 x 2.5'' Hard Drives for 2CPU Configuration\",\"TS3L4-HBA335i-L\",IF(U20=\"VxFlex\",\"TS3L4-HBA355i-L\",VLOOKUP($H47,TS3L4_CRTL,13,FALSE)))","v":0},{"$f":"IF(H23=\"Chassis with Up to 24 x 2.5'' Hard Drives for 2CPU Configuration\",\"1\",IF(U20=\"VxFlex\",\"1\",VLOOKUP($H47,TS3L4_CRTL,7,FALSE)))","v":""},null,null,null,null,null,{"$f":"IF(H47=ConfigurationTS3L4!A48,0,VLOOKUP($H47,TS3L4_CRTL,10,FALSE))","v":0},{"$f":"IF(H23=\"Chassis with Up to 24 x 2.5'' Hard Drives for 2CPU Configuration\",180,IF(U20=\"VxFlex\",180,IF(M5=\"\",0,VLOOKUP($H47,TS3L4_CRTL,11,FALSE))))","v":0},{"$f":"IF(H23=\"Chassis with Up to 24 x 2.5'' Hard Drives for 2CPU Configuration\",\"L4N34\",IF(U20=\"VxFlex\",\"L4N34\",IF(M5=\"\",\"\",VLOOKUP($H47,TS3L4_ALL,12,FALSE))))","v":"L7N44"},null,{"$f":"IF(J47=\"TS3L4-HBA330-L\",1,0)","v":0},{"$f":"IF(H47=\"PERC H740P RAID Controller, 8GB NV Cache\",1,0)","v":0},{"$f":"IF(X47=1,X47*U47,V47*U47)","v":0},{"$f":"IF(M5=\"\",1,0)","v":0}]
[]
[null,null,null,null,null,null,null,"Hard Drivers Bays n° 16 - 2 bay occupate dai dischi 960GB SSD di base",null,"Usati","Disponibili",null,null,null,null,null,null,null,null,{"$f":"IF(H23=\"Chassis with Up to 24 x 2.5'' Hard Drives for 2CPU Configuration\",ConfigurationTS3L4!$A$126,IF($M$5=\"\",ConfigurationTS3L4!$A$125,ConfigurationTS3L4!$A$125:$A$126))","v":{"$error":"#VALUE!"}}]
[null,null,null,null,null,null,null,null,null,{"$f":"K52+K54+K56+K62+K64+K58+K60","v":2},{"$f":"16-J50","v":14}]
[]
[null,null,null,null,null,{"$f":"IF($J$23=\"TS3L4-VSAN\",\"vSAN HCL\",\"\")","v":""},null,{"$f":"ConfigurationTS3L4!A86","v":"2.4TB 10k SAS ISE 12Gbps"},null,{"$f":"VLOOKUP($H52,TS3L4_HDD,13,FALSE)","v":"TS4L7-HDD2TB"},null,null,{"$f":"Q52","v":0},null,null,null,{"$f":"VLOOKUP($H52,TS3L4_HDD,10,FALSE)*K52","v":0},{"$f":"VLOOKUP($H52,TS3L4_HDD,11,FALSE)","v":0},{"$f":"VLOOKUP($H52,TS3L4_ALL,12,FALSE)","v":"L7N12"}]
[]
[null,null,null,null,null,{"$f":"IF($J$23=\"TS3L4-VSAN\",\"vSAN HCL\",\"\")","v":""},null,{"$f":"ConfigurationTS3L4!A87","v":"1.2TB 10K RPM SAS ISE 12Gbps"},null,{"$f":"VLOOKUP($H54,TS3L4_HDD,13,FALSE)","v":"TS4L7-HDD1TB"},null,null,{"$f":"Q54","v":0},null,null,null,{"$f":"VLOOKUP($H54,TS3L4_HDD,10,FALSE)*K54","v":0},{"$f":"VLOOKUP($H54,TS3L4_HDD,11,FALSE)","v":0},{"$f":"VLOOKUP($H54,TS3L4_ALL,12,FALSE)","v":"L7N13"}]
[]
[null,null,null,null,null,{"$f":"IF($J$23=\"TS3L4-VSAN\",\"vSAN HCL\",\"\")","v":""},null,{"$f":"ConfigurationTS3L4!A88","v":"3.84TB SSD SAS ISE RI 12Gbps"},null,{"$f":"VLOOKUP($H56,TS3L4_HDD,13,FALSE)","v":"TS4L7-SSD-RI3,8TB"},null,null,{"$f":"Q56","v":0},null,null,null,{"$f":"VLOOKUP($H56,TS3L4_HDD,10,FALSE)*K56","v":0},{"$f":"VLOOKUP($H56,TS3L4_HDD,11,FALSE)","v":0},{"$f":"VLOOKUP($H56,TS3L4_ALL,12,FALSE)","v":"L7N14"}]
[]
[null,null,null,null,null,{"$f":"IF($J$23=\"TS3L4-VSAN\",\"vSAN HCL\",\"\")","v":""},null,{"$f":"ConfigurationTS3L4!A89","v":"1.92TB SSD SAS ISE RI 12Gbps"},null,{"$f":"VLOOKUP($H58,TS3L4_HDD,13,FALSE)","v":"TS4L7-SSD-RI1,6TB"},null,null,{"$f":"Q58","v":0},null,null,null,{"$f":"IF(K58>2,(VLOOKUP($H58,TS3L4_HDD,10,FALSE)*(K58-2)),0)","v":0},{"$f":"VLOOKUP($H58,TS3L4_HDD,11,FALSE)","v":0},{"$f":"VLOOKUP($H58,TS3L4_ALL,12,FALSE)","v":"L7N16"}]
[]
[null,null,null,null,null,{"$f":"IF($J$23=\"TS3L4-VSAN\",\"vSAN HCL\",\"\")","v":""},null,{"$f":"ConfigurationTS3L4!A90","v":"1.6TB SSD SAS ISE MU 12Gbp"},null,{"$f":"VLOOKUP($H60,TS3L4_HDD,13,FALSE)","v":"TS4L7-SSD-MU1,6TB"},null,null,{"$f":"Q60","v":0},null,null,null,{"$f":"VLOOKUP($H60,TS3L4_HDD,10,FALSE)*K60","v":0},{"$f":"VLOOKUP($H60,TS3L4_HDD,11,FALSE)","v":0},{"$f":"VLOOKUP($H60,TS3L4_ALL,12,FALSE)","v":"L7N17"}]
[]
[null,null,null,null,null,{"$f":"IF($J$23=\"TS3L4-VSAN\",\"vSAN HCL\",\"\")","v":""},null,{"$f":"ConfigurationTS3L4!A91","v":"960GB SSD SAS ISE RI 12Gbps"},null,{"$f":"VLOOKUP($H62,TS3L4_HDD,13,FALSE)","v":"TS4L7-SSD-RI800GB"},2,null,{"$f":"Q62","v":0},null,null,null,{"$f":"IF(K62>2,(VLOOKUP($H62,TS3L4_HDD,10,FALSE)*(K62-2)),0)","v":0},{"$f":"VLOOKUP($H62,TS3L4_HDD,11,FALSE)*K62","v":0},{"$f":"VLOOKUP($H62,TS3L4_ALL,12,FALSE)","v":"L7N18"}]
[]
[null,null,null,null,null,{"$f":"IF($J$23=\"TS3L4-VSAN\",\"vSAN HCL\",\"\")","v":""},null,{"$f":"ConfigurationTS3L4!A92","v":"800GB SSD SAS ISE Mix Use 12Gbps"},null,{"$f":"VLOOKUP($H64,TS3L4_HDD,13,FALSE)","v":"TS4L7-SSD-MU800GB"},null,null,{"$f":"Q64","v":0},null,null,null,{"$f":"VLOOKUP($H64,TS3L4_HDD,10,FALSE)*K64","v":0},{"$f":"VLOOKUP($H64,TS3L4_HDD,11,FALSE)*K64","v":0},{"$f":"VLOOKUP($H64,TS3L4_ALL,12,FALSE)","v":"L7N19"}]
[]
[null,null,null,null,null,null,null,"BOSS controller card"]
[null,null,null,null,null,null,null,"No Boss card",null,{"$f":"IF(R67>0,VLOOKUP($H67,TS3L4_ISDM,13,FALSE),\"\")","v":""},{"$f":"VLOOKUP($H67,TS3L4_ISDM,7,FALSE)","v":""},null,null,null,null,null,{"$f":"VLOOKUP($H67,TS3L4_ISDM,10,FALSE)","v":0},{"$f":"VLOOKUP($H67,TS3L4_ISDM,11,FALSE)","v":0},{"$f":"VLOOKUP($H67,TS3L4_ALL,12,FALSE)","v":""}]
[]
[]
[null,null,null,null,null,{"$f":"IF(M70=\"\",\"\",T71)","v":""},null,"Power Supply",{"$f":"IF(M70=\"\",\"\",T71)","v":""}]
[null,null,null,null,null,null,null,{"$f":"ConfigurationTS3L4!A101","v":"Dual, Hot-Plug, Power Supply 2400W Redundant, D"},null,{"$f":"VLOOKUP($H71,TS3L4_PSU,13,FALSE)","v":"TS4L7-PSU2400W"},{"$f":"VLOOKUP($H71,TS3L4_PSU,7,FALSE)","v":1},null,null,null,null,null,{"$f":"VLOOKUP($H71,TS3L4_PSU,10,FALSE)","v":0},{"$f":"VLOOKUP($H71,TS3L4_PSU,11,FALSE)","v":0},{"$f":"VLOOKUP($H71,TS3L4_ALL,12,FALSE)","v":"L7N49"},"⚠",{"$f":"IF(M70=\"\",ConfigurationTS3L4!A565,ConfigurationTS3L4!A566)","v":"_C14C13"}]
[]
[null,null,null,null,null,null,null,"Embedded Systems Management"]
[null,null,null,null,null,null,null,"iDRAC9,Enterprise"]
[]
[]
[null,null,null,null,null,null,null,null,null,null,null,null,null,null,null,null,null,null,null,{"$f":"IF($J$23=\"TS3L4-GPUDW\",\"1\",IF($J$23=\"TS3L4-GPUSW\",\"20\",IF($K$32=1,\"300\",\"4000\")))","v":"300"},{"$f":"IF($J$23=\"TS3L4-GPUDW\",\"DW\",IF($J$23=\"TS3L4-GPUSW\",\"SW\",IF($J$23=\"TS3L4-PWRFLEX\",\"PX\",IF($K$32=1,\"2CPU\",\"1CPU\"))))","v":"2CPU"}]
[null,null,null,null,null,null,null,"PCI Slot 1 Processor 1 x8 PCIe Gen4 for HL/FH",null,null,null,null,null,null,null,null,null,null,null,null,{"$f":"IF(U77=\"DW\",\"DW\",IF(U77=\"SW\",\"SW\",0))","v":0},"Selected","1CPU","2CPU","PX","DW","SW"]
[null,null,null,null,null,null,null,"",null,{"$f":"IF($U$20=\"VxFlex\",\"TS3L4-MCX4DP\",VLOOKUP($H79,TS3L4_ALL,13,))","v":""},{"$f":"IF($U$20=\"VxFlex\",1,VLOOKUP($H79,TS3L4_ALL,7,FALSE))","v":""},null,{"$f":"Q79","v":0},null,null,null,{"$f":"VLOOKUP($H79,TS3L4_ALL,10,FALSE)","v":0},{"$f":"IF($U$20=\"VxFlex\",419,VLOOKUP($H79,TS3L4_ALL,11,FALSE))","v":0},{"$f":"IF($U$20=\"VxFlex\",\"L4N94\",VLOOKUP($H79,TS3L4_ALL,12,FALSE))","v":""},null,{"$f":"IF(S79=\"L4N56\",\"DW\",IF(S79=\"L4N57\",\"DW\",IF(S79=\"L4N58\",\"DW\",IF(S79=\"L4N55\",\"SW\",\"CPU\"))))","v":"CPU"},{"$f":"HLOOKUP($N$77,$R$78:$V$101,2,FALSE)","v":"CPU"},"TS3L2_PCI_A","TS3L2_PCI_A","TS3L2_PCI_A","TS3L2_PCI_A","TS3L2_PCI_A",null,"PCI-1",{"$f":"IF($U$77=\"SW\",ConfigurationTS3L4!$A$329:$A$348,IF($U$77=\"DW\",ConfigurationTS3L4!$A$278:$A$301,ConfigurationTS3L4!$A$198:$A$220))","v":{"$error":"#VALUE!"}}]
[null,null,null,null,null,null,null,null,null,null,null,null,{"$f":"IF(S79=\"L4N33\",IF($T$100>1,\"ERRORE: SOLO UNA BOSS CARD PUO' ESSERE CONFIGURATA\",\"\"),\"\")","v":""},null,null,null,null,null,null,null,null,{"$f":"HLOOKUP($N$77,$R$78:$V$101,3,FALSE)","v":0},{"$f":"VLOOKUP(H79,TS3L4_PCI_A,12,FALSE)","v":""},{"$f":"VLOOKUP(H79,TS3L4_PCI_A,12,FALSE)","v":""},{"$f":"VLOOKUP(H79,TS3L4_PCI_A,12,FALSE)","v":""},{"$f":"VLOOKUP(H79,TS3L4_PCI_A,12,FALSE)","v":""},{"$f":"VLOOKUP(H79,TS3L4_PCI_A,12,FALSE)","v":""}]
[null,null,null,null,null,null,null,"PCI Slot 2 Processor 1 x16 PCIe Gen4 for DW/FH"]
[null,null,null,null,null,null,null,"AMD MI100,300W PCIe, 32GB Passive, Double Wide, GPU",null,{"$f":"VLOOKUP($H82,TS3L4_ALL,13,FALSE)","v":"TS4L7-GPU"},{"$f":"VLOOKUP($H82,TS3L4_ALL,7,FALSE)","v":1},null,{"$f":"Q82","v":6264.37},null,null,null,{"$f":"VLOOKUP($H82,TS3L4_ALL,10,FALSE)","v":6264.37},{"$f":"VLOOKUP($H82,TS3L4_ALL,11,FALSE)","v":0},{"$f":"VLOOKUP($H82,TS3L4_ALL,12,FALSE)","v":"L7N15"},{"$f":"IF(K82=\"\",\"OK\",IF(U82+K82=2,\"Errore\",\"OK\"))","v":"OK"},{"$f":"IF(U79=\"dw\",1,0)","v":0},{"$f":"HLOOKUP($N$77,$R$78:$V$101,5,FALSE)","v":0},"TS3L2_PCI_A","TS3L2_PCI_A","TS3L2_PCI_A","TS3L2_PCI_A","TS3L2_PCI_A",null,"PCI-2"]
[null,null,null,null,null,null,null,null,null,null,null,null,null,null,null,null,null,null,null,null,null,{"$f":"HLOOKUP($N$77,$R$78:$V$101,6,FALSE)","v":0},{"$f":"VLOOKUP(H82,TS3L4_PCI_A,12,FALSE)","v":{"$error":"#N/A"}},{"$f":"VLOOKUP(H82,TS3L4_PCI_A,12,FALSE)","v":{"$error":"#N/A"}},{"$f":"VLOOKUP(H82,TS3L4_PCI_A,12,FALSE)","v":{"$error":"#N/A"}},{"$f":"VLOOKUP(H82,TS3L4_PCI_A,12,FALSE)","v":{"$error":"#N/A"}},{"$f":"VLOOKUP(H82,TS3L4_PCI_A,12,FALSE)","v":{"$error":"#N/A"}}]
[null,null,null,null,null,null,null,"PCI Slot 3 Processor 1 x16 PCIe Gen4 for HL/LP"]
[null,null,null,null,null,null,null,"",null,{"$f":"VLOOKUP($H85,TS3L4_ALL,13,FALSE)","v":""},{"$f":"VLOOKUP($H85,TS3L4_ALL,7,FALSE)","v":""},null,{"$f":"Q85","v":0},null,null,null,{"$f":"IF($U$20=\"VxFlex\",748,VLOOKUP($H85,TS3L4_ALL,11,FALSE))","v":0},{"$f":"VLOOKUP($H85,TS3L4_ALL,11,FALSE)","v":0},{"$f":"IF($U$20=\"VxFlex\",\"L4N33\",VLOOKUP($H85,TS3L4_ALL,12,FALSE))","v":""},null,null,{"$f":"HLOOKUP($N$77,$R$78:$V$101,8,FALSE)","v":0},"TS3L2_PCI_A","TS3L2_PCI_A","TS3L2_PCI_A","TS3L2_PCI_A","TS3L2_PCI_A",null,"PCI-3"]
[null,null,null,null,null,null,null,null,null,null,null,null,null,null,null,null,null,null,null,null,null,{"$f":"HLOOKUP($N$77,$R$78:$V$101,9,FALSE)","v":0},{"$f":"VLOOKUP(H85,TS3L4_PCI_A,12,FALSE)","v":""},{"$f":"VLOOKUP(H85,TS3L4_PCI_A,12,FALSE)","v":""},{"$f":"VLOOKUP(H85,TS3L4_PCI_A,12,FALSE)","v":""},{"$f":"VLOOKUP(H85,TS3L4_PCI_A,12,FALSE)","v":""},{"$f":"VLOOKUP(H85,TS3L4_PCI_A,12,FALSE)","v":""}]
[null,null,null,null,null,null,null,"PCI Slot 4 Processor 2 x8 PCIe Gen4 for HL/FH",{"$f":"IF($U$77=\"SW\",\"GPU Slot\",IF($U$77=\"DW\",\"GPU Slot\",\"\"))","v":""}]
[null,null,null,null,null,null,null,"",null,{"$f":"VLOOKUP($H88,TS3L4_ALL,13,FALSE)","v":""},{"$f":"VLOOKUP($H88,TS3L4_ALL,7,FALSE)","v":""},null,{"$f":"Q88","v":0},null,null,null,{"$f":"VLOOKUP($H88,TS3L4_ALL,10,FALSE)","v":0},{"$f":"VLOOKUP($H88,TS3L4_ALL,11,FALSE)","v":0},{"$f":"VLOOKUP($H88,TS3L4_ALL,12,FALSE)","v":""},null,{"$f":"IF(S88=\"L4N56\",\"DW\",IF(S88=\"L4N57\",\"DW\",IF(S88=\"L4N108\",\"DW\",IF(S88=\"L4N55\",\"SW\",1))))","v":1},{"$f":"HLOOKUP($N$77,$R$78:$V$101,11,FALSE)","v":1},"-","TS3L2_PCI_B","TS3L2_PCI_I","TS3L2_PCI_F","TS3L2_PCI_H",null,"PCI-4"]
[null,null,null,null,null,null,null,null,null,null,null,null,{"$f":"IF(S88=\"L4N33\",IF($T$100>1,\"ERRORE: SOLO UNA BOSS CARD PUO' ESSERE CONFIGURATA\",\"\"),\"\")","v":""},null,null,null,null,null,null,null,null,{"$f":"HLOOKUP($N$77,$R$78:$V$101,12,FALSE)","v":0},{"$f":"VLOOKUP(H88,TS3L4_PCI_A,12,FALSE)","v":""},{"$f":"VLOOKUP(H88,TS3L4_PCI_B,12,FALSE)","v":""},{"$f":"VLOOKUP(H88,TS3L4_PCI_I,12,FALSE)","v":""},{"$f":"VLOOKUP(H88,TS3L4_PCI_F,12,FALSE)","v":""},{"$f":"VLOOKUP(H88,TS3L4_PCI_H,12,FALSE)","v":""}]
[null,null,null,null,null,null,null,"PCI Slot 5 Processor 2 x16 PCIe Gen4 for DW/FH"]
[null,null,null,null,null,null,null,"AMD MI100,300W PCIe, 32GB Passive, Double Wide, GPU",null,{"$f":"VLOOKUP($H91,TS3L4_ALL,13,FALSE)","v":"TS4L7-GPU"},{"$f":"VLOOKUP($H91,TS3L4_ALL,7,FALSE)","v":1},null,{"$f":"Q91","v":6264.37},null,null,null,{"$f":"VLOOKUP($H91,TS3L4_ALL,10,FALSE)","v":6264.37},{"$f":"VLOOKUP($H91,TS3L4_ALL,11,FALSE)","v":0},{"$f":"VLOOKUP($H91,TS3L4_ALL,12,FALSE)","v":"L7N15"},{"$f":"IF(K91=\"\",\"OK\",IF(U91+K91=2,\"Errore\",\"OK\"))","v":"OK"},{"$f":"IF(U88=\"dw\",1,0)","v":0},{"$f":"HLOOKUP($N$77,$R$78:$V$101,14,FALSE)","v":0},"-","TS3L2_PCI_A","TS3L2_PCI_I","TS3L2_PCI_A","TS3L2_PCI_L",null,"PCI-5"]
[null,null,null,null,null,null,null,null,null,null,null,null,null,null,null,null,null,null,null,null,null,{"$f":"HLOOKUP($N$77,$R$78:$V$101,15,FALSE)","v":0},{"$f":"VLOOKUP(H91,TS3L4_PCI_A,12,FALSE)","v":{"$error":"#N/A"}},{"$f":"VLOOKUP(H91,TS3L4_PCI_A,12,FALSE)","v":{"$error":"#N/A"}},{"$f":"VLOOKUP(H91,TS3L4_PCI_I,12,FALSE)","v":{"$error":"#N/A"}},{"$f":"VLOOKUP(H91,TS3L4_PCI_A,12,FALSE)","v":{"$error":"#N/A"}},{"$f":"VLOOKUP(H91,TS3L4_PCI_L,12,FALSE)","v":{"$error":"#N/A"}}]
[null,null,null,null,null,null,null,"PCI Slot 6 Processor 2 x16 PCIe Gen4 for HL/LP"]
[null,null,null,null,null,null,null,"",null,{"$f":"VLOOKUP($H94,TS3L4_ALL,13,FALSE)","v":""},{"$f":"IF($U$20=\"VxFlex\",1,VLOOKUP($H94,TS3L4_ALL,7,FALSE))","v":""},null,{"$f":"Q94","v":0},null,null,null,{"$f":"IF($U$20=\"VxFlex\",419,VLOOKUP($H94,TS3L4_ALL,11,FALSE))","v":0},null,{"$f":"VLOOKUP($H94,TS3L4_ALL,12,FALSE)","v":""},null,null,{"$f":"HLOOKUP($N$77,$R$78:$V$101,17,FALSE)","v":0},"TS3L2_PCI_C","TS3L2_PCI_C","TS3L2_PCI_C","TS3L2_PCI_C","TS3L2_PCI_C",null,"PCI-6"]
[null,null,null,null,null,null,null,null,null,null,null,null,null,null,null,null,null,null,null,null,null,{"$f":"HLOOKUP($N$77,$R$78:$V$101,18,FALSE)","v":0},{"$f":"VLOOKUP(H94,TS3L4_PCI_C,12,FALSE)","v":""},{"$f":"VLOOKUP(H94,TS3L4_PCI_C,12,FALSE)","v":""},{"$f":"VLOOKUP(H94,TS3L4_PCI_C,12,FALSE)","v":""},{"$f":"VLOOKUP(H94,TS3L4_PCI_C,12,FALSE)","v":""},{"$f":"VLOOKUP(H94,TS3L4_PCI_C,12,FALSE)","v":""}]
[null,null,null,null,null,null,null,"PCI Slot 7 Processor 2 x16 PCIe Gen4 for DW/FH"]
[null,null,null,null,null,null,null,"AMD MI100,300W PCIe, 32GB Passive, Double Wide, GPU",null,{"$f":"VLOOKUP($H97,TS3L4_ALL,13,FALSE)","v":"TS4L7-GPU"},{"$f":"VLOOKUP($H97,TS3L4_ALL,7,FALSE)","v":1},null,{"$f":"Q97","v":6264.37},null,null,null,{"$f":"VLOOKUP($H97,TS3L4_ALL,10,FALSE)","v":6264.37},{"$f":"VLOOKUP($H97,TS3L4_ALL,11,FALSE)","v":0},{"$f":"VLOOKUP($H97,TS3L4_ALL,12,FALSE)","v":"L7N15"},{"$f":"IF(K97=\"\",\"OK\",IF(U97+K97=2,\"Errore\",\"OK\"))","v":"OK"},{"$f":"IF(U100=\"dw\",1,0)","v":0},{"$f":"HLOOKUP($N$77,$R$78:$V$101,20,FALSE)","v":0},"-","TS3L2_PCI_A","TS3L2_PCI_I","TS3L2_PCI_A","TS3L2_PCI_L",null,"PCI-7"]
[null,null,null,null,null,null,null,null,null,null,null,null,null,null,null,null,null,null,null,null,null,{"$f":"HLOOKUP($N$77,$R$78:$V$101,21,FALSE)","v":0},{"$f":"VLOOKUP(H97,TS3L4_PCI_A,12,FALSE)","v":{"$error":"#N/A"}},{"$f":"VLOOKUP(H97,TS3L4_PCI_A,12,FALSE)","v":{"$error":"#N/A"}},{"$f":"VLOOKUP(H97,TS3L4_PCI_I,12,FALSE)","v":{"$error":"#N/A"}},{"$f":"VLOOKUP(H97,TS3L4_PCI_A,12,FALSE)","v":{"$error":"#N/A"}},{"$f":"VLOOKUP(H97,TS3L4_PCI_L,12,FALSE)","v":{"$error":"#N/A"}}]
[null,null,null,null,null,null,null,"PCI Slot 9 Processor 1 x16  ",null,null,null,null,null,null,null,null,null,null,null,"boss card"]
[null,null,null,null,null,null,null,"",null,{"$f":"VLOOKUP($H100,TS3L4_ALL,13,FALSE)","v":""},{"$f":"VLOOKUP($H100,TS3L4_ALL,7,FALSE)","v":""},null,{"$f":"Q100","v":0},null,null,null,{"$f":"VLOOKUP($H100,TS3L4_ALL,10,FALSE)","v":0},{"$f":"VLOOKUP($H100,TS3L4_ALL,11,FALSE)","v":0},{"$f":"VLOOKUP($H100,TS3L4_ALL,12,FALSE)","v":""},{"$f":"COUNTIF(S79:S100,\"L4N33\")","v":0},{"$f":"IF(S100=\"L4N56\",\"DW\",IF(S100=\"L4N57\",\"DW\",IF(S100=\"L4N108\",\"DW\",IF(S100=\"L4N55\",\"SW\",1))))","v":1},{"$f":"HLOOKUP($N$77,$R$78:$V$101,23,FALSE)","v":1},"-","TS3L2_PCI_D","TS3L2_PCI_I","TS3L2_PCI_E","TS3L2_PCI_G",null,"PCI-8"]
[null,null,null,null,null,null,null,null,null,null,null,null,{"$f":"IF(S100=\"L4N33\",IF($T$100>1,\"ERRORE: SOLO UNA BOSS CARD PUO' ESSERE CONFIGURATA\",\"\"),\"\")","v":""},null,null,null,null,null,null,null,null,{"$f":"HLOOKUP($N$77,$R$78:$V$101,24,FALSE)","v":0},{"$f":"VLOOKUP(H100,TS3L4_PCI_A,12,FALSE)","v":""},{"$f":"VLOOKUP(H100,TS3L4_PCI_D,12,FALSE)","v":""},{"$f":"VLOOKUP(H100,TS3L4_PCI_I,12,FALSE)","v":""},{"$f":"VLOOKUP(H100,TS3L4_PCI_E,12,FALSE)","v":""},{"$f":"VLOOKUP(H100,TS3L4_PCI_G,12,FALSE)","v":""}]
[null,null,null,null,null,null,null,"SFP+ Transceivers"]
[null,null,null,null,null,null,null,"Transceiver, SFP+ SR Optic for SFP+ ports (Intel X710)",null,{"$f":"IF(R103>0,VLOOKUP($H103,ConfigurationTS3L4!$A$1:$M$4870,13,FALSE),\"\")","v":""},null,null,null,null,null,null,0,{"$f":"IF(K103>0,VLOOKUP($H103,TS3L4_ALL,11,FALSE)*(K103),0)","v":0},{"$f":"IF(K103>0,VLOOKUP($H103,TS3L4_ALL,12,FALSE),0)","v":0}]
[]
[null,null,null,null,null,null,null,"SFP+ Direct Attach Cables (Twinax)"]
[null,null,null,null,null,null,null,"Cable, SFP+ to SFP+, 10GbE, Copper Twinax Direct Attach Cable, 3 Meter",null,{"$f":"IF(R106>0,VLOOKUP($H106,ConfigurationTS3L4!$A$1:$M$4870,13,FALSE),\"\")","v":""},null,null,null,null,null,null,0,{"$f":"IF(K106>0,VLOOKUP($H106,TS3L4_ALL,11,FALSE)*K106,0)","v":0},{"$f":"IF(K106>0,VLOOKUP($H106,TS3L4_ALL,12,FALSE),0)","v":0}]
[]
[null,null,null,null,null,null,null,"QSFP28 Transceivers"]
[null,null,null,null,null,null,null,"Dell EMC PowerEdge QSFP28 SR4 100GbE 85C optic",null,{"$f":"IF(R109>0,VLOOKUP($H109,ConfigurationTS3L4!$A$1:$M$4870,13,FALSE),\"\")","v":""},null,null,null,null,null,null,0,{"$f":"IF(K109>0,VLOOKUP($H109,TS3L4_ALL,11,FALSE)*K109,0)","v":0},{"$f":"IF(K109>0,VLOOKUP($H109,TS3L4_ALL,12,FALSE),0)","v":0}]
[]
[null,null,null,null,null,null,null,"Mellanox LinkX 100Gb/s Passive Copper Cables"]
[null,null,null,null,null,null,null,"Mellanox LinkX 100Gb/s Passive Copper Cables - attacco cavo diretto - 3 m - nero",null,{"$f":"IF(R112>0,VLOOKUP($H112,ConfigurationTS3L4!$A$1:$M$4870,13,FALSE),\"\")","v":""},null,null,null,null,null,null,0,{"$f":"IF(K112>0,VLOOKUP($H112,TS3L4_ALL,11,FALSE)*K112,0)","v":0},{"$f":"IF(K112>0,VLOOKUP($H112,TS3L4_ALL,12,FALSE),0)","v":0}]
[]
[null,null,null,null,null,null,null,"Mellanox LinkX 100Gb/s VCSEL-Based Active Optical Cables - cavo InfiniBand - 10 m",null,{"$f":"IF(R114>0,VLOOKUP($H114,ConfigurationTS3L4!$A$1:$M$4870,13,FALSE),\"\")","v":""},null,null,null,null,null,null,0,{"$f":"IF(K114>0,VLOOKUP($H114,TS3L4_ALL,11,FALSE)*K114,0)","v":0},{"$f":"IF(K114>0,VLOOKUP($H114,TS3L4_ALL,12,FALSE),0)","v":0}]
[]
[null,null,null,null,null,null,null,"Cavi RJ45"]
[null,null,null,null,null,null,null,"Cavo “patch” di 3 mt RJ45 certificato per gigabit ethernet",null,{"$f":"IF(R117>0,VLOOKUP($H117,ConfigurationTS3L4!$A$1:$M$4870,13,FALSE),\"\")","v":""},null,null,null,null,null,null,0,{"$f":"IF(K117>0,VLOOKUP($H117,TS3L4_ALL,11,FALSE)*(K117),0)","v":0},{"$f":"IF(K117>0,VLOOKUP($H117,TS3L4_ALL,12,FALSE),0)","v":0}]
[]
[null,null,null,null,null,null,null,"Cavi LC-LC"]
[null,null,null,null,null,null,null,"Dell Networking Cable, OM4 LC/LC Fiber Cable, 3 Meter",null,{"$f":"IF(R120>0,VLOOKUP($H120,ConfigurationTS3L4!$A$1:$M$4870,13,FALSE),\"\")","v":""},null,null,null,null,null,null,0,{"$f":"IF(K120>0,VLOOKUP($H120,TS3L4_ALL,11,FALSE)*(K120),0)","v":0},{"$f":"IF(K120>0,VLOOKUP($H120,TS3L4_ALL,12,FALSE),0)","v":0}]
[]
[null,null,null,null,null,null,null,"Cavi DAC"]
[null,null,null,null,null,null,null,"Dell Networking, Cable, SFP+ to SFP+, 10GbE, Copper Twinax Direct Attach Cable, 3 Meter",null,{"$f":"IF(R123>0,VLOOKUP($H123,ConfigurationTS3L4!$A$1:$M$4870,13,FALSE),\"\")","v":""},null,null,null,null,null,null,0,{"$f":"IF(K123>0,VLOOKUP($H123,TS3L4_ALL,11,FALSE)*(K123),0)","v":0},{"$f":"IF(K123>0,VLOOKUP($H123,TS3L4_ALL,12,FALSE),0)","v":0}]
[null,null,null,null,null,null,null,"Mellanox LinkX 100Gb/s Passive Copper DAC 3m per scheda TS3L4-CONX6DP",null,{"$f":"IF(R124>0,VLOOKUP($H124,ConfigurationTS3L4!$A$1:$M$4870,13,FALSE),\"\")","v":""},null,null,null,null,null,null,0,{"$f":"IF(K124>0,VLOOKUP($H124,TS3L4_ALL,11,FALSE)*(K124),0)","v":0},{"$f":"IF(K124>0,VLOOKUP($H124,TS3L4_ALL,12,FALSE),0)","v":0}]
[null,null,null,null,null,null,null,"Dell Cable SFP28 to SFP28 25GbE Passive Copper Twinax Direct Attach Cable 3 Meter ",null,{"$f":"IF(R125>0,VLOOKUP($H125,ConfigurationTS3L4!$A$1:$M$4870,13,FALSE),\"\")","v":""},null,null,null,null,null,null,0,{"$f":"IF(K125>0,VLOOKUP($H125,TS3L4_ALL,11,FALSE)*(K125),0)","v":0},{"$f":"IF(K125>0,VLOOKUP($H125,TS3L4_ALL,12,FALSE),0)","v":0}]
[null,null,null,null,null,null,null,null,null,null,null,null,null,null,null,null,null,null,null,null,null,{"$f":"IF($U$20=\"VxFlex\",ConfigurationTS3L4!$A$275,IF($U$100=\"DW\",ConfigurationTS3L4!$A$372,IF($U$77=\"1CPU\",ConfigurationTS3L4!$A$105:$A$106,ConfigurationTS3L4!$A$198:$A$220)))","v":{"$error":"#VALUE!"}}]
[null,null,null,null,null,null,null,"Cable Management Arm"]
[null,null,null,null,null,null,null,"No ",null,{"$f":"IF($U$20=\"VxFlex\",\"TS3L4-BZLSTD\",VLOOKUP($H128,TS3L4_ALL,13,))","v":""},{"$f":"IF($U$20=\"VxFlex\",1,VLOOKUP($H128,TS3L4_ALL,7,FALSE))","v":""},null,null,null,null,null,{"$f":"VLOOKUP($H128,TS3L4_ALL,10,FALSE)","v":0},{"$f":"IF($U$20=\"VxFlex\",42,VLOOKUP($H128,TS3L4_ALL,11,FALSE))","v":0},{"$f":"IF($U$20=\"VxFlex\",\"L4N69\",VLOOKUP($H128,TS3L4_ALL,12,FALSE))","v":""}]
[]
[null,null,null,null,null,null,null,"Bezel"]
[null,null,null,null,null,null,null,"No Bezel",null,{"$f":"IF($U$20=\"VxFlex\",\"TS3L4-BZLSTD\",VLOOKUP($H131,TS3L4_ALL,13,))","v":""},{"$f":"IF($U$20=\"VxFlex\",1,VLOOKUP($H131,TS3L4_ALL,7,FALSE))","v":""},null,null,null,null,null,{"$f":"VLOOKUP($H131,TS3L4_ALL,10,FALSE)","v":0},{"$f":"IF($U$20=\"VxFlex\",42,VLOOKUP($H131,TS3L4_ALL,11,FALSE))","v":0},{"$f":"IF($U$20=\"VxFlex\",\"L4N69\",VLOOKUP($H131,TS3L4_ALL,12,FALSE))","v":""}]
[]
[null,null,null,null,null,null,null,"Garanzia"]
[null,null,null,null,null,null,null,"Estensione della manutenzione in garanzia per ulteriori 24 mesi",null,{"$f":"VLOOKUP($H134,TS3L4_WARRANTY,13,FALSE)","v":"TS4L7-OpzEst24"},{"$f":"VLOOKUP($H134,TS3L4_ALL,7,FALSE)","v":1},null,{"$f":"Q134","v":183.01},null,null,null,{"$f":"VLOOKUP($H134,TS3L4_WARRANTY,10,FALSE)","v":183.01},{"$f":"VLOOKUP($H134,TS3L4_WARRANTY,11,FALSE)","v":0},{"$f":"VLOOKUP($H134,TS3L4_ALL,12,FALSE)","v":"L7N29"}]
[]
[null,null,null,null,null,null,null,"Garanzia GPU",null,null,{"$f":"IF(AND(K137>0,K134=\"\"),\"Selezionare Estensione Garanzia 60 Mesi\",\"\")","v":""}]
[null,null,null,null,null,null,null,"Estensione della manutenzione GPU in garanzia per ulteriori 24 mesi",null,{"$f":"VLOOKUP($H137,TS4L7_GPUWAR,13,FALSE)","v":"TS4L7-OpzEst24GPU"},{"$f":"IF(S137=\"\",0,U137)","v":3},null,{"$f":"Q137","v":346.62},null,null,null,{"$f":"VLOOKUP($H137,TS4L7_GPUWAR,10,FALSE)*K137","v":346.62},{"$f":"VLOOKUP($H137,TS4L7_GPUWAR,11,FALSE)","v":0},{"$f":"VLOOKUP($H137,TS4L7_GPUWAR,12,FALSE)","v":"L7N31"},"L7N15",{"$f":"COUNTIF(TS4L7_3,T137)","v":3}]
[]
[null,null,null,null,null,null,null,"Hard Disk Retention",null,null,{"$f":"IF(AND(H140=\"Hard Disk Retention 60 mesi\",K134=\"\"),\"Selezionare Estensione Garanzia 60 Mesi\",\"\")","v":""}]
[null,null,null,null,null,null,null,"Hard Disk Retention 60 mesi",null,{"$f":"IFERROR(U140,VLOOKUP(H140,TS3L4_ALL,13,FALSE))","v":"TS4L7-HDRTN60"},{"$f":"IF(H140=\"\",\"\",1)","v":1},null,{"$f":"Q140","v":41.81},null,null,null,{"$f":"IFERROR(V140,VLOOKUP(H140,TS3L4_ALL,10,FALSE))","v":41.81},{"$f":"IFERROR(W140,VLOOKUP(H140,TS3L4_ALL,11,FALSE))","v":0},{"$f":"IFERROR(X140,VLOOKUP(H140,TS3L4_ALL,12,FALSE))","v":"L7N28b"},null,{"$f":"IF(K134+K140=2,VLOOKUP(\"Hard Disk Retention 60 mesi\",TS3L4_ALL,13,FALSE),VLOOKUP(H140,TS3L4_ALL,13,FALSE))","v":"TS4L7-HDRTN60"},{"$f":"IF(K134+K140=2,VLOOKUP(\"Hard Disk Retention 60 mesi\",TS3L4_ALL,10,FALSE),VLOOKUP(H140,TS3L4_ALL,10,FALSE))","v":41.81},{"$f":"IF(K134+K140=2,VLOOKUP(\"Hard Disk Retention (60 mesi)\",TS3L4_ALL,11,FALSE),VLOOKUP(H140,TS3L4_ALL,11,FALSE))","v":{"$error":"#N/A"}},{"$f":"IF(K134+K140=2,VLOOKUP(\"Hard Disk Retention 60 mesi\",TS3L4_ALL,12,FALSE),VLOOKUP(H140,TS3L4_ALL,12,FALSE))","v":"L7N28b"}]
[]
[]
[null,null,null,null,null,null,null,"UPS"]
[null,null,null,null,null,null,null,"IO SONO UN UPS",null,{"$f":"VLOOKUP($H144,TS3L4_UPS,13,FALSE)","v":{"$error":"#NAME?"}},{"$f":"VLOOKUP($H144,TS3L4_UPS,7,FALSE)","v":{"$error":"#NAME?"}},null,null,null,null,null,{"$f":"VLOOKUP($H144,TS3L4_UPS,10,FALSE)","v":{"$error":"#NAME?"}},{"$f":"VLOOKUP($H144,TS3L4_UPS,11,FALSE)","v":{"$error":"#NAME?"}},{"$f":"VLOOKUP($H144,TS3L4_ALL,12,FALSE)","v":{"$error":"#N/A"}}]
[]
[null,null,null,null,null,null,null,"Kit Graphical User Interface"]
[null,null,null,null,null,null,null,"",null,{"$f":"VLOOKUP($H147,TS3L4_GUI,13,FALSE)","v":{"$error":"#NAME?"}},{"$f":"VLOOKUP($H147,TS3L4_GUI,7,FALSE)","v":{"$error":"#NAME?"}},null,null,null,null,null,{"$f":"VLOOKUP($H147,TS3L4_GUI,10,FALSE)","v":{"$error":"#NAME?"}},{"$f":"VLOOKUP($H147,TS3L4_GUI,11,FALSE)","v":{"$error":"#NAME?"}},{"$f":"VLOOKUP($H147,TS3L4_ALL,12,FALSE)","v":""}]
[]
[]
[null,null,null,null,null,null,null,null,null,"Configurazione",{"$f":"SUM(Q20:Q140)*K6","v":0}]
[null,null,null,null,null,null,null,null,null,0.2,{"$f":"SUM(R20:R140)*K6","v":0},null,"Quota massima 20 %"]
[null,null,null,null,null,null,null,null,null,"Totale",{"$f":"SUM(K150:K151)","v":0},null,{"$f":"K150*20%-K151","v":0}]
[]
[null,null,null,null,null,null,null,"NOTE"]

{"sheet":"Altre_Opzioni","index":3,"n_rows":25,"n_cols":14,"rows_kept":25,"cut":false,"hidden":false,"merged":[[15,5,16,5],[19,5,20,5],[23,5,24,5],[1,7,1,9],[4,5,5,5],[7,5,8,5],[11,5,12,5]]}
[]
[null,null,null,null,"Opzioni",null,null,"Totale altre opzioni"]
[]
[]
[null,null,null,null,"Opzione Rack APC con PDU Monofase"]
[null,null,null,null,"Armadio Rack 42U 600x1200, 2 x PDU Monofase 2G, ZeroU, 32A, 230V, (36) C13 & (6) C19",null,{"$f":"VLOOKUP($E6,TS4L4_ALL,13,FALSE)","v":{"$error":"#NAME?"}},null,null,null,null,{"$f":"VLOOKUP($E6,TS4L4_ALL,10,FALSE)*H6","v":{"$error":"#NAME?"}},{"$f":"VLOOKUP($E6,TS4L4_ALL,11,FALSE)*H6","v":{"$error":"#NAME?"}},{"$f":"VLOOKUP($E6,TS4L4_ALL,12,FALSE)","v":{"$error":"#NAME?"}}]
[]
[null,null,null,null,"Opzione Rack APC con PDU Trifase"]
[null,null,null,null,"Armadio Rack 42U 600x1200, 2 x PDU Trifase 2G, ZeroU, 22.0kW(32A) 17.3kW(24A), 230V, (30) C13 & (12) C19",null,{"$f":"VLOOKUP($E9,TS4L4_ALL,13,FALSE)","v":{"$error":"#NAME?"}},null,null,null,null,{"$f":"VLOOKUP($E9,TS4L4_ALL,10,FALSE)*H9","v":{"$error":"#NAME?"}},{"$f":"VLOOKUP($E9,TS4L4_ALL,11,FALSE)*H9","v":{"$error":"#NAME?"}},{"$f":"VLOOKUP($E9,TS4L4_ALL,12,FALSE)","v":{"$error":"#NAME?"}}]
[null,null,null,null,null,null,null,{"$f":"SUM(L13:L25)","v":0}]
[]
[null,null,null,null,"OpzRack"]
[null,null,null,null,{"$f":"Tabella_prezzi!H38","v":"Dispositivo UPS di tipo On-line doppia conversione, strutturato per il montaggio a rack da 19”"},null,{"$f":"VLOOKUP($E13,TS4L7_UPS,13,FALSE)","v":"TS4L7-UPS"},0,null,{"$f":"L13","v":0},null,{"$f":"VLOOKUP($E13,TS4L7_UPS,10,FALSE)*H13","v":0},{"$f":"VLOOKUP($E13,TS4L7_UPS,11,FALSE)","v":0},{"$f":"VLOOKUP($E13,TS4L7_UPS,12,FALSE)","v":"L7N20"}]
[]
[]
[null,null,null,null,"OpzUps (3000VA)"]
[null,null,null,null,{"$f":"ConfigurationTS3L4!A169","v":"Armadio Rack 42U"},null,{"$f":"VLOOKUP($E17,TS4L7_RACK,13,FALSE)","v":"TS4L7-RACK"},0,null,{"$f":"L17","v":0},null,{"$f":"VLOOKUP($E17,TS4L7_RACK,10,FALSE)*H17","v":0},{"$f":"VLOOKUP($E17,TS4L7_RACK,11,FALSE)","v":0},{"$f":"VLOOKUP($E17,TS4L7_RACK,12,FALSE)","v":"L7N30"}]
[]
[]
[null,null,null,null,"OpzGUI"]
[null,null,null,null,{"$f":"ConfigurationTS3L4!A173","v":"Unità KVM - monitor 17\", cavo combi PS/2&USB da 1,8mt, tastiera italiana, touch pad"},null,{"$f":"VLOOKUP($E21,TS4L7_GUI,13,FALSE)","v":"TS4L7-GUI"},0,null,{"$f":"L21","v":0},null,{"$f":"VLOOKUP($E21,TS4L7_GUI,10,FALSE)*H21","v":0},{"$f":"VLOOKUP($E21,TS4L7_GUI,11,FALSE)*H21","v":0},{"$f":"VLOOKUP($E21,TS4L7_GUI,12,FALSE)","v":"L7N21"}]
[]
[]
[null,null,null,null,"OpzKVM"]
[null,null,null,null,{"$f":"ConfigurationTS3L4!A177","v":"KVM Switch IP per GUI 16P"},null,{"$f":"VLOOKUP($E25,TS4L4_KVM,13,FALSE)","v":"TS4L7-KVM"},0,null,{"$f":"L25","v":0},null,{"$f":"VLOOKUP($E25,TS4L4_KVM,10,FALSE)*H25","v":0},{"$f":"VLOOKUP($E25,TS4L4_KVM,11,FALSE)*H25","v":0},{"$f":"VLOOKUP($E25,TS4L4_KVM,12,FALSE)","v":"L7N22"}]

{"sheet":"Riepilogo_Ordine","index":4,"n_rows":62,"n_cols":24,"rows_kept":62,"cut":false,"hidden":false,"merged":[[60,5,60,6],[60,7,60,8],[1,5,1,6],[1,7,1,8],[5,5,5,6],[6,5,6,6],[7,5,7,9],[47,5,47,9],[57,5,57,6],[57,7,57,8],[58,7,58,8],[59,5,59,6],[59,7,59,8]]}
[]
[null,null,null,null,null,"Convenzione \nTecnologie Server 4 - Lotto 7",null,"Salva in PDF -->",null,null,null,null,null,null,null,null,null,null,null,null,null,null,null,"SI"]
[null,null,null,null,null,null,null,null,null,null,null,null,null,null,null,null,null,null,null,null,null,null,null,"SI"]
[null,null,null,null,null,null,null,null,null,null,null,null,null,null,null,null,null,null,null,null,null,null,null,"SI"]
[null,null,null,null,null,null,{"$f":"IF($L$23=\"TS4L7-VSAN\",\"vSAN Server Ready\",IF($L$23=\"TS4L7-GPUDW\",\"GPU Double-Wide Server Ready\",IF($L$23=\"TS4L7-GPUSW\",\"GPU Single-Wide Server Ready\",IF(M20=\"VxFlex\",\"PowerFlex Server\",\"\"))))","v":""},null,null,null,null,null,null,null,null,null,null,null,null,null,null,null,null,"SI"]
[null,null,null,null,null,"Riepilogo Ordine",null,null,null,null,null,null,null,null,null,null,null,null,null,null,null,null,null,"SI"]
[null,null,null,null,null,null,null,null,null,null,null,null,null,null,null,null,null,null,null,null,null,null,null,"SI"]
[null,null,null,null,null,"Articoli in convenzione",null,null,null,null,null,null,null,null,null,null,"Config 1","Config 2","Config 3","Totale",null,null,null,"SI"]
[null,null,null,null,null,"Codice Produttore","Codice Convenzione","Qtà","Costo unitario","Costo Totale",null,null,null,null,"N°","Codice Convenzione",{"$f":"Lotto7_R7525_1!K6","v":0},{"$f":"Lotto7_R7525_2!K6","v":0},{"$f":"Lotto7_R7525_3!K6","v":0},null,null,null,null,"SI"]
[null,null,null,null,null,{"$f":"IF(H10=\"\",\"\",VLOOKUP(O10,TABELLA_PREZZI,10,FALSE))","v":""},{"$f":"IF(H10=\"\",\"\",VLOOKUP(O10,TABELLA_PREZZI,6,FALSE))","v":""},{"$f":"IF(T10>0,T10,\"\")","v":""},{"$f":"IF(H10=\"\",\"\",VLOOKUP(O10,TABELLA_PREZZI,4,FALSE))","v":""},{"$f":"IF(F10=\"\",\"\",I10*H10)","v":""},null,null,null,null,"L7N01",{"$f":"VLOOKUP(O10,TABELLA_PREZZI,6,FALSE)","v":"TS4L7-SRV"},{"$f":"COUNTIF(TS4L7_1,O10)*$Q$9","v":0},{"$f":"COUNTIF(TS4L7_2,O10)*$R$9","v":0},{"$f":"COUNTIF(TS4L7_3,O10)*$S$9","v":0},{"$f":"SUM(Q10:S10)","v":0},null,null,null,{"$f":"IF(H10<>\"\",\"SI\",\"NO\")","v":"NO"}]
[null,null,null,null,null,"","",{"$f":"IF(T11>0,T11,\"\")","v":""},"",{"$f":"IF(F11=\"\",\"\",I11*H11)","v":""},null,null,null,null,"L7N02","TS4L7-CPU",{"$f":"COUNTIF(TS4L7_1,O11)*$Q$9","v":0},{"$f":"COUNTIF(TS4L7_2,O11)*$R$9","v":0},{"$f":"COUNTIF(TS4L7_3,O11)*$S$9","v":0},0,null,null,null,{"$f":"IF(H11<>\"\",\"SI\",\"NO\")","v":"NO"}]
[null,null,null,null,null,"","","","","",null,null,null,null,"L7N03","TS4L7-RAM32",{"$f":"COUNTIF(TS4L7_1,O12)*Lotto7_R7525_1!K35*$Q$9","v":0},{"$f":"COUNTIF(TS4L7_2,O12)*Lotto7_R7525_2!K35*R9","v":0},{"$f":"COUNTIF(TS4L7_3,O12)*Lotto7_R7525_3!K35*S9","v":0},0,null,null,null,{"$f":"IF(H12<>\"\",\"SI\",\"NO\")","v":"NO"}]
[null,null,null,null,null,"","","","","",null,null,null,null,"L7N04","TS4L7-RAM64",{"$f":"COUNTIF(TS4L7_1,O13)*Lotto7_R7525_1!K35*$Q$9","v":0},{"$f":"COUNTIF(TS4L7_2,O13)*Lotto7_R7525_2!K35*$R$9","v":0},{"$f":"COUNTIF(TS4L7_3,O13)*Lotto7_R7525_3!K35*$S$9","v":0},0,null,null,null,"NO"]
[null,null,null,null,null,"","","","","",null,null,null,null,"L7N05","TS4L7-LAN1",{"$f":"COUNTIF(TS4L7_1,O14)*$Q$9","v":0},{"$f":"COUNTIF(TS4L7_2,O14)*$R$9","v":0},{"$f":"COUNTIF(TS4L7_3,O14)*$S$9","v":0},0,null,null,null,"NO"]
[null,null,null,null,null,"","","","","",null,null,null,null,"L7N75","TS4L7-LAN1-OCP",{"$f":"COUNTIF(TS4L7_1,O15)*$Q$9","v":0},{"$f":"COUNTIF(TS4L7_2,O15)*$R$9","v":0},{"$f":"COUNTIF(TS4L7_3,O15)*$S$9","v":0},0,null,null,null,"NO"]
[null,null,null,null,null,"","","","","",null,null,null,null,"L7N06","TS4L7-LAN10",{"$f":"COUNTIF(TS4L7_1,O16)*$Q$9","v":0},{"$f":"COUNTIF(TS4L7_2,O16)*$R$9","v":0},{"$f":"COUNTIF(TS4L7_3,O16)*$S$9","v":0},0,null,null,null,"NO"]
[null,null,null,null,null,"","","","","",null,null,null,null,"L7N76","TS4L7-LAN10-OCP",{"$f":"COUNTIF(TS4L7_1,O17)*$Q$9","v":0},{"$f":"COUNTIF(TS4L7_2,O17)*$R$9","v":0},{"$f":"COUNTIF(TS4L7_3,O17)*$S$9","v":0},0,null,null,null,"NO"]
[null,null,null,null,null,"","","","","",null,null,null,null,"L7N07","TS4L7-LAN25",{"$f":"COUNTIF(TS4L7_1,O18)*$Q$9","v":0},{"$f":"COUNTIF(TS4L7_2,O18)*$R$9","v":0},{"$f":"COUNTIF(TS4L7_3,O18)*$S$9","v":0},0,null,null,null,"NO"]
[null,null,null,null,null,"","","","","",null,null,null,null,"L7N77","TS4L7-LAN25-L",{"$f":"COUNTIF(TS4L7_1,O19)*$Q$9","v":0},{"$f":"COUNTIF(TS4L7_2,O19)*$R$9","v":0},{"$f":"COUNTIF(TS4L7_3,O19)*$S$9","v":0},0,null,null,null,"NO"]
[null,null,null,null,null,"","","","","",null,null,null,null,"L7N08","TS4L7-CNA10",{"$f":"COUNTIF(TS4L7_1,O20)*$Q$9","v":0},{"$f":"COUNTIF(TS4L7_2,O20)*$R$9","v":0},{"$f":"COUNTIF(TS4L7_3,O20)*$S$9","v":0},0,null,null,null,"NO"]
[null,null,null,null,null,"","","","","",null,null,null,null,"L7N78","TS4L7-CNA10-L",{"$f":"COUNTIF(TS4L7_1,O21)*$Q$9","v":0},{"$f":"COUNTIF(TS4L7_2,O21)*$R$9","v":0},{"$f":"COUNTIF(TS4L7_3,O21)*$S$9","v":0},0,null,null,null,"NO"]
[null,null,null,null,null,"","","","","",null,null,null,null,"L7N09","TS4L7-BaseT-LP",{"$f":"COUNTIF(TS4L7_1,O22)*$Q$9","v":0},{"$f":"COUNTIF(TS4L7_2,O22)*$R$9","v":0},{"$f":"COUNTIF(TS4L7_3,O22)*$S$9","v":0},0,null,null,null,"NO"]
[null,null,null,null,null,"","","","","",null,null,null,null,"L7N79","TS4L7- BaseT-L",{"$f":"COUNTIF(TS4L7_1,O23)*$Q$9","v":0},{"$f":"COUNTIF(TS4L7_2,O23)*$R$9","v":0},{"$f":"COUNTIF(TS4L7_3,O23)*$S$9","v":0},0,null,null,null,"NO"]
[null,null,null,null,null,"","","","","",null,null,null,null,"L7N10","TS4L7- Opz100Gbit",{"$f":"COUNTIF(TS4L7_1,O24)*$Q$9","v":0},{"$f":"COUNTIF(TS4L7_2,O24)*$R$9","v":0},{"$f":"COUNTIF(TS4L7_3,O24)*$S$9","v":0},0,null,null,null,"NO"]
[null,null,null,null,null,"","","","","",null,null,null,null,"L7N11","TS4L7- FibreChannel",{"$f":"COUNTIF(TS4L7_1,O25)*$Q$9","v":0},{"$f":"COUNTIF(TS4L7_2,O25)*$R$9","v":0},{"$f":"COUNTIF(TS4L7_3,O25)*$S$9","v":0},0,"Quantità 1","Quantità 2","Quantità 3","NO"]
[null,null,null,null,null,"","","","","",null,null,null,null,"L7N12","TS4L7-HDD2TB",{"$f":"COUNTIF(TS4L7_1,O26)*U26*$Q$9","v":0},{"$f":"COUNTIF(TS4L7_2,O26)*V26*$R$9","v":0},{"$f":"COUNTIF(TS4L7_3,O26)*W26*$S$9","v":0},0,{"$f":"Lotto7_R7525_1!$K$52","v":0},{"$f":"Lotto7_R7525_2!$K52","v":0},{"$f":"Lotto7_R7525_3!K52","v":0},"NO"]
[null,null,null,null,null,"","","","","",null,null,null,null,"L7N13","TS4L7-HDD1TB",{"$f":"COUNTIF(TS4L7_1,O27)*U27*$Q$9","v":0},{"$f":"COUNTIF(TS4L7_2,O27)*V27*$R$9","v":0},{"$f":"COUNTIF(TS4L7_3,O27)*W27*$S$9","v":0},0,{"$f":"Lotto7_R7525_1!K54","v":0},{"$f":"Lotto7_R7525_2!K54","v":0},{"$f":"Lotto7_R7525_3!K54","v":0},"NO"]
[null,null,null,null,null,"","","","","",null,null,null,null,"L7N14","TS4L7-SSD-RI3,8TB",{"$f":"COUNTIF(TS4L7_1,O28)*U28*$Q$9","v":0},{"$f":"COUNTIF(TS4L7_2,O28)*V28*$R$9","v":0},{"$f":"COUNTIF(TS4L7_3,O28)*W28*$S$9","v":0},0,{"$f":"Lotto7_R7525_1!K56","v":0},{"$f":"Lotto7_R7525_2!K56","v":0},{"$f":"Lotto7_R7525_3!K56","v":0},"NO"]
[null,null,null,null,null,"","","","","",null,null,null,null,"L7N15","TS4L7-GPU",{"$f":"COUNTIF(TS4L7_1,O29)*$Q$9","v":0},{"$f":"COUNTIF(TS4L7_2,O29)*$R$9","v":0},{"$f":"COUNTIF(TS4L7_3,O29)*$S$9","v":0},0,null,null,null,"NO"]
[null,null,null,null,null,"","","","","",null,null,null,null,"L7N16","TS4L7-SSD-RI1,6TB",{"$f":"COUNTIF(TS4L7_1,O30)*U30*$Q$9","v":0},{"$f":"COUNTIF(TS4L7_2,O30)*V30*$R$9","v":0},{"$f":"COUNTIF(TS4L7_3,O30)*W30*$S$9","v":0},0,{"$f":"Lotto7_R7525_1!K58","v":0},{"$f":"Lotto7_R7525_2!K58","v":0},{"$f":"Lotto7_R7525_3!K58","v":0},"NO"]
[null,null,null,null,null,"","","","","",null,null,null,null,"L7N17","TS4L7-SSD-MU1,6TB",{"$f":"COUNTIF(TS4L7_1,O31)*U31*$Q$9","v":0},{"$f":"COUNTIF(TS4L7_2,O31)*V31*$R$9","v":0},{"$f":"COUNTIF(TS4L7_3,O31)*W31*$S$9","v":0},0,{"$f":"Lotto7_R7525_1!K60","v":0},{"$f":"Lotto7_R7525_2!K60","v":0},{"$f":"Lotto7_R7525_3!K60","v":0},"NO"]
[null,null,null,null,null,"","","","","",null,null,null,null,"L7N18","TS4L7-SSD-RI800GB",{"$f":"COUNTIF(TS4L7_1,O32)*U32*$Q$9","v":0},{"$f":"COUNTIF(TS4L7_2,O32)*V32*$R$9","v":0},{"$f":"COUNTIF(TS4L7_3,O32)*W32*$S$9","v":0},0,{"$f":"IF(Lotto7_R7525_1!K62<=2,0,Lotto7_R7525_1!K62-2)","v":0},{"$f":"IF(Lotto7_R7525_2!L62<=2,0,Lotto7_R7525_2!L62-2)","v":0},{"$f":"IF(Lotto7_R7525_3!M62<=2,0,Lotto7_R7525_3!M62-2)","v":0},"NO"]
[null,null,null,null,null,"","","","","",null,null,null,null,"L7N19","TS4L7-SSD-MU800GB",{"$f":"COUNTIF(TS4L7_1,O33)*U33*$Q$9","v":0},{"$f":"COUNTIF(TS4L7_2,O33)*V33*$R$9","v":0},{"$f":"COUNTIF(TS4L7_3,O33)*W33*$S$9","v":0},0,{"$f":"Lotto7_R7525_1!K64","v":0},{"$f":"Lotto7_R7525_2!K64","v":0},{"$f":"Lotto7_R7525_3!K64","v":0},"NO"]
[null,null,null,null,null,"","","","","",null,null,null,null,"L7N20","TS4L7-UPS",null,null,null,{"$f":"Altre_Opzioni!H13","v":0},null,null,null,"NO"]
[null,null,null,null,null,"","","","","",null,null,null,null,"L7N21","TS4L7-GUI",null,null,null,{"$f":"Altre_Opzioni!H21","v":0},null,null,null,"NO"]
[null,null,null,null,null,"","","","","",null,null,null,null,"L7N22","TS4L7-KVM",null,null,null,{"$f":"Altre_Opzioni!H25","v":0},null,null,null,"NO"]
[null,null,null,null,null,"","","","","",null,null,null,null,"L7N23","TS4L7-WINSRVSTD",{"$f":"COUNTIF(TS4L7_1,O37)*U37*$Q$9","v":0},{"$f":"COUNTIF(TS4L7_2,O37)*V37*$R$9","v":0},{"$f":"COUNTIF(TS4L7_3,O37)*W37*$S$9","v":0},0,{"$f":"Lotto7_R7525_1!K38","v":0},{"$f":"Lotto7_R7525_2!K38","v":0},{"$f":"Lotto7_R7525_3!K38","v":0},"NO"]
[null,null,null,null,null,"","","","","",null,null,null,null,"L7N24","TS4L7-WINDEVCAL",{"$f":"COUNTIF(TS4L7_1,O38)*U38*$Q$9","v":0},{"$f":"COUNTIF(TS4L7_2,O38)*V38*$R$9","v":0},{"$f":"COUNTIF(TS4L7_3,O38)*W38*$S$9","v":0},0,{"$f":"Lotto7_R7525_1!K43","v":0},{"$f":"Lotto7_R7525_2!K43","v":0},{"$f":"Lotto7_R7525_3!K43","v":0},"NO"]
[null,null,null,null,null,"","","","","",null,null,null,null,"L7N25","TS4L7-WINUSRCAL",{"$f":"COUNTIF(TS4L7_1,O39)*U39*$Q$9","v":0},{"$f":"COUNTIF(TS4L7_2,O39)*V39*$R$9","v":0},{"$f":"COUNTIF(TS4L7_3,O39)*W39*$S$9","v":0},0,{"$f":"Lotto7_R7525_1!K44","v":0},{"$f":"Lotto7_R7525_2!K44","v":0},{"$f":"Lotto7_R7525_3!K44","v":0},"NO"]
[null,null,null,null,null,"","","","","",null,null,null,null,"L7N26","TS4L7-WINSRV2C",{"$f":"COUNTIF(TS4L7_1,O40)*U40*$Q$9","v":0},{"$f":"COUNTIF(TS4L7_2,O40)*V40*$R$9","v":0},{"$f":"COUNTIF(TS4L7_3,O40)*W40*$S$9","v":0},0,{"$f":"Lotto7_R7525_1!K39","v":0},{"$f":"Lotto7_R7525_2!K39","v":0},{"$f":"Lotto7_R7525_3!K39","v":0},"NO"]
[null,null,null,null,null,"","","","","",null,null,null,null,"L7N27","TS4L7-LINUX",{"$f":"COUNTIF(TS4L7_1,O41)*$Q$9","v":0},{"$f":"COUNTIF(TS4L7_2,O41)*$R$9","v":0},{"$f":"COUNTIF(TS4L7_3,O41)*$S$9","v":0},0,null,null,null,"NO"]
[null,null,null,null,null,"","","","","",null,null,null,null,"L7N28","TS4L7-HDRTN36",{"$f":"COUNTIF(TS4L7_1,O42)*$Q$9","v":0},{"$f":"COUNTIF(TS4L7_2,O42)*$R$9","v":0},{"$f":"COUNTIF(TS4L7_3,O42)*$S$9","v":0},0,null,null,null,"NO"]
[null,null,null,null,null,"","","","","",null,null,null,null,"L7N29","TS4L7-OpzEst24",{"$f":"COUNTIF(TS4L7_1,O43)*$Q$9","v":0},{"$f":"COUNTIF(TS4L7_2,O43)*$R$9","v":0},{"$f":"COUNTIF(TS4L7_3,O43)*$S$9","v":0},0,null,null,null,"NO"]
[null,null,null,null,null,"","","","","",null,null,null,null,"L7N30","TS4L7-RACK",null,null,null,{"$f":"Altre_Opzioni!H17","v":0},null,null,null,"NO"]
[null,null,null,null,null,"","","","","",null,null,null,null,"L7N31","TS4L7-OpzEst24GPU",{"$f":"COUNTIF(TS4L7_1,O45)*U45*$Q$9","v":0},{"$f":"COUNTIF(TS4L7_2,O45)*V45*$R$9","v":0},{"$f":"COUNTIF(TS4L7_3,O45)*W45*$S$9","v":0},0,{"$f":"Lotto7_R7525_1!K137","v":2},{"$f":"Lotto7_R7525_2!K137","v":2},{"$f":"Lotto7_R7525_3!K137","v":3},"NO"]
[null,null,null,null,null,null,null,null,null,null,null,null,null,null,null,null,null,null,null,null,null,null,null,"SI"]
[null,null,null,null,null,null,null,null,null,null,null,null,null,null,null,null,null,null,null,null,null,null,null,"SI"]
[null,null,null,null,null,"Opzioni 20 %",null,null,null,null,null,null,null,null,null,null,"Config 1","Config 2","Config 3","Totale",null,null,null,{"$f":"IF(J59>0,\"SI\",\"NO\")","v":"NO"}]
[null,null,null,null,null,"Codice Produttore","Codice Convenzione","Qtà","Costo unitario","Costo Totale",null,null,null,null,"N°","Codice Convenzione",{"$f":"Lotto7_R7525_1!K6","v":0},{"$f":"Lotto7_R7525_2!K6","v":0},{"$f":"Lotto7_R7525_3!K6","v":0},{"$f":"SUM(Q49:S49)","v":0},"Quantità 1","Quantità 2","Quantità 3",{"$f":"IF(J59>0,\"SI\",\"NO\")","v":"NO"}]
[null,null,null,null,null,{"$f":"IF(H50=\"\",\"\",VLOOKUP(O50,TABELLA_PREZZI,10,FALSE))","v":""},{"$f":"IF(H50=\"\",\"\",VLOOKUP(O50,TABELLA_PREZZI,6,FALSE))","v":""},{"$f":"IF(T50>0,T50,\"\")","v":""},{"$f":"IF(H50=\"\",\"\",VLOOKUP(O50,TABELLA_PREZZI,4,FALSE))","v":""},{"$f":"IF(F50=\"\",\"\",I50*H50)","v":""},null,null,null,null,"L7N32","TS4L7-OpzSSD7,68",{"$f":"COUNTIF(TS4L7_1,O50)*$U$50*$Q$9","v":0},{"$f":"COUNTIF(TS4L7_2,O50)*$V$50*$R$9","v":0},{"$f":"COUNTIF(TS4L7_3,O50)*$W$50*$S$9","v":0},{"$f":"SUM(Q50:S50)","v":0},null,null,null,{"$f":"IF($H50<>\"\",\"SI\",\"NO\")","v":"NO"}]
[null,null,null,null,null,{"$f":"IF(H51=\"\",\"\",VLOOKUP(O51,TABELLA_PREZZI,10,FALSE))","v":""},{"$f":"IF(H51=\"\",\"\",VLOOKUP(O51,TABELLA_PREZZI,6,FALSE))","v":""},{"$f":"IF(T51>0,T51,\"\")","v":""},{"$f":"IF(H51=\"\",\"\",VLOOKUP(O51,TABELLA_PREZZI,4,FALSE))","v":""},{"$f":"IF(F51=\"\",\"\",I51*H51)","v":""},null,null,null,null,"L7N33","TS4L7-OpzNVMe3,2",null,null,null,0,null,null,null,{"$f":"IF($H51<>\"\",\"SI\",\"NO\")","v":"NO"}]
[null,null,null,null,null,{"$f":"IF(H52=\"\",\"\",VLOOKUP(O52,TABELLA_PREZZI,10,FALSE))","v":""},{"$f":"IF(H52=\"\",\"\",VLOOKUP(O52,TABELLA_PREZZI,6,FALSE))","v":""},"",{"$f":"IF(H52=\"\",\"\",VLOOKUP(O52,TABELLA_PREZZI,4,FALSE))","v":""},"",null,null,null,null,"L7N34","TS4L7-OpzNVMe1,92",null,null,null,0,null,null,null,"NO"]
[null,null,null,null,null,{"$f":"IF(H53=\"\",\"\",VLOOKUP(O53,TABELLA_PREZZI,10,FALSE))","v":""},{"$f":"IF(H53=\"\",\"\",VLOOKUP(O53,TABELLA_PREZZI,6,FALSE))","v":""},"",{"$f":"IF(H53=\"\",\"\",VLOOKUP(O53,TABELLA_PREZZI,4,FALSE))","v":""},"",null,null,null,null,"L7N35","TS4L7-OpzNVMe3,84",{"$f":"COUNTIF(TS4L7_1,O53)*$U$53*$Q$9","v":0},{"$f":"COUNTIF(TS4L7_2,O53)*$V$53*$R$9","v":0},{"$f":"COUNTIF(TS4L7_3,O53)*$W$53*$S$9","v":0},0,null,null,null,"NO"]
[null,null,null,null,null,null,null,null,null,null,null,null,null,null,null,null,null,null,null,null,null,null,null,"SI"]
[]
[]
[null,null,null,null,null,null,null,null,null,null,null,null,null,null,null,null,null,null,null,null,null,null,null,"SI"]
[null,null,null,null,null,null,null,"Totale Convenzione",null,{"$f":"SUM(J10:J45)","v":0},null,null,null,null,null,null,null,null,null,null,null,null,null,"SI"]
[null,null,null,null,null,"Quota Massima 20%",{"$f":"J61*20%","v":0},"Totale 20%",null,{"$f":"SUM(J50:J53)","v":0},null,null,null,null,null,null,null,null,null,null,null,null,null,"SI"]
[null,null,null,null,null,null,null,"Totale Iva Esclusa",null,{"$f":"J58+J59","v":0},null,null,null,null,null,null,null,null,null,null,null,null,null,"SI"]
[null,null,null,null,null,null,null,"Totale Ordine",null,{"$f":"J60+(J60*22%)","v":0},null,null,null,null,null,null,null,null,null,null,null,null,null,"SI"]
[null,null,null,null,null,null,null,null,null,null,null,null,null,null,null,null,null,null,null,null,null,null,null,"SI"]

{"sheet":"ConfigurationTS3L4","index":5,"n_rows":597,"n_cols":30,"rows_kept":597,"cut":false,"hidden":true,"merged":[]}
[]
[null,"Module Name","Option ID","Option Name","Option List Price","SKUs","Qty","SKU Customer Kit","Attributo","Valore inserito",null,"N°","Codice Convenzione"]
["PowerEdge R7525 Server (General Purpose)","Chassis with Up to 16 x 2.5 Hard Drives for 1CPU Configuration",null,{"$f":"VLOOKUP(L3,Tabella_prezzi!$A$1:$L$189,8,FALSE)","v":0},null,null,null,{"$f":"VLOOKUP(L3,Tabella_prezzi!$A$1:$L$189,9,FALSE)","v":"PowerEdge R7525 Server"},{"$f":"VLOOKUP(L3,Tabella_prezzi!$A$1:$L$189,3,FALSE)","v":"Server rackable bi-processore prest."},{"$f":"VLOOKUP(L3,Tabella_prezzi!$A$1:$L$189,4,FALSE)","v":4047.7},null,"L7N01",{"$f":"VLOOKUP(L3,Tabella_prezzi!$A$1:$L$189,6,FALSE)","v":"TS4L7-SRV"}]
["PowerEdge R7525 Server (GPU Double-Wide Ready)","Chassis with Up to 16 x 2.5 Hard Drives for 2CPU, GPU Double-Wide Configuration",null,{"$f":"VLOOKUP(L4,Tabella_prezzi!$A$1:$L$189,8,FALSE)","v":0},null,null,null,{"$f":"VLOOKUP(L4,Tabella_prezzi!$A$1:$L$189,9,FALSE)","v":"PowerEdge R7525 Server"},{"$f":"VLOOKUP(L4,Tabella_prezzi!$A$1:$L$189,3,FALSE)","v":"Server rackable bi-processore prest."},{"$f":"VLOOKUP(L4,Tabella_prezzi!$A$1:$L$189,4,FALSE)","v":4047.7},null,"L7N01",{"$f":"VLOOKUP(L4,Tabella_prezzi!$A$1:$L$189,6,FALSE)","v":"TS4L7-SRV"}]
["PowerEdge R7525 Server (GPU Single-Wide Ready)","Chassis with Up to 16 x 2.5 Hard Drives for 2CPU, GPU Single-Wide Configuration",null,{"$f":"VLOOKUP(L5,Tabella_prezzi!$A$1:$L$189,8,FALSE)","v":0},null,null,null,{"$f":"VLOOKUP(L5,Tabella_prezzi!$A$1:$L$189,9,FALSE)","v":"PowerEdge R7525 Server"},{"$f":"VLOOKUP(L5,Tabella_prezzi!$A$1:$L$189,3,FALSE)","v":"Server rackable bi-processore prest."},{"$f":"VLOOKUP(L5,Tabella_prezzi!$A$1:$L$189,4,FALSE)","v":4047.7},null,"L7N01",{"$f":"VLOOKUP(L5,Tabella_prezzi!$A$1:$L$189,6,FALSE)","v":"TS4L7-SRV"}]
["PowerEdge R7525 Server (GPU Double-Wide Ready)","Chassis with Up to 16 x 2.5 Hard Drives for 2CPU, GPU Double-Wide Configuration",null,{"$f":"VLOOKUP(L6,Tabella_prezzi!$A$1:$L$189,8,FALSE)","v":0},null,null,null,{"$f":"VLOOKUP(L6,Tabella_prezzi!$A$1:$L$189,9,FALSE)","v":"PowerEdge R7525 Server"},{"$f":"VLOOKUP(L6,Tabella_prezzi!$A$1:$L$189,3,FALSE)","v":"Server rackable bi-processore prest."},{"$f":"VLOOKUP(L6,Tabella_prezzi!$A$1:$L$189,4,FALSE)","v":4047.7},null,"L7N01",{"$f":"VLOOKUP(L6,Tabella_prezzi!$A$1:$L$189,6,FALSE)","v":"TS4L7-SRV"}]
[]
["TS3L7_Chassis"]
["PowerEdge R7525 Server (General Purpose)","Chassis with Up to 16 x 2.5 Hard Drives for 1CPU Configuration","Chassis with Up to 16 x 2.5'' Hard Drives for 2CPU Configuration",null,null,0,1,{"$f":"VLOOKUP(L9,Tabella_prezzi!$A$1:$L$189,9,FALSE)","v":"Kit upgrade chassies for 2 CPU"},"TS4-Opz1CPU",null,{"$f":"VLOOKUP(L9,Tabella_prezzi!$A$1:$L$189,4,FALSE)","v":0},"L7N105",{"$f":"\"\"","v":""}]
["PowerEdge R7525 Server (nVME)","Chassis with Up to 16X 2.5 SAS/SATA + 8X 2.5 NVME for 2CPU Configuration","Chassis with Up to 16X 2.5 SAS/SATA + 8X 2.5 NVME for 2CPU Configuration","Kit upgrade chassies for Server nVME",null,null,1,{"$f":"VLOOKUP(L10,Tabella_prezzi!$A$1:$L$189,9,FALSE)","v":"Kit upgrade chassies for Server nVME"},{"$f":"VLOOKUP(L10,Tabella_prezzi!$A$1:$L$189,9,FALSE)","v":"Kit upgrade chassies for Server nVME"},null,{"$f":"VLOOKUP(L10,Tabella_prezzi!$A$1:$L$189,4,FALSE)","v":0},"L7N97",{"$f":"VLOOKUP(L10,Tabella_prezzi!$A$1:$L$189,6,FALSE)","v":"TS4L7-NVME"}]
["PowerEdge R7525 Server (vSAN Ready)","Chassis with Up to 16X 2.5 SAS/SATA + 8X 2.5 NVME for 2CPU Configuration","Chassis with Up to 16X 2.5 SAS/SATA + 8X 2.5 NVME for 2CPU Configuration",{"$f":"VLOOKUP(L11,Tabella_prezzi!$A$1:$L$189,8,FALSE)","v":"Kit upgrade chassies for Server vSAN Ready"},null,null,1,{"$f":"VLOOKUP(L11,Tabella_prezzi!$A$1:$L$189,9,FALSE)","v":"Kit upgrade chassies for Server vSAN Ready"},{"$f":"VLOOKUP(L11,Tabella_prezzi!$A$1:$L$189,9,FALSE)","v":"Kit upgrade chassies for Server vSAN Ready"},null,{"$f":"VLOOKUP(L11,Tabella_prezzi!$A$1:$L$189,4,FALSE)","v":0},"L7N38",{"$f":"VLOOKUP(L11,Tabella_prezzi!$A$1:$L$189,6,FALSE)","v":"TS4L7-VSAN"}]
["PowerEdge R7525 Server (GPU Single-Wide Ready)","Chassis with Up to 16 x 2.5 Hard Drives for 2CPU, GPU Single-Wide Configuration","Chassis with Up to 16 x 2.5 Hard Drives for 2CPU, GPU Single-Wide Configuration",{"$f":"VLOOKUP(L12,Tabella_prezzi!$A$1:$L$189,8,FALSE)","v":"Kit upgrade chassies for Server GPU Single-Wide Ready"},null,null,1,{"$f":"VLOOKUP(L12,Tabella_prezzi!$A$1:$L$189,9,FALSE)","v":"Kit upgrade chassies for Server GPU Single-Wide Ready"},{"$f":"VLOOKUP(L12,Tabella_prezzi!$A$1:$L$189,9,FALSE)","v":"Kit upgrade chassies for Server GPU Single-Wide Ready"},null,{"$f":"VLOOKUP(L12,Tabella_prezzi!$A$1:$L$189,4,FALSE)","v":299},"L7N36",{"$f":"VLOOKUP(L12,Tabella_prezzi!$A$1:$L$189,6,FALSE)","v":"TS4L7-GPUSW"}]
["PowerEdge R7525 Server (GPU Double-Wide Ready)","Chassis with Up to 16 x 2.5 Hard Drives for 2CPU, GPU Double-Wide Configuration","Chassis with Up to 16 x 2.5 Hard Drives for 2CPU, GPU Double-Wide Configuration",{"$f":"VLOOKUP(L13,Tabella_prezzi!$A$1:$L$189,8,FALSE)","v":"Kit upgrade chassies for Server GPU Double-Wide Ready"},null,null,1,{"$f":"VLOOKUP(L13,Tabella_prezzi!$A$1:$L$189,9,FALSE)","v":"Kit upgrade chassies for Server GPU Double-Wide Ready"},{"$f":"VLOOKUP(L13,Tabella_prezzi!$A$1:$L$189,9,FALSE)","v":"Kit upgrade chassies for Server GPU Double-Wide Ready"},null,{"$f":"VLOOKUP(L13,Tabella_prezzi!$A$1:$L$189,4,FALSE)","v":0},"L7N37",{"$f":"VLOOKUP(L13,Tabella_prezzi!$A$1:$L$189,6,FALSE)","v":"TS4L7-GPUDW"}]
[]
["TS3L7_CPU"]
["No Additional Processor",null,null,null,null,null,0,null,{"$f":"\"\"","v":""},null,null,{"$f":"\"\"","v":""},{"$f":"\"\"","v":""}]
[{"$f":"D17","v":"AMD EPYC 7313 3.0GHz, 16C/32T, 128M Cache (155W) DDR4-3200"},null,null,{"$f":"VLOOKUP(L17,Tabella_prezzi!$A$1:$L$189,8,FALSE)","v":"AMD EPYC 7313 3.0GHz, 16C/32T, 128M Cache (155W) DDR4-3200"},null,null,1,{"$f":"VLOOKUP(L17,Tabella_prezzi!$A$1:$L$189,9,FALSE)","v":"AMD EPYC 7313 3.0GHz, 16C/32T, 128M Cache (155W) DDR4-3200"},{"$f":"VLOOKUP(L17,Tabella_prezzi!$A$1:$L$189,3,FALSE)","v":"Kit n. 1 Processore aggiuntivo"},{"$f":"VLOOKUP(L17,Tabella_prezzi!$A$1:$L$189,4,FALSE)","v":680.84},null,"L7N02",{"$f":"VLOOKUP(L17,Tabella_prezzi!$A$1:$L$189,6,FALSE)","v":"TS4L7-CPU"}]
["AMD7413 2.65GHz,24C/48T,128M,180W,3200CK",null,null,{"$f":"VLOOKUP(L18,Tabella_prezzi!$A$1:$L$189,8,FALSE)","v":"Upgrade da Processore aggiuntivo a Processore 8 core"},null,null,1,{"$f":"VLOOKUP(L18,Tabella_prezzi!$A$1:$L$189,9,FALSE)","v":"Upgrade da Processore aggiuntivo a Processore 8 core"},{"$f":"VLOOKUP(L18,Tabella_prezzi!$A$1:$L$189,3,FALSE)","v":"Kit n. 1 Processore 8 Core aggiuntivo"},null,{"$f":"VLOOKUP(L18,Tabella_prezzi!$A$1:$L$189,4,FALSE)","v":99999},"L7N48",{"$f":"VLOOKUP(L18,Tabella_prezzi!$A$1:$L$189,6,FALSE)","v":"TS4L7-CPU8CORE"}]
[]
["TS3L7_CPU8core"]
["AMD EPYC 7313 3.0GHz, 16C/32T, 128M Cache (155W) DDR4-3200",null,null,null,null,null,0,null,{"$f":"\"\"","v":""},null,null,{"$f":"\"\"","v":""},{"$f":"\"\"","v":""}]
["AMD7413 2.65GHz,24C/48T,128M,180W,3200CK",null,null,{"$f":"VLOOKUP(L22,Tabella_prezzi!$A$1:$L$189,8,FALSE)","v":"Upgrade da Processore base a Processore 8 core"},null,null,1,{"$f":"VLOOKUP(L22,Tabella_prezzi!$A$1:$L$189,9,FALSE)","v":"Upgrade da Processore base a Processore 8 core"},{"$f":"VLOOKUP(L22,Tabella_prezzi!$A$1:$L$189,3,FALSE)","v":"Kit n. 1 Processore 8 Core base"},null,{"$f":"VLOOKUP(L22,Tabella_prezzi!$A$1:$L$189,4,FALSE)","v":99999},"L7N47",{"$f":"VLOOKUP(L22,Tabella_prezzi!$A$1:$L$189,6,FALSE)","v":"TS4L7-SRV8CORE"}]
[]
["TS3L7_CPU8coreadd"]
["No Additional Processor",null,null,null,null,null,0,null,{"$f":"\"\"","v":""},null,null,{"$f":"\"\"","v":""},{"$f":"\"\"","v":""}]
["AMD EPYC 7313 3.0GHz, 16C/32T, 128M Cache (155W) DDR4-3200",null,null,{"$f":"VLOOKUP(L26,Tabella_prezzi!$A$1:$L$189,8,FALSE)","v":"Upgrade da Processore aggiuntivo a Processore 8 core"},null,null,1,{"$f":"VLOOKUP(L26,Tabella_prezzi!$A$1:$L$189,9,FALSE)","v":"Upgrade da Processore aggiuntivo a Processore 8 core"},{"$f":"VLOOKUP(L26,Tabella_prezzi!$A$1:$L$189,3,FALSE)","v":"Kit n. 1 Processore 8 Core aggiuntivo"},null,{"$f":"VLOOKUP(L26,Tabella_prezzi!$A$1:$L$189,4,FALSE)","v":99999},"L7N48",{"$f":"VLOOKUP(L26,Tabella_prezzi!$A$1:$L$189,6,FALSE)","v":"TS4L7-CPU8CORE"}]
[]
[]
["TS3L7_RAM (1CPU)"]
[256,"Memory Capacity",null,{"$f":"VLOOKUP(L30,Tabella_prezzi!$A$1:$L$189,8,FALSE)","v":"32GB - 2Rx4 DDR4 RDIMM 3200MHz"},null,"370-AEVP",0,{"$f":"VLOOKUP(L30,Tabella_prezzi!$A$1:$L$189,9,FALSE)","v":"32GB - 2Rx4 DDR4 RDIMM 3200MHz"},{"$f":"VLOOKUP(L30,Tabella_prezzi!$A$1:$L$189,3,FALSE)","v":"OpzRAM32GB"},{"$f":"VLOOKUP(L30,Tabella_prezzi!$A$1:$L$189,4,FALSE)*G30","v":0},null,"L7N03",{"$f":"VLOOKUP(L30,Tabella_prezzi!$A$1:$L$189,6,FALSE)","v":"TS4L7-RAM32"}]
[{"$f":"(32*G31)+256","v":384},"Memory Capacity",null,{"$f":"VLOOKUP(L31,Tabella_prezzi!$A$1:$L$189,8,FALSE)","v":"32GB - 2Rx4 DDR4 RDIMM 3200MHz"},null,"370-AEVP",4,{"$f":"VLOOKUP(L31,Tabella_prezzi!$A$1:$L$189,9,FALSE)","v":"32GB - 2Rx4 DDR4 RDIMM 3200MHz"},{"$f":"VLOOKUP(L31,Tabella_prezzi!$A$1:$L$189,3,FALSE)","v":"OpzRAM32GB"},{"$f":"VLOOKUP(L31,Tabella_prezzi!$A$1:$L$189,4,FALSE)*G31","v":1055.48},null,"L7N03",{"$f":"VLOOKUP(L31,Tabella_prezzi!$A$1:$L$189,6,FALSE)","v":"TS4L7-RAM32"}]
[{"$f":"(32*G32)+256","v":448},"Memory Capacity",null,{"$f":"VLOOKUP(L32,Tabella_prezzi!$A$1:$L$189,8,FALSE)","v":"32GB - 2Rx4 DDR4 RDIMM 3200MHz"},null,"370-AEVP",6,{"$f":"VLOOKUP(L32,Tabella_prezzi!$A$1:$L$189,9,FALSE)","v":"32GB - 2Rx4 DDR4 RDIMM 3200MHz"},{"$f":"VLOOKUP(L32,Tabella_prezzi!$A$1:$L$189,3,FALSE)","v":"OpzRAM32GB"},{"$f":"VLOOKUP(L32,Tabella_prezzi!$A$1:$L$189,4,FALSE)*G32","v":1583.22},null,"L7N03",{"$f":"VLOOKUP(L32,Tabella_prezzi!$A$1:$L$189,6,FALSE)","v":"TS4L7-RAM32"}]
[512,"Memory Capacity",null,{"$f":"VLOOKUP(L33,Tabella_prezzi!$A$1:$L$189,8,FALSE)","v":"32GB - 2Rx4 DDR4 RDIMM 3200MHz"},null,"370-AEVP",8,{"$f":"VLOOKUP(L33,Tabella_prezzi!$A$1:$L$189,9,FALSE)","v":"32GB - 2Rx4 DDR4 RDIMM 3200MHz"},{"$f":"VLOOKUP(L33,Tabella_prezzi!$A$1:$L$189,3,FALSE)","v":"OpzRAM32GB"},{"$f":"VLOOKUP(L33,Tabella_prezzi!$A$1:$L$189,4,FALSE)*G33","v":2110.96},null,"L7N03",{"$f":"VLOOKUP(L33,Tabella_prezzi!$A$1:$L$189,6,FALSE)","v":"TS4L7-RAM32"}]
[576,"Memory Capacity",null,{"$f":"VLOOKUP(L34,Tabella_prezzi!$A$1:$L$189,8,FALSE)","v":"32GB - 2Rx4 DDR4 RDIMM 3200MHz"},null,"370-AEVP",10,{"$f":"VLOOKUP(L34,Tabella_prezzi!$A$1:$L$189,9,FALSE)","v":"32GB - 2Rx4 DDR4 RDIMM 3200MHz"},{"$f":"VLOOKUP(L34,Tabella_prezzi!$A$1:$L$189,3,FALSE)","v":"OpzRAM32GB"},{"$f":"VLOOKUP(L34,Tabella_prezzi!$A$1:$L$189,4,FALSE)*G34","v":2638.7},null,"L7N03",{"$f":"VLOOKUP(L34,Tabella_prezzi!$A$1:$L$189,6,FALSE)","v":"TS4L7-RAM32"}]
[640,"Memory Capacity",null,{"$f":"VLOOKUP(L35,Tabella_prezzi!$A$1:$L$189,8,FALSE)","v":"32GB - 2Rx4 DDR4 RDIMM 3200MHz"},null,"370-AEVP",12,{"$f":"VLOOKUP(L35,Tabella_prezzi!$A$1:$L$189,9,FALSE)","v":"32GB - 2Rx4 DDR4 RDIMM 3200MHz"},{"$f":"VLOOKUP(L35,Tabella_prezzi!$A$1:$L$189,3,FALSE)","v":"OpzRAM32GB"},{"$f":"VLOOKUP(L35,Tabella_prezzi!$A$1:$L$189,4,FALSE)*G35","v":3166.44},null,"L7N03",{"$f":"VLOOKUP(L35,Tabella_prezzi!$A$1:$L$189,6,FALSE)","v":"TS4L7-RAM32"}]
[704,"Memory Capacity",null,{"$f":"VLOOKUP(L36,Tabella_prezzi!$A$1:$L$189,8,FALSE)","v":"32GB - 2Rx4 DDR4 RDIMM 3200MHz"},null,"370-AEVP",14,{"$f":"VLOOKUP(L36,Tabella_prezzi!$A$1:$L$189,9,FALSE)","v":"32GB - 2Rx4 DDR4 RDIMM 3200MHz"},{"$f":"VLOOKUP(L36,Tabella_prezzi!$A$1:$L$189,3,FALSE)","v":"OpzRAM32GB"},{"$f":"VLOOKUP(L36,Tabella_prezzi!$A$1:$L$189,4,FALSE)*G36","v":3694.1800000000003},null,"L7N03",{"$f":"VLOOKUP(L36,Tabella_prezzi!$A$1:$L$189,6,FALSE)","v":"TS4L7-RAM32"}]
[768,"Memory Capacity",null,{"$f":"VLOOKUP(L37,Tabella_prezzi!$A$1:$L$189,8,FALSE)","v":"32GB - 2Rx4 DDR4 RDIMM 3200MHz"},null,"370-AEVP",16,{"$f":"VLOOKUP(L37,Tabella_prezzi!$A$1:$L$189,9,FALSE)","v":"32GB - 2Rx4 DDR4 RDIMM 3200MHz"},{"$f":"VLOOKUP(L37,Tabella_prezzi!$A$1:$L$189,3,FALSE)","v":"OpzRAM32GB"},{"$f":"VLOOKUP(L37,Tabella_prezzi!$A$1:$L$189,4,FALSE)*G37","v":4221.92},null,"L7N03",{"$f":"VLOOKUP(L37,Tabella_prezzi!$A$1:$L$189,6,FALSE)","v":"TS4L7-RAM32"}]
[832,"Memory Capacity",null,{"$f":"VLOOKUP(L38,Tabella_prezzi!$A$1:$L$189,8,FALSE)","v":"32GB - 2Rx4 DDR4 RDIMM 3200MHz"},null,"370-AEVP",18,{"$f":"VLOOKUP(L38,Tabella_prezzi!$A$1:$L$189,9,FALSE)","v":"32GB - 2Rx4 DDR4 RDIMM 3200MHz"},{"$f":"VLOOKUP(L38,Tabella_prezzi!$A$1:$L$189,3,FALSE)","v":"OpzRAM32GB"},{"$f":"VLOOKUP(L38,Tabella_prezzi!$A$1:$L$189,4,FALSE)*G38","v":4749.66},null,"L7N03",{"$f":"VLOOKUP(L38,Tabella_prezzi!$A$1:$L$189,6,FALSE)","v":"TS4L7-RAM32"}]
[896,"Memory Capacity",null,{"$f":"VLOOKUP(L69,Tabella_prezzi!$A$1:$L$189,8,FALSE)","v":"64GB - 2RX4 DDR4 RDIMM 3200MHz"},null,"370-AEVP",20,{"$f":"VLOOKUP(L69,Tabella_prezzi!$A$1:$L$189,9,FALSE)","v":"64GB - 2RX4 DDR4 RDIMM 3200MHz"},{"$f":"VLOOKUP(L69,Tabella_prezzi!$A$1:$L$189,3,FALSE)","v":"OpzRAM64GB"},{"$f":"VLOOKUP(L69,Tabella_prezzi!$A$1:$L$189,4,FALSE)*G39","v":6052},null,"L7N03",{"$f":"VLOOKUP(L69,Tabella_prezzi!$A$1:$L$189,6,FALSE)","v":"TS4L7-RAM64"}]
[960,"Memory Capacity",null,{"$f":"VLOOKUP(L70,Tabella_prezzi!$A$1:$L$189,8,FALSE)","v":"64GB - 2RX4 DDR4 RDIMM 3200MHz"},null,"370-AEVP",22,{"$f":"VLOOKUP(L70,Tabella_prezzi!$A$1:$L$189,9,FALSE)","v":"64GB - 2RX4 DDR4 RDIMM 3200MHz"},{"$f":"VLOOKUP(L70,Tabella_prezzi!$A$1:$L$189,3,FALSE)","v":"OpzRAM64GB"},{"$f":"VLOOKUP(L70,Tabella_prezzi!$A$1:$L$189,4,FALSE)*G40","v":6657.2000000000007},null,"L7N03",{"$f":"VLOOKUP(L70,Tabella_prezzi!$A$1:$L$189,6,FALSE)","v":"TS4L7-RAM64"}]
[1024,"Memory Capacity",null,{"$f":"VLOOKUP(L71,Tabella_prezzi!$A$1:$L$189,8,FALSE)","v":"64GB - 2RX4 DDR4 RDIMM 3200MHz"},null,"370-AEVP",24,{"$f":"VLOOKUP(L71,Tabella_prezzi!$A$1:$L$189,9,FALSE)","v":"64GB - 2RX4 DDR4 RDIMM 3200MHz"},{"$f":"VLOOKUP(L71,Tabella_prezzi!$A$1:$L$189,3,FALSE)","v":"OpzRAM64GB"},{"$f":"VLOOKUP(L71,Tabella_prezzi!$A$1:$L$189,4,FALSE)*G41","v":7262.4000000000005},null,"L7N03",{"$f":"VLOOKUP(L71,Tabella_prezzi!$A$1:$L$189,6,FALSE)","v":"TS4L7-RAM64"}]
[1088,"Memory Capacity",null,{"$f":"VLOOKUP(L72,Tabella_prezzi!$A$1:$L$189,8,FALSE)","v":"64GB - 2RX4 DDR4 RDIMM 3200MHz"},null,"370-AEVP",26,{"$f":"VLOOKUP(L72,Tabella_prezzi!$A$1:$L$189,9,FALSE)","v":"64GB - 2RX4 DDR4 RDIMM 3200MHz"},{"$f":"VLOOKUP(L72,Tabella_prezzi!$A$1:$L$189,3,FALSE)","v":"OpzRAM64GB"},{"$f":"VLOOKUP(L72,Tabella_prezzi!$A$1:$L$189,4,FALSE)*G42","v":7867.6},null,"L7N03",{"$f":"VLOOKUP(L72,Tabella_prezzi!$A$1:$L$189,6,FALSE)","v":"TS4L7-RAM64"}]
[1152,"Memory Capacity",null,{"$f":"VLOOKUP(L73,Tabella_prezzi!$A$1:$L$189,8,FALSE)","v":{"$error":"#N/A"}},null,"370-AEVP",28,{"$f":"VLOOKUP(L73,Tabella_prezzi!$A$1:$L$189,9,FALSE)","v":{"$error":"#N/A"}},{"$f":"VLOOKUP(L73,Tabella_prezzi!$A$1:$L$189,3,FALSE)","v":{"$error":"#N/A"}},{"$f":"VLOOKUP(L73,Tabella_prezzi!$A$1:$L$189,4,FALSE)*G43","v":{"$error":"#N/A"}},null,"L7N03",{"$f":"VLOOKUP(L73,Tabella_prezzi!$A$1:$L$189,6,FALSE)","v":{"$error":"#N/A"}}]
[]
["TS3L7_RAM (2CPU)"]
[256,"Memory Capacity",null,{"$f":"VLOOKUP(L77,Tabella_prezzi!$A$1:$L$189,8,FALSE)","v":"Windows Server 2022,Standard,ROK,16CORE"},null,"370-AEVP",0,{"$f":"VLOOKUP(L77,Tabella_prezzi!$A$1:$L$189,9,FALSE)","v":"Windows Server 2022,Standard,ROK,16CORE"},{"$f":"VLOOKUP(L77,Tabella_prezzi!$A$1:$L$189,3,FALSE)","v":"OpzWinServSTD"},{"$f":"VLOOKUP(L77,Tabella_prezzi!$A$1:$L$189,4,FALSE)*G46","v":0},null,"L7N03",{"$f":"VLOOKUP(L77,Tabella_prezzi!$A$1:$L$189,6,FALSE)","v":"TS4L7-WINSRVSTD"}]
[{"$f":"(32*G47)+256","v":384},"Memory Capacity",null,{"$f":"VLOOKUP(L78,Tabella_prezzi!$A$1:$L$189,8,FALSE)","v":"Windows Server 2022 Standard Edition, Add License,2CORE"},null,"370-AEVP",4,{"$f":"VLOOKUP(L78,Tabella_prezzi!$A$1:$L$189,9,FALSE)","v":"Windows Server 2022 Standard Edition, Add License,2CORE"},{"$f":"VLOOKUP(L78,Tabella_prezzi!$A$1:$L$189,3,FALSE)","v":"OpzWinServSTD2core"},{"$f":"VLOOKUP(L78,Tabella_prezzi!$A$1:$L$189,4,FALSE)*G47","v":371.76},null,"L7N03",{"$f":"VLOOKUP(L78,Tabella_prezzi!$A$1:$L$189,6,FALSE)","v":"TS4L7-WINSRV2C"}]
[448,"Memory Capacity",null,{"$f":"VLOOKUP(L76,Tabella_prezzi!$A$1:$L$189,8,FALSE)","v":"Ubuntu Server 22.04 LTS 64 Bit"},null,"370-AEVP",6,{"$f":"VLOOKUP(L76,Tabella_prezzi!$A$1:$L$189,9,FALSE)","v":"Ubuntu Server 22.04 LTS 64 Bit"},{"$f":"VLOOKUP(L76,Tabella_prezzi!$A$1:$L$189,3,FALSE)","v":"OpzOpenSource"},{"$f":"VLOOKUP(L76,Tabella_prezzi!$A$1:$L$189,4,FALSE)*G48","v":222.71999999999997},null,"L7N03",{"$f":"VLOOKUP(L76,Tabella_prezzi!$A$1:$L$189,6,FALSE)","v":"TS4L7-LINUX"}]
[512,"Memory Capacity",null,{"$f":"VLOOKUP(L49,Tabella_prezzi!$A$1:$L$189,8,FALSE)","v":"32GB - 2Rx4 DDR4 RDIMM 3200MHz"},null,"370-AEVP",8,{"$f":"VLOOKUP(L49,Tabella_prezzi!$A$1:$L$189,9,FALSE)","v":"32GB - 2Rx4 DDR4 RDIMM 3200MHz"},{"$f":"VLOOKUP(L49,Tabella_prezzi!$A$1:$L$189,3,FALSE)","v":"OpzRAM32GB"},{"$f":"VLOOKUP(L49,Tabella_prezzi!$A$1:$L$189,4,FALSE)*G49","v":2110.96},null,"L7N03",{"$f":"VLOOKUP(L49,Tabella_prezzi!$A$1:$L$189,6,FALSE)","v":"TS4L7-RAM32"}]
[576,"Memory Capacity",null,{"$f":"VLOOKUP(L50,Tabella_prezzi!$A$1:$L$189,8,FALSE)","v":"32GB - 2Rx4 DDR4 RDIMM 3200MHz"},null,"370-AEVP",10,{"$f":"VLOOKUP(L50,Tabella_prezzi!$A$1:$L$189,9,FALSE)","v":"32GB - 2Rx4 DDR4 RDIMM 3200MHz"},{"$f":"VLOOKUP(L50,Tabella_prezzi!$A$1:$L$189,3,FALSE)","v":"OpzRAM32GB"},{"$f":"VLOOKUP(L50,Tabella_prezzi!$A$1:$L$189,4,FALSE)*G50","v":2638.7},null,"L7N03",{"$f":"VLOOKUP(L50,Tabella_prezzi!$A$1:$L$189,6,FALSE)","v":"TS4L7-RAM32"}]
[640,"Memory Capacity",null,{"$f":"VLOOKUP(L51,Tabella_prezzi!$A$1:$L$189,8,FALSE)","v":"32GB - 2Rx4 DDR4 RDIMM 3200MHz"},null,"370-AEVP",12,{"$f":"VLOOKUP(L51,Tabella_prezzi!$A$1:$L$189,9,FALSE)","v":"32GB - 2Rx4 DDR4 RDIMM 3200MHz"},{"$f":"VLOOKUP(L51,Tabella_prezzi!$A$1:$L$189,3,FALSE)","v":"OpzRAM32GB"},{"$f":"VLOOKUP(L51,Tabella_prezzi!$A$1:$L$189,4,FALSE)*G51","v":3166.44},null,"L7N03",{"$f":"VLOOKUP(L51,Tabella_prezzi!$A$1:$L$189,6,FALSE)","v":"TS4L7-RAM32"}]
[704,"Memory Capacity",null,{"$f":"VLOOKUP(L52,Tabella_prezzi!$A$1:$L$189,8,FALSE)","v":"32GB - 2Rx4 DDR4 RDIMM 3200MHz"},null,"370-AEVP",14,{"$f":"VLOOKUP(L52,Tabella_prezzi!$A$1:$L$189,9,FALSE)","v":"32GB - 2Rx4 DDR4 RDIMM 3200MHz"},{"$f":"VLOOKUP(L52,Tabella_prezzi!$A$1:$L$189,3,FALSE)","v":"OpzRAM32GB"},{"$f":"VLOOKUP(L52,Tabella_prezzi!$A$1:$L$189,4,FALSE)*G52","v":3694.1800000000003},null,"L7N03",{"$f":"VLOOKUP(L52,Tabella_prezzi!$A$1:$L$189,6,FALSE)","v":"TS4L7-RAM32"}]
[768,"Memory Capacity",null,{"$f":"VLOOKUP(L53,Tabella_prezzi!$A$1:$L$189,8,FALSE)","v":"32GB - 2Rx4 DDR4 RDIMM 3200MHz"},null,"370-AEVP",16,{"$f":"VLOOKUP(L53,Tabella_prezzi!$A$1:$L$189,9,FALSE)","v":"32GB - 2Rx4 DDR4 RDIMM 3200MHz"},{"$f":"VLOOKUP(L53,Tabella_prezzi!$A$1:$L$189,3,FALSE)","v":"OpzRAM32GB"},{"$f":"VLOOKUP(L53,Tabella_prezzi!$A$1:$L$189,4,FALSE)*G53","v":4221.92},null,"L7N03",{"$f":"VLOOKUP(L53,Tabella_prezzi!$A$1:$L$189,6,FALSE)","v":"TS4L7-RAM32"}]
[832,"Memory Capacity",null,{"$f":"VLOOKUP(L54,Tabella_prezzi!$A$1:$L$189,8,FALSE)","v":"32GB - 2Rx4 DDR4 RDIMM 3200MHz"},null,"370-AEVP",18,{"$f":"VLOOKUP(L54,Tabella_prezzi!$A$1:$L$189,9,FALSE)","v":"32GB - 2Rx4 DDR4 RDIMM 3200MHz"},{"$f":"VLOOKUP(L54,Tabella_prezzi!$A$1:$L$189,3,FALSE)","v":"OpzRAM32GB"},{"$f":"VLOOKUP(L54,Tabella_prezzi!$A$1:$L$189,4,FALSE)*G54","v":4749.66},null,"L7N03",{"$f":"VLOOKUP(L54,Tabella_prezzi!$A$1:$L$189,6,FALSE)","v":"TS4L7-RAM32"}]
[896,"Memory Capacity",null,{"$f":"VLOOKUP(L55,Tabella_prezzi!$A$1:$L$189,8,FALSE)","v":"32GB - 2Rx4 DDR4 RDIMM 3200MHz"},null,"370-AEVP",20,{"$f":"VLOOKUP(L55,Tabella_prezzi!$A$1:$L$189,9,FALSE)","v":"32GB - 2Rx4 DDR4 RDIMM 3200MHz"},{"$f":"VLOOKUP(L55,Tabella_prezzi!$A$1:$L$189,3,FALSE)","v":"OpzRAM32GB"},{"$f":"VLOOKUP(L55,Tabella_prezzi!$A$1:$L$189,4,FALSE)*G55","v":5277.4},null,"L7N03",{"$f":"VLOOKUP(L55,Tabella_prezzi!$A$1:$L$189,6,FALSE)","v":"TS4L7-RAM32"}]
[960,"Memory Capacity",null,{"$f":"VLOOKUP(L56,Tabella_prezzi!$A$1:$L$189,8,FALSE)","v":"32GB - 2Rx4 DDR4 RDIMM 3200MHz"},null,"370-AEVP",22,{"$f":"VLOOKUP(L56,Tabella_prezzi!$A$1:$L$189,9,FALSE)","v":"32GB - 2Rx4 DDR4 RDIMM 3200MHz"},{"$f":"VLOOKUP(L56,Tabella_prezzi!$A$1:$L$189,3,FALSE)","v":"OpzRAM32GB"},{"$f":"VLOOKUP(L56,Tabella_prezzi!$A$1:$L$189,4,FALSE)*G56","v":5805.14},null,"L7N03",{"$f":"VLOOKUP(L56,Tabella_prezzi!$A$1:$L$189,6,FALSE)","v":"TS4L7-RAM32"}]
[1024,"Memory Capacity",null,{"$f":"VLOOKUP(L57,Tabella_prezzi!$A$1:$L$189,8,FALSE)","v":"32GB - 2Rx4 DDR4 RDIMM 3200MHz"},null,"370-AEVP",24,{"$f":"VLOOKUP(L57,Tabella_prezzi!$A$1:$L$189,9,FALSE)","v":"32GB - 2Rx4 DDR4 RDIMM 3200MHz"},{"$f":"VLOOKUP(L57,Tabella_prezzi!$A$1:$L$189,3,FALSE)","v":"OpzRAM32GB"},{"$f":"VLOOKUP(L57,Tabella_prezzi!$A$1:$L$189,4,FALSE)*G57","v":6332.88},null,"L7N03",{"$f":"VLOOKUP(L57,Tabella_prezzi!$A$1:$L$189,6,FALSE)","v":"TS4L7-RAM32"}]
[{"$f":"(G58)*64","v":1152},"Memory Capacity",null,{"$f":"VLOOKUP(L58,Tabella_prezzi!$A$1:$L$189,8,FALSE)","v":"64GB - 2RX4 DDR4 RDIMM 3200MHz"},null,"370-AEVP",18,{"$f":"VLOOKUP(L58,Tabella_prezzi!$A$1:$L$189,9,FALSE)","v":"64GB - 2RX4 DDR4 RDIMM 3200MHz"},{"$f":"VLOOKUP(L58,Tabella_prezzi!$A$1:$L$189,3,FALSE)","v":"OpzRAM64GB"},{"$f":"VLOOKUP(L58,Tabella_prezzi!$A$1:$L$189,4,FALSE)*(G58)","v":5446.8},null,"L7N04",{"$f":"VLOOKUP(L58,Tabella_prezzi!$A$1:$L$189,6,FALSE)","v":"TS4L7-RAM64"}]
[{"$f":"(G59)*64","v":1280},"Memory Capacity",null,{"$f":"VLOOKUP(L59,Tabella_prezzi!$A$1:$L$189,8,FALSE)","v":"64GB - 2RX4 DDR4 RDIMM 3200MHz"},null,"370-AEVP",20,{"$f":"VLOOKUP(L59,Tabella_prezzi!$A$1:$L$189,9,FALSE)","v":"64GB - 2RX4 DDR4 RDIMM 3200MHz"},{"$f":"VLOOKUP(L59,Tabella_prezzi!$A$1:$L$189,3,FALSE)","v":"OpzRAM64GB"},{"$f":"VLOOKUP(L59,Tabella_prezzi!$A$1:$L$189,4,FALSE)*(G59)","v":6052},null,"L7N04",{"$f":"VLOOKUP(L59,Tabella_prezzi!$A$1:$L$189,6,FALSE)","v":"TS4L7-RAM64"}]
[1408,"Memory Capacity",null,{"$f":"VLOOKUP(L60,Tabella_prezzi!$A$1:$L$189,8,FALSE)","v":"64GB - 2RX4 DDR4 RDIMM 3200MHz"},null,"370-AEVP",22,{"$f":"VLOOKUP(L60,Tabella_prezzi!$A$1:$L$189,9,FALSE)","v":"64GB - 2RX4 DDR4 RDIMM 3200MHz"},{"$f":"VLOOKUP(L60,Tabella_prezzi!$A$1:$L$189,3,FALSE)","v":"OpzRAM64GB"},{"$f":"VLOOKUP(L60,Tabella_prezzi!$A$1:$L$189,4,FALSE)*(G60)","v":6657.2000000000007},null,"L7N04",{"$f":"VLOOKUP(L60,Tabella_prezzi!$A$1:$L$189,6,FALSE)","v":"TS4L7-RAM64"}]
[1536,"Memory Capacity",null,{"$f":"VLOOKUP(L61,Tabella_prezzi!$A$1:$L$189,8,FALSE)","v":"64GB - 2RX4 DDR4 RDIMM 3200MHz"},null,"370-AEVP",24,{"$f":"VLOOKUP(L61,Tabella_prezzi!$A$1:$L$189,9,FALSE)","v":"64GB - 2RX4 DDR4 RDIMM 3200MHz"},{"$f":"VLOOKUP(L61,Tabella_prezzi!$A$1:$L$189,3,FALSE)","v":"OpzRAM64GB"},{"$f":"VLOOKUP(L61,Tabella_prezzi!$A$1:$L$189,4,FALSE)*(G61)","v":7262.4000000000005},null,"L7N04",{"$f":"VLOOKUP(L61,Tabella_prezzi!$A$1:$L$189,6,FALSE)","v":"TS4L7-RAM64"}]
[1664,"Memory Capacity",null,{"$f":"VLOOKUP(L62,Tabella_prezzi!$A$1:$L$189,8,FALSE)","v":"64GB - 2RX4 DDR4 RDIMM 3200MHz"},null,"370-AEVP",26,{"$f":"VLOOKUP(L62,Tabella_prezzi!$A$1:$L$189,9,FALSE)","v":"64GB - 2RX4 DDR4 RDIMM 3200MHz"},{"$f":"VLOOKUP(L62,Tabella_prezzi!$A$1:$L$189,3,FALSE)","v":"OpzRAM64GB"},{"$f":"VLOOKUP(L62,Tabella_prezzi!$A$1:$L$189,4,FALSE)*G62","v":7867.6},null,"L7N04",{"$f":"VLOOKUP(L62,Tabella_prezzi!$A$1:$L$189,6,FALSE)","v":"TS4L7-RAM64"}]
[1792,"Memory Capacity",null,{"$f":"VLOOKUP(L63,Tabella_prezzi!$A$1:$L$189,8,FALSE)","v":"64GB - 2RX4 DDR4 RDIMM 3200MHz"},null,"370-AEVP",28,{"$f":"VLOOKUP(L63,Tabella_prezzi!$A$1:$L$189,9,FALSE)","v":"64GB - 2RX4 DDR4 RDIMM 3200MHz"},{"$f":"VLOOKUP(L63,Tabella_prezzi!$A$1:$L$189,3,FALSE)","v":"OpzRAM64GB"},{"$f":"VLOOKUP(L63,Tabella_prezzi!$A$1:$L$189,4,FALSE)*(G63)","v":8472.8000000000011},null,"L7N04",{"$f":"VLOOKUP(L63,Tabella_prezzi!$A$1:$L$189,6,FALSE)","v":"TS4L7-RAM64"}]
[1920,"Memory Capacity",null,{"$f":"VLOOKUP(L64,Tabella_prezzi!$A$1:$L$189,8,FALSE)","v":"64GB - 2RX4 DDR4 RDIMM 3200MHz"},null,"370-AEVP",30,{"$f":"VLOOKUP(L64,Tabella_prezzi!$A$1:$L$189,9,FALSE)","v":"64GB - 2RX4 DDR4 RDIMM 3200MHz"},{"$f":"VLOOKUP(L64,Tabella_prezzi!$A$1:$L$189,3,FALSE)","v":"OpzRAM64GB"},{"$f":"VLOOKUP(L64,Tabella_prezzi!$A$1:$L$189,4,FALSE)*(G64)","v":9078},null,"L7N04",{"$f":"VLOOKUP(L64,Tabella_prezzi!$A$1:$L$189,6,FALSE)","v":"TS4L7-RAM64"}]
[2048,"Memory Capacity",null,{"$f":"VLOOKUP(L65,Tabella_prezzi!$A$1:$L$189,8,FALSE)","v":"64GB - 2RX4 DDR4 RDIMM 3200MHz"},null,"370-AEVP",32,{"$f":"VLOOKUP(L65,Tabella_prezzi!$A$1:$L$189,9,FALSE)","v":"64GB - 2RX4 DDR4 RDIMM 3200MHz"},{"$f":"VLOOKUP(L65,Tabella_prezzi!$A$1:$L$189,3,FALSE)","v":"OpzRAM64GB"},{"$f":"VLOOKUP(L65,Tabella_prezzi!$A$1:$L$189,4,FALSE)*(G65)","v":9683.2000000000007},null,"L7N04",{"$f":"VLOOKUP(L65,Tabella_prezzi!$A$1:$L$189,6,FALSE)","v":"TS4L7-RAM64"}]
[1,2,3,4,5,6,7,8,9,10,11,12,13,14,15,16,17,18,19,20,21,22,23]
[]
["TS3L7_RAM (2CPU)vxfelx"]
["192GB","Memory Capacity",null,{"$f":"VLOOKUP(L69,Tabella_prezzi!$A$1:$L$189,8,FALSE)","v":"64GB - 2RX4 DDR4 RDIMM 3200MHz"},null,"370-AEVP",2,{"$f":"VLOOKUP(L69,Tabella_prezzi!$A$1:$L$189,9,FALSE)","v":"64GB - 2RX4 DDR4 RDIMM 3200MHz"},{"$f":"VLOOKUP(L69,Tabella_prezzi!$A$1:$L$189,3,FALSE)","v":"OpzRAM64GB"},{"$f":"VLOOKUP(L69,Tabella_prezzi!$A$1:$L$189,4,FALSE)*G69","v":605.20000000000005},null,"L7N04",{"$f":"VLOOKUP(L69,Tabella_prezzi!$A$1:$L$189,6,FALSE)","v":"TS4L7-RAM64"}]
["384GB","Memory Capacity",null,{"$f":"VLOOKUP(L70,Tabella_prezzi!$A$1:$L$189,8,FALSE)","v":"64GB - 2RX4 DDR4 RDIMM 3200MHz"},null,"370-AEVP",5,{"$f":"VLOOKUP(L70,Tabella_prezzi!$A$1:$L$189,9,FALSE)","v":"64GB - 2RX4 DDR4 RDIMM 3200MHz"},{"$f":"VLOOKUP(L70,Tabella_prezzi!$A$1:$L$189,3,FALSE)","v":"OpzRAM64GB"},{"$f":"VLOOKUP(L70,Tabella_prezzi!$A$1:$L$189,4,FALSE)*G70","v":1513},null,"L7N04",{"$f":"VLOOKUP(L70,Tabella_prezzi!$A$1:$L$189,6,FALSE)","v":"TS4L7-RAM64"}]
["768GB","Memory Capacity",null,{"$f":"VLOOKUP(L71,Tabella_prezzi!$A$1:$L$189,8,FALSE)","v":"64GB - 2RX4 DDR4 RDIMM 3200MHz"},null,"370-AEVP",11,{"$f":"VLOOKUP(L71,Tabella_prezzi!$A$1:$L$189,9,FALSE)","v":"64GB - 2RX4 DDR4 RDIMM 3200MHz"},{"$f":"VLOOKUP(L71,Tabella_prezzi!$A$1:$L$189,3,FALSE)","v":"OpzRAM64GB"},{"$f":"VLOOKUP(L71,Tabella_prezzi!$A$1:$L$189,4,FALSE)*G71","v":3328.6000000000004},null,"L7N04",{"$f":"VLOOKUP(L71,Tabella_prezzi!$A$1:$L$189,6,FALSE)","v":"TS4L7-RAM64"}]
["1536GB","Memory Capacity",null,{"$f":"VLOOKUP(L72,Tabella_prezzi!$A$1:$L$189,8,FALSE)","v":"64GB - 2RX4 DDR4 RDIMM 3200MHz"},null,"370-AEVP",23,{"$f":"VLOOKUP(L72,Tabella_prezzi!$A$1:$L$189,9,FALSE)","v":"64GB - 2RX4 DDR4 RDIMM 3200MHz"},{"$f":"VLOOKUP(L72,Tabella_prezzi!$A$1:$L$189,3,FALSE)","v":"OpzRAM64GB"},{"$f":"VLOOKUP(L72,Tabella_prezzi!$A$1:$L$189,4,FALSE)*G72","v":6959.8},null,"L7N04",{"$f":"VLOOKUP(L72,Tabella_prezzi!$A$1:$L$189,6,FALSE)","v":"TS4L7-RAM64"}]
[]
["TS3L7_OS"]
["No Operating System","Operating System",null,null,null,null,0,null,{"$f":"\"\"","v":""},null,null,{"$f":"\"\"","v":""},{"$f":"\"\"","v":""},0,null,{"$f":"\"\"","v":""},{"$f":"\"\"","v":""},null,0,0,null,null,{"$f":"\"\"","v":""}]
[{"$f":"D76","v":"Ubuntu Server 22.04 LTS 64 Bit"},"Operating System",null,{"$f":"VLOOKUP(L76,Tabella_prezzi!$A$1:$L$189,9,FALSE)","v":"Ubuntu Server 22.04 LTS 64 Bit"},null,null,1,{"$f":"VLOOKUP(L76,Tabella_prezzi!$A$1:$L$189,9,FALSE)","v":"Ubuntu Server 22.04 LTS 64 Bit"},{"$f":"VLOOKUP(L76,Tabella_prezzi!$A$1:$L$189,3,FALSE)","v":"OpzOpenSource"},{"$f":"VLOOKUP(L76,Tabella_prezzi!$A$1:$L$189,4,FALSE)","v":37.119999999999997},null,"L7N27",{"$f":"VLOOKUP(L76,Tabella_prezzi!$A$1:$L$189,6,FALSE)","v":"TS4L7-LINUX"},20,{"$f":"VLOOKUP(T76,Tabella_prezzi!$A$1:$L$189,9,FALSE)","v":"1-pack of Windows Server 2022/2019 Device CALs (STD or DC)"},{"$f":"VLOOKUP(T76,Tabella_prezzi!$A$1:$L$189,3,FALSE)","v":"OpzDeviceCal"},{"$f":"VLOOKUP(T76,Tabella_prezzi!$A$1:$L$189,4,FALSE)*N76","v":544.6},null,6,"L7N24",null,{"$f":"VLOOKUP(T76,Tabella_prezzi!$A$1:$L$189,4,FALSE)*S76","v":163.38},{"$f":"VLOOKUP(T76,Tabella_prezzi!$A$1:$L$189,6,FALSE)","v":"TS4L7-WINDEVCAL"}]
["Windows Server 2022,Standard,ROK,16CORE","Operating System",null,{"$f":"VLOOKUP(L77,Tabella_prezzi!$A$1:$L$189,9,FALSE)","v":"Windows Server 2022,Standard,ROK,16CORE"},null,null,1,{"$f":"VLOOKUP(L77,Tabella_prezzi!$A$1:$L$189,9,FALSE)","v":"Windows Server 2022,Standard,ROK,16CORE"},{"$f":"VLOOKUP(L77,Tabella_prezzi!$A$1:$L$189,3,FALSE)","v":"OpzWinServSTD"},{"$f":"VLOOKUP(L77,Tabella_prezzi!$A$1:$L$189,4,FALSE)","v":816.77},null,"L7N23",{"$f":"VLOOKUP(L77,Tabella_prezzi!$A$1:$L$189,6,FALSE)","v":"TS4L7-WINSRVSTD"},16,{"$f":"VLOOKUP(T77,Tabella_prezzi!$A$1:$L$189,9,FALSE)","v":"Windows Server 2022,Standard,ROK,16CORE"},{"$f":"VLOOKUP(T77,Tabella_prezzi!$A$1:$L$189,3,FALSE)","v":"OpzWinServSTD"},{"$f":"VLOOKUP(T77,Tabella_prezzi!$A$1:$L$189,4,FALSE)*N77","v":13068.32},null,6,"L7N23",{"$f":"VLOOKUP(T77,Tabella_prezzi!$A$1:$L$189,4,FALSE)*S77","v":4900.62},null,{"$f":"VLOOKUP(T77,Tabella_prezzi!$A$1:$L$189,6,FALSE)","v":"TS4L7-WINSRVSTD"}]
["Windows Server 2022 Standard Edition, Add License,2CORE","Operating System",null,{"$f":"VLOOKUP(L78,Tabella_prezzi!$A$1:$L$189,9,FALSE)","v":"Windows Server 2022 Standard Edition, Add License,2CORE"},null,null,1,{"$f":"VLOOKUP(L78,Tabella_prezzi!$A$1:$L$189,9,FALSE)","v":"Windows Server 2022 Standard Edition, Add License,2CORE"},{"$f":"VLOOKUP(L78,Tabella_prezzi!$A$1:$L$189,3,FALSE)","v":"OpzWinServSTD2core"},{"$f":"VLOOKUP(L78,Tabella_prezzi!$A$1:$L$189,4,FALSE)","v":92.94},null,"L7N26",{"$f":"VLOOKUP(L78,Tabella_prezzi!$A$1:$L$189,6,FALSE)","v":"TS4L7-WINSRV2C"},16,{"$f":"VLOOKUP(T78,Tabella_prezzi!$A$1:$L$189,9,FALSE)","v":"Windows Server 2022,Standard,ROK,16CORE"},{"$f":"VLOOKUP(T78,Tabella_prezzi!$A$1:$L$189,3,FALSE)","v":"OpzWinServSTD"},{"$f":"VLOOKUP(T78,Tabella_prezzi!$A$1:$L$189,4,FALSE)*N78","v":13068.32},null,6,"L7N23",{"$f":"VLOOKUP(T78,Tabella_prezzi!$A$1:$L$189,4,FALSE)*S78","v":4900.62},null,{"$f":"VLOOKUP(T78,Tabella_prezzi!$A$1:$L$189,6,FALSE)","v":"TS4L7-WINSRVSTD"}]
["Windows Server 2022,Standard,ROK,16CORE","Operating System",null,{"$f":"VLOOKUP(L79,Tabella_prezzi!$A$1:$L$189,9,FALSE)","v":"Windows Server 2022,Standard,ROK,16CORE"},null,null,1,{"$f":"VLOOKUP(L79,Tabella_prezzi!$A$1:$L$189,9,FALSE)","v":"Windows Server 2022,Standard,ROK,16CORE"},{"$f":"VLOOKUP(L79,Tabella_prezzi!$A$1:$L$189,3,FALSE)","v":"OpzWinServSTD"},{"$f":"VLOOKUP(L79,Tabella_prezzi!$A$1:$L$189,4,FALSE)","v":816.77},null,"L7N23",{"$f":"VLOOKUP(L79,Tabella_prezzi!$A$1:$L$189,6,FALSE)","v":"TS4L7-WINSRVSTD"},20,{"$f":"VLOOKUP(T79,Tabella_prezzi!$A$1:$L$189,9,FALSE)","v":"1-pack of Windows Server 2022/2019 Device CALs (STD or DC)"},{"$f":"VLOOKUP(T79,Tabella_prezzi!$A$1:$L$189,3,FALSE)","v":"OpzDeviceCal"},{"$f":"VLOOKUP(T79,Tabella_prezzi!$A$1:$L$189,4,FALSE)*N79","v":544.6},null,6,"L7N24",null,{"$f":"VLOOKUP(T79,Tabella_prezzi!$A$1:$L$189,4,FALSE)*S79","v":163.38},{"$f":"VLOOKUP(T79,Tabella_prezzi!$A$1:$L$189,6,FALSE)","v":"TS4L7-WINDEVCAL"}]
["1-pack of Windows Server 2022/2019 Device CALs (STD or DC)","Operating System",null,{"$f":"VLOOKUP(L80,Tabella_prezzi!$A$1:$L$189,9,FALSE)","v":"1-pack of Windows Server 2022/2019 Device CALs (STD or DC)"},null,null,1,{"$f":"VLOOKUP(L80,Tabella_prezzi!$A$1:$L$189,9,FALSE)","v":"1-pack of Windows Server 2022/2019 Device CALs (STD or DC)"},{"$f":"VLOOKUP(L80,Tabella_prezzi!$A$1:$L$189,3,FALSE)","v":"OpzDeviceCal"},{"$f":"VLOOKUP(L80,Tabella_prezzi!$A$1:$L$189,4,FALSE)","v":27.23},null,"L7N24",{"$f":"VLOOKUP(L80,Tabella_prezzi!$A$1:$L$189,6,FALSE)","v":"TS4L7-WINDEVCAL"},0,null,{"$f":"\"\"","v":""},{"$f":"\"\"","v":""},null,0,0,null,null,{"$f":"\"\"","v":""}]
["1-pack of Windows Server 2022/2019 User CALs (STD or DC)","Operating System",null,{"$f":"VLOOKUP(L81,Tabella_prezzi!$A$1:$L$189,9,FALSE)","v":"1-pack of Windows Server 2022/2019 User CALs (STD or DC)"},null,null,1,{"$f":"VLOOKUP(L81,Tabella_prezzi!$A$1:$L$189,9,FALSE)","v":"1-pack of Windows Server 2022/2019 User CALs (STD or DC)"},{"$f":"VLOOKUP(L81,Tabella_prezzi!$A$1:$L$189,3,FALSE)","v":"OpzUserCal"},{"$f":"VLOOKUP(L81,Tabella_prezzi!$A$1:$L$189,4,FALSE)","v":37.450000000000003},null,"L7N25",{"$f":"VLOOKUP(L81,Tabella_prezzi!$A$1:$L$189,6,FALSE)","v":"TS4L7-WINUSRCAL"},0,null,{"$f":"\"\"","v":""},{"$f":"\"\"","v":""},null,0,0,null,null,{"$f":"\"\"","v":""}]
["Ubuntu Server 22.04 LTS 64 Bit","Operating System",null,{"$f":"VLOOKUP(L82,Tabella_prezzi!$A$1:$L$189,9,FALSE)","v":"Ubuntu Server 22.04 LTS 64 Bit"},null,null,1,{"$f":"VLOOKUP(L82,Tabella_prezzi!$A$1:$L$189,9,FALSE)","v":"Ubuntu Server 22.04 LTS 64 Bit"},{"$f":"VLOOKUP(L82,Tabella_prezzi!$A$1:$L$189,3,FALSE)","v":"OpzOpenSource"},{"$f":"VLOOKUP(L82,Tabella_prezzi!$A$1:$L$189,4,FALSE)","v":37.119999999999997},null,"L7N27",{"$f":"VLOOKUP(L82,Tabella_prezzi!$A$1:$L$189,6,FALSE)","v":"TS4L7-LINUX"},16,{"$f":"VLOOKUP(T82,Tabella_prezzi!$A$1:$L$189,9,FALSE)","v":"Windows Server 2022,Standard,ROK,16CORE"},{"$f":"VLOOKUP(T82,Tabella_prezzi!$A$1:$L$189,3,FALSE)","v":"OpzWinServSTD"},{"$f":"VLOOKUP(T82,Tabella_prezzi!$A$1:$L$189,4,FALSE)*N82","v":13068.32},null,6,"L7N23",{"$f":"VLOOKUP(T82,Tabella_prezzi!$A$1:$L$189,4,FALSE)*S82","v":4900.62},null,{"$f":"VLOOKUP(T82,Tabella_prezzi!$A$1:$L$189,6,FALSE)","v":"TS4L7-WINSRVSTD"}]
[]
["TS3L7_HDD"]
[{"$f":"\"\"","v":""},null,null,null,null,null,{"$f":"\"\"","v":""},null,{"$f":"\"\"","v":""},null,null,{"$f":"\"\"","v":""},{"$f":"\"\"","v":""}]
[{"$f":"VLOOKUP(L86,Tabella_prezzi!$A$1:$L$189,8,FALSE)","v":"2.4TB 10k SAS ISE 12Gbps"},"Hard Drives",null,{"$f":"VLOOKUP(L86,Tabella_prezzi!$A$1:$L$189,8,FALSE)","v":"2.4TB 10k SAS ISE 12Gbps"},null,null,1,{"$f":"VLOOKUP(L86,Tabella_prezzi!$A$1:$L$189,9,FALSE)","v":"2.4TB 10K RPM SAS ISE 12Gbps 512e 2.5in Hot-plug Hard Drive"},{"$f":"VLOOKUP(L86,Tabella_prezzi!$A$1:$L$189,3,FALSE)","v":"OpzHDD2TB"},{"$f":"VLOOKUP(L86,Tabella_prezzi!$A$1:$L$189,4,FALSE)","v":205.39},null,"L7N12",{"$f":"VLOOKUP(L86,Tabella_prezzi!$A$1:$L$189,6,FALSE)","v":"TS4L7-HDD2TB"}]
[{"$f":"VLOOKUP(L87,Tabella_prezzi!$A$1:$L$189,8,FALSE)","v":"1.2TB 10K RPM SAS ISE 12Gbps"},"Hard Drives",null,{"$f":"VLOOKUP(L87,Tabella_prezzi!$A$1:$L$189,8,FALSE)","v":"1.2TB 10K RPM SAS ISE 12Gbps"},null,null,1,{"$f":"VLOOKUP(L87,Tabella_prezzi!$A$1:$L$189,9,FALSE)","v":"1.2TB 10K RPM SAS ISE 12Gbps 512n 2.5in Hot-plug Hard Drive"},{"$f":"VLOOKUP(L87,Tabella_prezzi!$A$1:$L$189,3,FALSE)","v":"OpzHDD1TB"},{"$f":"VLOOKUP(L87,Tabella_prezzi!$A$1:$L$189,4,FALSE)","v":89.16},null,"L7N13",{"$f":"VLOOKUP(L87,Tabella_prezzi!$A$1:$L$189,6,FALSE)","v":"TS4L7-HDD1TB"}]
[{"$f":"VLOOKUP(L88,Tabella_prezzi!$A$1:$L$189,8,FALSE)","v":"3.84TB SSD SAS ISE RI 12Gbps"},"Hard Drives",null,{"$f":"VLOOKUP(L88,Tabella_prezzi!$A$1:$L$189,8,FALSE)","v":"3.84TB SSD SAS ISE RI 12Gbps"},null,null,1,{"$f":"VLOOKUP(L88,Tabella_prezzi!$A$1:$L$189,9,FALSE)","v":"3.84TB SSD SAS ISE RI 12Gbps 512e 2.5in PM6 Hot-Plug 1 DWPD"},{"$f":"VLOOKUP(L88,Tabella_prezzi!$A$1:$L$189,3,FALSE)","v":"OpzSSD-RI3,8TB"},{"$f":"VLOOKUP(L88,Tabella_prezzi!$A$1:$L$189,4,FALSE)","v":1010.45},null,"L7N14",{"$f":"VLOOKUP(L88,Tabella_prezzi!$A$1:$L$189,6,FALSE)","v":"TS4L7-SSD-RI3,8TB"}]
[{"$f":"VLOOKUP(L89,Tabella_prezzi!$A$1:$L$189,8,FALSE)","v":"1.92TB SSD SAS ISE RI 12Gbps"},"Hard Drives",null,{"$f":"VLOOKUP(L89,Tabella_prezzi!$A$1:$L$189,8,FALSE)","v":"1.92TB SSD SAS ISE RI 12Gbps"},null,null,1,{"$f":"VLOOKUP(L89,Tabella_prezzi!$A$1:$L$189,9,FALSE)","v":"1.92TB SSD SAS ISE RI 12Gbps 512e 2.5in Hot-Plug 1 DWPD"},{"$f":"VLOOKUP(L89,Tabella_prezzi!$A$1:$L$189,3,FALSE)","v":"OpzSSD-RI1,6TB"},{"$f":"VLOOKUP(L89,Tabella_prezzi!$A$1:$L$189,4,FALSE)","v":499.28},null,"L7N16",{"$f":"VLOOKUP(L89,Tabella_prezzi!$A$1:$L$189,6,FALSE)","v":"TS4L7-SSD-RI1,6TB"}]
[{"$f":"VLOOKUP(L90,Tabella_prezzi!$A$1:$L$189,8,FALSE)","v":"1.6TB SSD SAS ISE MU 12Gbp"},"Hard Drives",null,{"$f":"VLOOKUP(L90,Tabella_prezzi!$A$1:$L$189,8,FALSE)","v":"1.6TB SSD SAS ISE MU 12Gbp"},null,null,1,{"$f":"VLOOKUP(L90,Tabella_prezzi!$A$1:$L$189,9,FALSE)","v":"1.6TB SSD SAS ISE MU 12Gbps 512e 2.5in Hot-Plug PM6 3 DWPD"},{"$f":"VLOOKUP(L90,Tabella_prezzi!$A$1:$L$189,3,FALSE)","v":"OpzSSD-MU1,6TB"},{"$f":"VLOOKUP(L90,Tabella_prezzi!$A$1:$L$189,4,FALSE)","v":473.08},null,"L7N17",{"$f":"VLOOKUP(L90,Tabella_prezzi!$A$1:$L$189,6,FALSE)","v":"TS4L7-SSD-MU1,6TB"}]
[{"$f":"VLOOKUP(L91,Tabella_prezzi!$A$1:$L$189,8,FALSE)","v":"960GB SSD SAS ISE RI 12Gbps"},"Hard Drives",null,{"$f":"VLOOKUP(L91,Tabella_prezzi!$A$1:$L$189,8,FALSE)","v":"960GB SSD SAS ISE RI 12Gbps"},null,null,1,{"$f":"VLOOKUP(L91,Tabella_prezzi!$A$1:$L$189,9,FALSE)","v":"960GB SSD SAS ISE RI 12Gbps 512e 2.5in Hot-Plug 1 DWPD"},{"$f":"VLOOKUP(L91,Tabella_prezzi!$A$1:$L$189,3,FALSE)","v":"OpzSSD-RI800GB"},{"$f":"VLOOKUP(L91,Tabella_prezzi!$A$1:$L$189,4,FALSE)","v":283.68},null,"L7N18",{"$f":"VLOOKUP(L91,Tabella_prezzi!$A$1:$L$189,6,FALSE)","v":"TS4L7-SSD-RI800GB"}]
[{"$f":"VLOOKUP(L92,Tabella_prezzi!$A$1:$L$189,8,FALSE)","v":"800GB SSD SAS ISE Mix Use 12Gbps"},"Hard Drives",null,{"$f":"VLOOKUP(L92,Tabella_prezzi!$A$1:$L$189,8,FALSE)","v":"800GB SSD SAS ISE Mix Use 12Gbps"},null,null,1,{"$f":"VLOOKUP(L92,Tabella_prezzi!$A$1:$L$189,9,FALSE)","v":"800GB SSD SAS ISE Mix Use 12Gbps 512e 2.5in Hot-plug, 3 DWPD"},{"$f":"VLOOKUP(L92,Tabella_prezzi!$A$1:$L$189,3,FALSE)","v":"OpzSSD-MU800GB"},{"$f":"VLOOKUP(L92,Tabella_prezzi!$A$1:$L$189,4,FALSE)","v":295.02999999999997},null,"L7N19",{"$f":"VLOOKUP(L92,Tabella_prezzi!$A$1:$L$189,6,FALSE)","v":"TS4L7-SSD-MU800GB"}]
[{"$f":"VLOOKUP(L93,Tabella_prezzi!$A$1:$L$189,8,FALSE)","v":"Dispositivo UPS di tipo On-line doppia conversione, strutturato per il montaggio a rack da 19”"},"Hard Drives",null,{"$f":"VLOOKUP(L93,Tabella_prezzi!$A$1:$L$189,8,FALSE)","v":"Dispositivo UPS di tipo On-line doppia conversione, strutturato per il montaggio a rack da 19”"},null,null,1,{"$f":"VLOOKUP(L93,Tabella_prezzi!$A$1:$L$189,9,FALSE)","v":"Dispositivo UPS di tipo On-line doppia conversione, strutturato per il montaggio a rack da 19”"},{"$f":"VLOOKUP(L93,Tabella_prezzi!$A$1:$L$189,3,FALSE)","v":"OpzUps (3000VA)"},{"$f":"VLOOKUP(L93,Tabella_prezzi!$A$1:$L$189,4,FALSE)","v":386.02},null,"L7N20",{"$f":"VLOOKUP(L93,Tabella_prezzi!$A$1:$L$189,6,FALSE)","v":"TS4L7-UPS"}]
[{"$f":"D94","v":"Unità KVM - monitor 17\", cavo combi PS/2&USB da 1,8mt, tastiera italiana, touch pad"},"Hard Drives",null,{"$f":"VLOOKUP(L94,Tabella_prezzi!$A$1:$L$189,8,FALSE)","v":"Unità KVM - monitor 17\", cavo combi PS/2&USB da 1,8mt, tastiera italiana, touch pad"},null,null,1,{"$f":"VLOOKUP(L94,Tabella_prezzi!$A$1:$L$189,9,FALSE)","v":"Unità KVM - monitor 17\", cavo combi PS/2&USB da 1,8mt, tastiera italiana, touch pad"},{"$f":"VLOOKUP(L94,Tabella_prezzi!$A$1:$L$189,3,FALSE)","v":"OpzGUI"},{"$f":"VLOOKUP(L94,Tabella_prezzi!$A$1:$L$189,4,FALSE)","v":491.62},null,"L7N21",{"$f":"VLOOKUP(L94,Tabella_prezzi!$A$1:$L$189,6,FALSE)","v":"TS4L7-GUI"}]
["Dispositivo UPS di tipo On-line doppia conversione, strutturato per il montaggio a rack da 19”","Hard Drives",null,{"$f":"VLOOKUP(L95,Tabella_prezzi!$A$1:$L$189,8,FALSE)","v":"Dispositivo UPS di tipo On-line doppia conversione, strutturato per il montaggio a rack da 19”"},null,null,1,{"$f":"VLOOKUP(L95,Tabella_prezzi!$A$1:$L$189,9,FALSE)","v":"Dispositivo UPS di tipo On-line doppia conversione, strutturato per il montaggio a rack da 19”"},{"$f":"VLOOKUP(L95,Tabella_prezzi!$A$1:$L$189,3,FALSE)","v":"OpzUps (3000VA)"},{"$f":"VLOOKUP(L95,Tabella_prezzi!$A$1:$L$189,4,FALSE)","v":386.02},null,"L7N20",{"$f":"VLOOKUP(L95,Tabella_prezzi!$A$1:$L$189,6,FALSE)","v":"TS4L7-UPS"}]
["Unità KVM - monitor 17\", cavo combi PS/2&USB da 1,8mt, tastiera italiana, touch pad","Hard Drives",null,{"$f":"VLOOKUP(L96,Tabella_prezzi!$A$1:$L$189,8,FALSE)","v":"Unità KVM - monitor 17\", cavo combi PS/2&USB da 1,8mt, tastiera italiana, touch pad"},null,null,1,{"$f":"VLOOKUP(L96,Tabella_prezzi!$A$1:$L$189,9,FALSE)","v":"Unità KVM - monitor 17\", cavo combi PS/2&USB da 1,8mt, tastiera italiana, touch pad"},{"$f":"VLOOKUP(L96,Tabella_prezzi!$A$1:$L$189,3,FALSE)","v":"OpzGUI"},{"$f":"VLOOKUP(L96,Tabella_prezzi!$A$1:$L$189,4,FALSE)","v":491.62},null,"L7N21",{"$f":"VLOOKUP(L96,Tabella_prezzi!$A$1:$L$189,6,FALSE)","v":"TS4L7-GUI"}]
[null,"Hard Drives",null,null,null,null,null,null,null,null,null,"L7N16",{"$f":"VLOOKUP(L97,Tabella_prezzi!$A$1:$L$189,6,FALSE)","v":"TS4L7-SSD-RI1,6TB"}]
[]
["TS3L7_PSU"]
["Dual, Hot-plug, Redundant Power Supply (1+1), 750W","Power Supply",null,"Dual, Hot-plug, Redundant Power Supply (1+1), 750W",null,null,{"$f":"\"\"","v":""},null,{"$f":"\"\"","v":""},null,null,{"$f":"\"\"","v":""},{"$f":"\"\"","v":""}]
[{"$f":"D101","v":"Dual, Hot-Plug, Power Supply 2400W Redundant, D"},"Power Supply",null,{"$f":"VLOOKUP(L101,Tabella_prezzi!$A$1:$L$189,8,FALSE)","v":"Dual, Hot-Plug, Power Supply 2400W Redundant, D"},null,null,1,{"$f":"VLOOKUP(L101,Tabella_prezzi!$A$1:$L$189,9,FALSE)","v":"Dual, Hot-Plug, Power Supply 2400W Redundant, D"},{"$f":"VLOOKUP(L101,Tabella_prezzi!$A$1:$L$189,3,FALSE)","v":"OpzPSU2400W"},null,{"$f":"VLOOKUP(L101,Tabella_prezzi!$A$1:$L$189,4,FALSE)","v":0},"L7N49",{"$f":"VLOOKUP(L101,Tabella_prezzi!$A$1:$L$189,6,FALSE)","v":"TS4L7-PSU2400W"}]
["Dual, Hot-plug Power Supply (1+1), 2000W","Power Supply",null,{"$f":"VLOOKUP(L102,Tabella_prezzi!$A$1:$L$189,8,FALSE)","v":"Dual, Hot-plug Power Supply (1+1), 2000W in sostituzione di quelli in configurazione BASE"},null,null,1,{"$f":"VLOOKUP(L102,Tabella_prezzi!$A$1:$L$189,9,FALSE)","v":"Dual, Hot-plug Power Supply (1+1), 2000W in sostituzione di quelli in configurazione BASE"},{"$f":"VLOOKUP(L102,Tabella_prezzi!$A$1:$L$189,3,FALSE)","v":"OpzPSU2000W"},null,{"$f":"VLOOKUP(L102,Tabella_prezzi!$A$1:$L$189,4,FALSE)","v":306},"L7N50",{"$f":"VLOOKUP(L102,Tabella_prezzi!$A$1:$L$189,6,FALSE)","v":"TS4L7-PSU2000W"}]
[]
[]
[{"$f":"\"\"","v":""}]
["Selezionare Chassis GPU Double-Wide Ready (2 CPU)",{"$f":"\"\"","v":""},{"$f":"\"\"","v":""},{"$f":"\"\"","v":""},{"$f":"\"\"","v":""},{"$f":"\"\"","v":""},{"$f":"\"\"","v":""},{"$f":"\"\"","v":""},{"$f":"\"\"","v":""},{"$f":"\"\"","v":""},{"$f":"\"\"","v":""},{"$f":"\"\"","v":""},{"$f":"\"\"","v":""}]
[]
["TS3L7_AddGPU"]
[{"$f":"\"\"","v":""},null,{"$f":"\"\"","v":""},{"$f":"\"\"","v":""},{"$f":"\"\"","v":""},{"$f":"\"\"","v":""},{"$f":"\"\"","v":""},null,{"$f":"\"\"","v":""},{"$f":"\"\"","v":""},null,{"$f":"\"\"","v":""},{"$f":"\"\"","v":""}]
[{"$f":"D110","v":"AMD MI100,300W PCIe, 32GB Passive, Double Wide, GPU"},"GPU",null,{"$f":"VLOOKUP(L110,Tabella_prezzi!$A$1:$L$189,8,FALSE)","v":"AMD MI100,300W PCIe, 32GB Passive, Double Wide, GPU"},null,null,1,{"$f":"VLOOKUP(L110,Tabella_prezzi!$A$1:$L$189,9,FALSE)","v":"AMD MI100,300W PCIe, 32GB Passive, Double Wide, GPU"},{"$f":"VLOOKUP(L110,Tabella_prezzi!$A$1:$L$189,3,FALSE)","v":"OpzGPU"},{"$f":"VLOOKUP(L110,Tabella_prezzi!$A$1:$L$189,4,FALSE)","v":6264.37},null,"L7N15",{"$f":"VLOOKUP(L110,Tabella_prezzi!$A$1:$L$189,6,FALSE)","v":"TS4L7-GPU"}]
[]
["Cavo “patch” di 3 mt RJ45 certificato per gigabit ethernet",null,null,{"$f":"VLOOKUP(L112,Tabella_prezzi!$A$1:$L$189,8,FALSE)","v":"Cavo “patch” di 3 mt RJ45 certificato per gigabit ethernet"},null,null,{"$f":"\"\"","v":""},{"$f":"VLOOKUP(L112,Tabella_prezzi!$A$1:$L$189,9,FALSE)","v":"Cavo “patch” di 3 mt RJ45 certificato per gigabit ethernet"},{"$f":"VLOOKUP(L112,Tabella_prezzi!$A$1:$L$189,3,FALSE)","v":"OpzRJ45 3m"},null,{"$f":"VLOOKUP(L112,Tabella_prezzi!$A$1:$L$189,4,FALSE)","v":3},"L7N62",{"$f":"VLOOKUP(L112,Tabella_prezzi!$A$1:$L$189,6,FALSE)","v":"TS4L7-RJ453M"}]
["Dell Networking, Cable, SFP+ to SFP+, 10GbE, Copper Twinax Direct Attach Cable, 3 Meter",null,null,"Dell Networking, Cable, SFP+ to SFP+, 10GbE, Copper Twinax Direct Attach Cable, 3 Meter",null,null,null,{"$f":"VLOOKUP(L113,Tabella_prezzi!$A$1:$L$189,9,FALSE)","v":"Dell Networking, Cable, SFP+ to SFP+, 10GbE, Copper Twinax Direct Attach Cable, 3 Meter"},{"$f":"VLOOKUP(L113,Tabella_prezzi!$A$1:$L$189,3,FALSE)","v":0},null,{"$f":"VLOOKUP(L113,Tabella_prezzi!$A$1:$L$189,4,FALSE)","v":84},"L7N91",{"$f":"VLOOKUP(L113,Tabella_prezzi!$A$1:$L$189,6,FALSE)","v":"TS4L7-DAC3SFP"}]
["Mellanox LinkX 100Gb/s Passive Copper DAC 3m per scheda TS3L7-CONX6DP",null,null,"Mellanox LinkX 100Gb/s Passive Copper DAC 3m",null,null,null,{"$f":"VLOOKUP(L114,Tabella_prezzi!$A$1:$L$189,9,FALSE)","v":"Mellanox LinkX 100Gb/s Passive Copper DAC 3m per scheda TS4L7-CONX6DP"},{"$f":"VLOOKUP(L114,Tabella_prezzi!$A$1:$L$189,3,FALSE)","v":0},null,{"$f":"VLOOKUP(L114,Tabella_prezzi!$A$1:$L$189,4,FALSE)","v":258},"L7N92",{"$f":"VLOOKUP(L114,Tabella_prezzi!$A$1:$L$189,6,FALSE)","v":"TS4L7-MLX100M3"}]
["Dell Cable SFP28 to SFP28 25GbE Passive Copper Twinax Direct Attach Cable 3 Meter ",null,null,"Dell Cable SFP28 to SFP28 25GbE Passive Copper Twinax Direct Attach Cable 3 Meter ",null,null,null,{"$f":"VLOOKUP(L115,Tabella_prezzi!$A$1:$L$189,9,FALSE)","v":"Dell Cable SFP28 to SFP28 25GbE Passive Copper Twinax Direct Attach Cable 3 Meter "},{"$f":"VLOOKUP(L115,Tabella_prezzi!$A$1:$L$189,3,FALSE)","v":0},null,{"$f":"VLOOKUP(L115,Tabella_prezzi!$A$1:$L$189,4,FALSE)","v":99},"L7N93",{"$f":"VLOOKUP(L115,Tabella_prezzi!$A$1:$L$189,6,FALSE)","v":"TS4L7-DAC3SFP28"}]
["Cable, SFP+ to SFP+, 10GbE, Copper Twinax Direct Attach Cable, 3 Meter",null,null,{"$f":"VLOOKUP(L116,Tabella_prezzi!$A$1:$L$189,8,FALSE)","v":"Cable, SFP+ to SFP+, 10GbE, Copper Twinax Direct Attach Cable, 3 Meter"},null,null,{"$f":"\"\"","v":""},{"$f":"VLOOKUP(L116,Tabella_prezzi!$A$1:$L$189,9,FALSE)","v":"Cable, SFP+ to SFP+, 10GbE, Copper Twinax Direct Attach Cable, 3 Meter"},{"$f":"VLOOKUP(L116,Tabella_prezzi!$A$1:$L$189,3,FALSE)","v":"OpzDAC3M"},null,{"$f":"VLOOKUP(L116,Tabella_prezzi!$A$1:$L$189,4,FALSE)","v":9999},"L7N67",{"$f":"VLOOKUP(L116,Tabella_prezzi!$A$1:$L$189,6,FALSE)","v":"TS4L7-DAC3M"}]
["Transceiver, SFP+, 10GbE, SR, 850nm Wavelength, 300m ",null,null,{"$f":"VLOOKUP(L117,Tabella_prezzi!$A$1:$L$189,8,FALSE)","v":"Transceiver, SFP+, 10GbE, SR, 850nm Wavelength, 300m Reach"},null,null,null,{"$f":"VLOOKUP(L117,Tabella_prezzi!$A$1:$L$189,9,FALSE)","v":"Transceiver, SFP+, 10GbE, SR, 850nm Wavelength, 300m Reach"},{"$f":"VLOOKUP(L117,Tabella_prezzi!$A$1:$L$189,3,FALSE)","v":"Opz10GBIC"},null,{"$f":"VLOOKUP(L117,Tabella_prezzi!$A$1:$L$189,4,FALSE)","v":90},"L7N66",{"$f":"VLOOKUP(L117,Tabella_prezzi!$A$1:$L$189,6,FALSE)","v":"TS4L7-10GBIC"}]
["Mellanox LinkX 100Gb/s Passive Copper Cables - attacco cavo diretto - 3 m - nero",null,null,{"$f":"VLOOKUP(L118,Tabella_prezzi!$A$1:$L$189,8,FALSE)","v":"Mellanox LinkX 100Gb/s Passive Copper Cables - attacco cavo diretto - 3 m - nero"},null,null,null,{"$f":"VLOOKUP(L118,Tabella_prezzi!$A$1:$L$189,9,FALSE)","v":"Mellanox LinkX 100Gb/s Passive Copper Cables - attacco cavo diretto - 3 m - nero"},{"$f":"VLOOKUP(L118,Tabella_prezzi!$A$1:$L$189,3,FALSE)","v":"OpzLINKX3m"},null,{"$f":"VLOOKUP(L118,Tabella_prezzi!$A$1:$L$189,4,FALSE)","v":9999},"L7N63",{"$f":"VLOOKUP(L118,Tabella_prezzi!$A$1:$L$189,6,FALSE)","v":"TS4L7-MEL100M3"}]
["Mellanox LinkX 100Gb/s VCSEL-Based Active Optical Cables - cavo InfiniBand - 10 m",null,null,{"$f":"VLOOKUP(L119,Tabella_prezzi!$A$1:$L$189,8,FALSE)","v":"Mellanox LinkX 100Gb/s VCSEL-Based Active Optical Cables - cavo InfiniBand - 10 m"},null,null,null,{"$f":"VLOOKUP(L119,Tabella_prezzi!$A$1:$L$189,9,FALSE)","v":"Mellanox LinkX 100Gb/s VCSEL-Based Active Optical Cables - cavo InfiniBand - 10 m"},{"$f":"VLOOKUP(L119,Tabella_prezzi!$A$1:$L$189,3,FALSE)","v":"OpzLINKX10m"},null,{"$f":"VLOOKUP(L119,Tabella_prezzi!$A$1:$L$189,4,FALSE)","v":9999},"L7N64",{"$f":"VLOOKUP(L119,Tabella_prezzi!$A$1:$L$189,6,FALSE)","v":"TS4L7-MEL100M10"}]
["Dell EMC PowerEdge QSFP28 SR4 100GbE 85C optic",null,null,{"$f":"VLOOKUP(L120,Tabella_prezzi!$A$1:$L$189,8,FALSE)","v":"Dell EMC PowerEdge QSFP28 SR4 100GbE 85C optic Customer Install"},null,null,null,{"$f":"VLOOKUP(L120,Tabella_prezzi!$A$1:$L$189,9,FALSE)","v":"Dell EMC PowerEdge QSFP28 SR4 100GbE 85C optic Customer Install"},{"$f":"VLOOKUP(L120,Tabella_prezzi!$A$1:$L$189,3,FALSE)","v":"OpzQSFP28"},null,{"$f":"VLOOKUP(L120,Tabella_prezzi!$A$1:$L$189,4,FALSE)","v":9999},"L7N65",{"$f":"VLOOKUP(L120,Tabella_prezzi!$A$1:$L$189,6,FALSE)","v":"TS4L7-QSFP28"}]
["Dell Networking Cable, OM4 LC/LC Fiber Cable, 3 Meter",null,null,{"$f":"VLOOKUP(L121,Tabella_prezzi!$A$1:$L$189,8,FALSE)","v":"Dell Networking Cable, OM4 LC/LC Fiber Cable, 3 Meter"},null,null,{"$f":"\"\"","v":""},{"$f":"VLOOKUP(L121,Tabella_prezzi!$A$1:$L$189,9,FALSE)","v":"Dell Networking Cable, OM4 LC/LC Fiber Cable, 3 Meter"},{"$f":"VLOOKUP(L121,Tabella_prezzi!$A$1:$L$189,3,FALSE)","v":0},null,{"$f":"VLOOKUP(L121,Tabella_prezzi!$A$1:$L$189,4,FALSE)","v":69},"L7N130",{"$f":"VLOOKUP(L121,Tabella_prezzi!$A$1:$L$189,6,FALSE)","v":"TS4L7-OM4M3"}]
[]
["TS3L7_CTRL"]
[null,null,null,null,null,null,{"$f":"\"\"","v":""},null,{"$f":"\"\"","v":""},null,null,{"$f":"\"\"","v":""},{"$f":"\"\"","v":""}]
[{"$f":"D125","v":"PERC H745 Controller"},{"$f":"D125","v":"PERC H745 Controller"},null,{"$f":"VLOOKUP(L125,Tabella_prezzi!$A$1:$L$189,9,FALSE)","v":"PERC H745 Controller"},null,null,{"$f":"\"\"","v":""},{"$f":"VLOOKUP(L125,Tabella_prezzi!$A$1:$L$189,9,FALSE)","v":"PERC H745 Controller"},{"$f":"\"\"","v":""},null,null,"L7N44",{"$f":"VLOOKUP(L125,Tabella_prezzi!$A$1:$L$189,6,FALSE)","v":0}]
[{"$f":"D126","v":"HBA355i Controller Adapter, Front, Cust Kit"},{"$f":"D126","v":"HBA355i Controller Adapter, Front, Cust Kit"},null,{"$f":"VLOOKUP(L126,Tabella_prezzi!$A$1:$L$189,9,FALSE)","v":"HBA355i Controller Adapter, Front, Cust Kit"},null,null,1,{"$f":"VLOOKUP(L126,Tabella_prezzi!$A$1:$L$189,9,FALSE)","v":"HBA355i Controller Adapter, Front, Cust Kit"},{"$f":"VLOOKUP(L126,Tabella_prezzi!$A$1:$L$189,3,FALSE)","v":0},null,{"$f":"VLOOKUP(L126,Tabella_prezzi!$A$1:$L$189,4,FALSE)","v":180},"L7N34",{"$f":"VLOOKUP(L126,Tabella_prezzi!$A$1:$L$189,6,FALSE)","v":"TS4L7-HBA355i-L"}]
[]
[{"$f":"#REF!","v":{"$error":"#REF!"}},{"$f":"IF(A128=\"\",A125,\"Pippo\")","v":{"$error":"#REF!"}},"Conf 1"]
[null,null,"Conf 2"]
[null,null,"Conf 3"]
["TS3L7_CMA"]
["No ",null,null,null,null,null,{"$f":"\"\"","v":""},null,{"$f":"\"\"","v":""},null,null,{"$f":"\"\"","v":""},{"$f":"\"\"","v":""}]
["2U Cable Management Arm","CMA","TS3L7-CMA2U","2U Cable Management Arm",null,null,1,{"$f":"VLOOKUP(L133,Tabella_prezzi!$A$1:$L$189,9,FALSE)","v":"2U Cable Management Arm"},{"$f":"VLOOKUP(L133,Tabella_prezzi!$A$1:$L$189,3,FALSE)","v":0},null,{"$f":"VLOOKUP(L133,Tabella_prezzi!$A$1:$L$189,4,FALSE)","v":50},"L7N135",{"$f":"VLOOKUP(L133,Tabella_prezzi!$A$1:$L$189,6,FALSE)","v":"TS4L7-CMA2U"}]
[]
[]
["TS3L7_BEZEL"]
["No Bezel","Bezel",null,"No Bezel",null,null,{"$f":"\"\"","v":""},null,{"$f":"\"\"","v":""},null,null,{"$f":"\"\"","v":""},{"$f":"\"\"","v":""}]
["-=-=-=-=-=-=-=-=-=-=-=-=-=-=-=-=-20%-=-=-=-=-=-=-=-=-=-=-=-=-=-=-=-=-",null,null,null,null,null,{"$f":"\"\"","v":""},null,{"$f":"\"\"","v":""},null,null,{"$f":"\"\"","v":""},{"$f":"\"\"","v":""}]
["[TS3L7-BZLLCD] LCD Security Bezel","Bezel","TS3L7-BZLLCD","LCD Security Bezel",null,null,1,{"$f":"VLOOKUP(L139,Tabella_prezzi!$A$1:$L$189,9,FALSE)","v":"PowerEdge 2U LCD Bezel"},{"$f":"VLOOKUP(L139,Tabella_prezzi!$A$1:$L$189,3,FALSE)","v":"OpzBezelLCD"},null,{"$f":"VLOOKUP(L139,Tabella_prezzi!$A$1:$L$189,4,FALSE)","v":63},"L7N68",{"$f":"VLOOKUP(L139,Tabella_prezzi!$A$1:$L$189,6,FALSE)","v":"TS4L7-BZLLCD"}]
["[TS3L7-BZLSTD] Standard Security Bezel","Bezel","TS3L7-BZLSTD","Standard Security Bezel",null,null,1,{"$f":"VLOOKUP(L140,Tabella_prezzi!$A$1:$L$189,9,FALSE)","v":"PowerEdge 2U Standard Bezel"},{"$f":"VLOOKUP(L140,Tabella_prezzi!$A$1:$L$189,3,FALSE)","v":"OpzBezelSTD"},null,{"$f":"VLOOKUP(L140,Tabella_prezzi!$A$1:$L$189,4,FALSE)","v":42},"L7N69",{"$f":"VLOOKUP(L140,Tabella_prezzi!$A$1:$L$189,6,FALSE)","v":"TS4L7-BZLSTD"}]
[]
["TS3L7_ISDM"]
["No Boss card",null,null,null,null,null,{"$f":"\"\"","v":""},null,{"$f":"\"\"","v":""},null,null,{"$f":"\"\"","v":""},{"$f":"\"\"","v":""}]
["-=-=-=-=-=-=-=-=-=-=-=-=-=-=-=-=-20%-=-=-=-=-=-=-=-=-=-=-=-=-=-=-=-=-",null,null,null,null,null,{"$f":"\"\"","v":""},null,{"$f":"\"\"","v":""},null,null,{"$f":"\"\"","v":""},{"$f":"\"\"","v":""}]
["BOSS-S2  controller card, full height, with 2 480G M.2 Drives",null,null,{"$f":"VLOOKUP(L145,Tabella_prezzi!$A$1:$L$189,8,FALSE)","v":"BOSS-S2 controller card without cable"},null,null,1,{"$f":"VLOOKUP(L145,Tabella_prezzi!$A$1:$L$189,9,FALSE)","v":"BOSS-S2 controller card without cable"},{"$f":"VLOOKUP(L145,Tabella_prezzi!$A$1:$L$189,3,FALSE)","v":"OpBOSS"},null,{"$f":"VLOOKUP(L145,Tabella_prezzi!$A$1:$L$189,4,FALSE)","v":134},"L7N70",{"$f":"VLOOKUP(L145,Tabella_prezzi!$A$1:$L$189,6,FALSE)","v":"TS4L7-BOSS"}]
[]
["TS3L7_OME"]
["No OMEA",null,null,null,null,null,{"$f":"\"\"","v":""},null,{"$f":"\"\"","v":""},null,null,{"$f":"\"\"","v":""},{"$f":"\"\"","v":""}]
["[TS4L7-OMEA] OpenManage Enterprise Advanced","OpenManage Enterprise Advanced","TS3L7-OMEA","OpenManage Enterprise Advanced",null,null,1,{"$f":"VLOOKUP(L149,Tabella_prezzi!$A$1:$L$189,9,FALSE)","v":"OpenManage Enterprise Advanced"},{"$f":"VLOOKUP(L149,Tabella_prezzi!$A$1:$L$189,3,FALSE)","v":0},null,{"$f":"VLOOKUP(L149,Tabella_prezzi!$A$1:$L$189,4,FALSE)","v":214},"L7N96",{"$f":"VLOOKUP(L149,Tabella_prezzi!$A$1:$L$189,6,FALSE)","v":"TS4L7-OMEA"}]
[]
["TS3L7_WARRANTY"]
["Manutenzione in garanzia (36 mesi)","Dell Services: Extended Service",null,"RESTRICTED:ProSupport One Data Center and Next Business Day Onsite Service Volume Low, 39 Month(s)",null,null,{"$f":"\"\"","v":""},null,{"$f":"\"\"","v":""},null,null,{"$f":"\"\"","v":""},{"$f":"\"\"","v":""}]
[{"$f":"D153","v":"Estensione della manutenzione in garanzia per ulteriori 24 mesi"},"Dell Services: Extended Service",null,{"$f":"VLOOKUP(L153,Tabella_prezzi!$A$1:$L$189,8,FALSE)","v":"Estensione della manutenzione in garanzia per ulteriori 24 mesi"},null,null,1,{"$f":"VLOOKUP(L153,Tabella_prezzi!$A$1:$L$384,9,FALSE)","v":"Estensione della manutenzione in garanzia per ulteriori 24 mesi"},{"$f":"VLOOKUP(L153,Tabella_prezzi!$A$1:$L$384,3,FALSE)","v":"OpzEstensione24"},{"$f":"VLOOKUP(L153,Tabella_prezzi!$A$1:$L$384,4,FALSE)","v":183.01},null,"L7N29",{"$f":"VLOOKUP(L153,Tabella_prezzi!$A$1:$L$189,6,FALSE)","v":"TS4L7-OpzEst24"}]
[]
["TS3L7_WARRANTY GPU"]
["Manutenzione in garanzia (36 mesi)","Dell Services: Extended Service",null,"RESTRICTED:ProSupport One Data Center and Next Business Day Onsite Service Volume Low, 39 Month(s)",null,null,{"$f":"\"\"","v":""},null,{"$f":"\"\"","v":""},null,null,{"$f":"\"\"","v":""},{"$f":"\"\"","v":""}]
[{"$f":"D157","v":"Estensione della manutenzione GPU in garanzia per ulteriori 24 mesi"},"Dell Services: Extended Service",null,{"$f":"VLOOKUP(L157,Tabella_prezzi!$A$1:$L$189,8,FALSE)","v":"Estensione della manutenzione GPU in garanzia per ulteriori 24 mesi"},null,null,1,{"$f":"VLOOKUP(L157,Tabella_prezzi!$A$1:$L$384,9,FALSE)","v":"Estensione della manutenzione GPU in garanzia per ulteriori 24 mesi"},{"$f":"VLOOKUP(L157,Tabella_prezzi!$A$1:$L$384,3,FALSE)","v":"OpzEstensione24-GPU"},{"$f":"VLOOKUP(L157,Tabella_prezzi!$A$1:$L$384,4,FALSE)","v":115.54},null,"L7N31",{"$f":"VLOOKUP(L157,Tabella_prezzi!$A$1:$L$189,6,FALSE)","v":"TS4L7-OpzEst24GPU"}]
[]
["TS34_KYHDD"]
[{"$f":"\"\"","v":""},"Keep Your Hard Drive",null,null,null,null,{"$f":"\"\"","v":""},null,{"$f":"\"\"","v":""},null,null,{"$f":"\"\"","v":""},{"$f":"\"\"","v":""}]
[{"$f":"D161","v":"Hard Disk Retention 36 mesi"},"Keep Your Hard Drive",null,{"$f":"VLOOKUP(L161,Tabella_prezzi!$A$1:$L$189,8,FALSE)","v":"Hard Disk Retention 36 mesi"},null,null,1,{"$f":"VLOOKUP(L161,Tabella_prezzi!$A$1:$L$384,9,FALSE)","v":"Hard Disk Retention 36 mesi"},{"$f":"VLOOKUP(L161,Tabella_prezzi!$A$1:$L$384,3,FALSE)","v":"OpzHDDRetention36"},{"$f":"VLOOKUP(L161,Tabella_prezzi!$A$1:$L$384,4,FALSE)","v":25.19},null,"L7N28",{"$f":"VLOOKUP(L161,Tabella_prezzi!$A$1:$L$189,6,FALSE)","v":"TS4L7-HDRTN36"}]
["Hard Disk Retention 60 mesi","Keep Your Hard Drive",null,{"$f":"VLOOKUP(L162,Tabella_prezzi!$A$1:$L$189,8,FALSE)","v":"Hard Disk Retention 60 mesi"},null,null,1,{"$f":"VLOOKUP(L162,Tabella_prezzi!$A$1:$L$384,9,FALSE)","v":"Hard Disk Retention 60 mesi"},{"$f":"VLOOKUP(L162,Tabella_prezzi!$A$1:$L$384,3,FALSE)","v":"OpzHDDRetention60"},{"$f":"VLOOKUP(L162,Tabella_prezzi!$A$1:$L$384,4,FALSE)","v":41.81},null,"L7N28b",{"$f":"VLOOKUP(L162,Tabella_prezzi!$A$1:$L$189,6,FALSE)","v":"TS4L7-HDRTN60"}]
[]
["TS3L2_UPS"]
[{"$f":"\"\"","v":""},null,null,null,null,null,{"$f":"\"\"","v":""},null,{"$f":"\"\"","v":""},null,null,{"$f":"\"\"","v":""},{"$f":"\"\"","v":""}]
[{"$f":"D166","v":"Dispositivo UPS di tipo On-line doppia conversione, strutturato per il montaggio a rack da 19”"},null,null,{"$f":"VLOOKUP(L166,Tabella_prezzi!$A$1:$L$189,8,FALSE)","v":"Dispositivo UPS di tipo On-line doppia conversione, strutturato per il montaggio a rack da 19”"},null,null,1,{"$f":"VLOOKUP(L166,Tabella_prezzi!$A$1:$L$384,9,FALSE)","v":"Dispositivo UPS di tipo On-line doppia conversione, strutturato per il montaggio a rack da 19”"},{"$f":"VLOOKUP(L166,Tabella_prezzi!$A$1:$L$384,3,FALSE)","v":"OpzUps (3000VA)"},{"$f":"VLOOKUP(L166,Tabella_prezzi!$A$1:$L$384,4,FALSE)","v":386.02},null,"L7N20",{"$f":"VLOOKUP(L166,Tabella_prezzi!$A$1:$L$189,6,FALSE)","v":"TS4L7-UPS"}]
["TS4L4_RACK"]
[{"$f":"\"\"","v":""},null,null,null,null,null,{"$f":"\"\"","v":""},null,{"$f":"\"\"","v":""},null,null,{"$f":"\"\"","v":""},{"$f":"\"\"","v":""}]
[{"$f":"D169","v":"Armadio Rack 42U"},null,null,{"$f":"VLOOKUP(L169,Tabella_prezzi!$A$1:$L$189,8,FALSE)","v":"Armadio Rack 42U"},null,null,1,{"$f":"VLOOKUP(L169,Tabella_prezzi!$A$1:$L$384,9,FALSE)","v":"Armadio Rack 42U"},{"$f":"VLOOKUP(L169,Tabella_prezzi!$A$1:$L$384,3,FALSE)","v":"OpzRack"},{"$f":"VLOOKUP(L169,Tabella_prezzi!$A$1:$L$384,4,FALSE)","v":579.63},null,"L7N30",{"$f":"VLOOKUP(L169,Tabella_prezzi!$A$1:$L$189,6,FALSE)","v":"TS4L7-RACK"}]
[]
["TS4L7_GUI"]
[{"$f":"\"\"","v":""},null,null,null,null,null,{"$f":"\"\"","v":""},null,{"$f":"\"\"","v":""},null,null,{"$f":"\"\"","v":""},{"$f":"\"\"","v":""}]
[{"$f":"D173","v":"Unità KVM - monitor 17\", cavo combi PS/2&USB da 1,8mt, tastiera italiana, touch pad"},null,null,{"$f":"VLOOKUP(L173,Tabella_prezzi!$A$1:$L$189,8,FALSE)","v":"Unità KVM - monitor 17\", cavo combi PS/2&USB da 1,8mt, tastiera italiana, touch pad"},null,null,1,{"$f":"VLOOKUP(L173,Tabella_prezzi!$A$1:$L$384,9,FALSE)","v":"Unità KVM - monitor 17\", cavo combi PS/2&USB da 1,8mt, tastiera italiana, touch pad"},{"$f":"VLOOKUP(L173,Tabella_prezzi!$A$1:$L$384,3,FALSE)","v":"OpzGUI"},{"$f":"VLOOKUP(L173,Tabella_prezzi!$A$1:$L$384,4,FALSE)","v":491.62},null,"L7N21",{"$f":"VLOOKUP(L173,Tabella_prezzi!$A$1:$L$189,6,FALSE)","v":"TS4L7-GUI"}]
[]
["TS4L7_KVM"]
[{"$f":"\"\"","v":""},null,null,null,null,null,{"$f":"\"\"","v":""},null,{"$f":"\"\"","v":""},null,null,{"$f":"\"\"","v":""},{"$f":"\"\"","v":""}]
[{"$f":"D177","v":"KVM Switch IP per GUI 16P"},null,null,{"$f":"VLOOKUP(L177,Tabella_prezzi!$A$1:$L$189,8,FALSE)","v":"KVM Switch IP per GUI 16P"},null,null,1,{"$f":"VLOOKUP(L177,Tabella_prezzi!$A$1:$L$384,9,FALSE)","v":"KVM Switch IP per GUI 16P"},{"$f":"VLOOKUP(L177,Tabella_prezzi!$A$1:$L$384,3,FALSE)","v":"OpzKVM"},{"$f":"VLOOKUP(L177,Tabella_prezzi!$A$1:$L$384,4,FALSE)","v":552.47},null,"L7N22",{"$f":"VLOOKUP(L177,Tabella_prezzi!$A$1:$L$189,6,FALSE)","v":"TS4L7-KVM"}]
["SFP+ Transceivers"]
["Transceiver, SFP+ SR Optic for SFP+ ports (Intel X710)",null,null,{"$f":"VLOOKUP(L179,Tabella_prezzi!$A$1:$L$189,8,FALSE)","v":"SFP+ SR Optic for SFP+ ports (Intel X710)"},null,null,1,{"$f":"VLOOKUP(L179,Tabella_prezzi!$A$1:$L$384,9,FALSE)","v":"SFP+ SR Optic for SFP+ ports (Intel X710)"},{"$f":"VLOOKUP(L179,Tabella_prezzi!$A$1:$L$384,3,FALSE)","v":0},null,{"$f":"VLOOKUP(L179,Tabella_prezzi!$A$1:$L$189,4,FALSE)","v":126},"L7N109",{"$f":"VLOOKUP(L179,Tabella_prezzi!$A$1:$L$189,6,FALSE)","v":"TS4L7-OT10GB"}]
[null,"=ConfigurationTS3L7!$A$172:$A$186"]
["PCI1","=SE($N$75=\"SW\";ConfigurationTS3L7!$A$283:$A$300;SE($N$75=\"DW\";ConfigurationTS3L7!$A$240:$A$259;ConfigurationTS3L7!$A$172:$A$186))",null,null,null,null,null,{"$f":"EXACT(B181,B182)","v":false}]
["PCI2","=SE($N$75=\"SW\";ConfigurationTS3L7!$A$172:$A$186;SE($N$75=\"DW\";ConfigurationTS3L7!$A$322:$A$322;ConfigurationTS3L7!$A$172:$A$186))",null,null,null,null,null,{"$f":"EXACT(B182,B183)","v":false}]
["PCI3","=SE($N$75=\"SW\";ConfigurationTS3L7!$A$172:$A$186;SE($N$75=\"DW\";ConfigurationTS3L7!$A$189:$A$204;ConfigurationTS3L7!$A$172:$A$186))"]
["PCI4","=SE($N$75=\"SW\";ConfigurationTS3L7!$A$303:$A$319;SE($N$75=\"DW\";ConfigurationTS3L7!$A$262:$A$280;SE($N$75=\"2CPU\";ConfigurationTS3L7!$A$189:$A$204;ConfigurationTS3L7!$A$103:$A$104)))"]
["PCI5","=SE($N$86=\"DW\";ConfigurationTS3L7!$A$322;SE($N$75=\"SW\";ConfigurationTS3L7!$A$172:$A$186;SE($N$75=\"DW\";ConfigurationTS3L7!$A$172:$A$186;SE($N$75=\"2CPU\";ConfigurationTS3L7!$A$172:$A$186;ConfigurationTS3L7!$A$103:$A$104))))"]
["PCI6","=SE($N$9=\"VxFlex\";ConfigurationTS3L7!$A$230;ConfigurationTS3L7!$A$207:$A$218)"]
["PCI7","=SE($N$9=\"VxFlex\";ConfigurationTS3L7!$A$235;SE($N$98=\"DW\";ConfigurationTS3L7!$A$322;SE($N$75=\"1CPU\";ConfigurationTS3L7!$A$103:$A$104;ConfigurationTS3L7!$A$172:$A$186)))"]
["PCI8","=SE($N$9=\"VxFlex\";ConfigurationTS3L7!$A$235;SE($N$75=\"SW\";ConfigurationTS3L7!$A$303:$A$319;SE($N$75=\"DW\";ConfigurationTS3L7!$A$240:$A$259;SE($N$75=\"2CPU\";ConfigurationTS3L7!$A$221:$A$237;ConfigurationTS3L7!$A$103:$A$104))))"]
[]
[]
[]
["PCI SLOT 9"]
[{"$f":"\"\"","v":""}]
[{"$f":"D194","v":"Broadcom 5719 Quad Port 1GbE BASE-T Adapter, OCP NIC 3.0"},null,null,{"$f":"VLOOKUP(L194,Tabella_prezzi!$A$1:$L$189,9,FALSE)","v":"Broadcom 5719 Quad Port 1GbE BASE-T Adapter, OCP NIC 3.0"},null,"540-BBCX",1,{"$f":"VLOOKUP(L194,Tabella_prezzi!$A$1:$L$189,9,FALSE)","v":"Broadcom 5719 Quad Port 1GbE BASE-T Adapter, OCP NIC 3.0"},{"$f":"VLOOKUP(L194,Tabella_prezzi!$A$1:$L$189,3,FALSE)","v":"OpzGigabit"},{"$f":"VLOOKUP(L194,Tabella_prezzi!$A$1:$L$189,4,FALSE)","v":29.18},null,"L7N75",{"$f":"VLOOKUP(L194,Tabella_prezzi!$A$1:$L$189,6,FALSE)","v":"TS4L7-LAN1-OCP"}]
["\tBroadcom 57412 Dual Port 10GbE SFP+, OCP NIC 3.0",null,null,{"$f":"VLOOKUP(L195,Tabella_prezzi!$A$1:$L$189,9,FALSE)","v":"\tBroadcom 57412 Dual Port 10GbE SFP+, OCP NIC 3.0"},null,"540-BBCX",1,{"$f":"VLOOKUP(L195,Tabella_prezzi!$A$1:$L$189,9,FALSE)","v":"\tBroadcom 57412 Dual Port 10GbE SFP+, OCP NIC 3.0"},{"$f":"VLOOKUP(L195,Tabella_prezzi!$A$1:$L$189,3,FALSE)","v":"OpzGigabit10Gbps"},{"$f":"VLOOKUP(L195,Tabella_prezzi!$A$1:$L$189,4,FALSE)","v":160.47999999999999},null,"L7N76",{"$f":"VLOOKUP(L195,Tabella_prezzi!$A$1:$L$189,6,FALSE)","v":"TS4L7-LAN10-OCP"}]
["Intel X710-T2L Dual Port 10GbE BASE-T, OCP NIC 3.0",null,null,{"$f":"VLOOKUP(L196,Tabella_prezzi!$A$1:$L$189,9,FALSE)","v":"Intel X710-T2L Dual Port 10GbE BASE-T, OCP NIC 3.0"},null,"540-BBCX",1,{"$f":"VLOOKUP(L196,Tabella_prezzi!$A$1:$L$189,9,FALSE)","v":"Intel X710-T2L Dual Port 10GbE BASE-T, OCP NIC 3.0"},{"$f":"VLOOKUP(L196,Tabella_prezzi!$A$1:$L$189,3,FALSE)","v":"Opz10Gigabit BaseT"},{"$f":"VLOOKUP(L196,Tabella_prezzi!$A$1:$L$189,4,FALSE)","v":147.52000000000001},null,"L7N79",{"$f":"VLOOKUP(L196,Tabella_prezzi!$A$1:$L$189,6,FALSE)","v":"TS4L7- BaseT-L"}]
["TS3L2_PCI_A"]
[{"$f":"\"\"","v":""},null,null,null,null,null,{"$f":"\"\"","v":""},null,{"$f":"\"\"","v":""},null,null,{"$f":"\"\"","v":""},{"$f":"\"\"","v":""}]
[{"$f":"D199","v":"Broadcom 5719 Quad Port 1Gb Network Interface Card, Low Profile "},null,null,{"$f":"VLOOKUP(L199,Tabella_prezzi!$A$1:$L$189,9,FALSE)","v":"Broadcom 5719 Quad Port 1Gb Network Interface Card, Low Profile "},null,"540-BBCX",1,{"$f":"VLOOKUP(L199,Tabella_prezzi!$A$1:$L$189,9,FALSE)","v":"Broadcom 5719 Quad Port 1Gb Network Interface Card, Low Profile "},{"$f":"VLOOKUP(L199,Tabella_prezzi!$A$1:$L$189,3,FALSE)","v":"OpzGigabit"},{"$f":"VLOOKUP(L199,Tabella_prezzi!$A$1:$L$189,4,FALSE)","v":29.18},null,"L7N05",{"$f":"VLOOKUP(L199,Tabella_prezzi!$A$1:$L$189,6,FALSE)","v":"TS4L7-LAN1"}]
["Broadcom 57412 Dual Port 10Gb, SFP+, PCIe Adapter, Low Profile + Optics",null,null,{"$f":"VLOOKUP(L200,Tabella_prezzi!$A$1:$L$189,9,FALSE)","v":"Broadcom 57412 Dual Port 10Gb, SFP+, PCIe Adapter, Low Profile + Optics"},null,"540-BBCX",1,{"$f":"VLOOKUP(L200,Tabella_prezzi!$A$1:$L$189,9,FALSE)","v":"Broadcom 57412 Dual Port 10Gb, SFP+, PCIe Adapter, Low Profile + Optics"},{"$f":"VLOOKUP(L200,Tabella_prezzi!$A$1:$L$189,3,FALSE)","v":"OpzGigabit10Gbps"},{"$f":"VLOOKUP(L200,Tabella_prezzi!$A$1:$L$189,4,FALSE)","v":160.47999999999999},null,"L7N06",{"$f":"VLOOKUP(L200,Tabella_prezzi!$A$1:$L$189,6,FALSE)","v":"TS4L7-LAN10"}]
["Intel Ethernet XXV710 Dual Port 10/25GbE SFP28 Adapter, PCIe Low Profile + Optics",null,null,{"$f":"VLOOKUP(L201,Tabella_prezzi!$A$1:$L$189,9,FALSE)","v":"Intel Ethernet XXV710 Dual Port 10/25GbE SFP28 Adapter, PCIe Low Profile + Optics"},null,"540-BBCX",1,{"$f":"VLOOKUP(L201,Tabella_prezzi!$A$1:$L$189,9,FALSE)","v":"Intel Ethernet XXV710 Dual Port 10/25GbE SFP28 Adapter, PCIe Low Profile + Optics"},{"$f":"VLOOKUP(L201,Tabella_prezzi!$A$1:$L$189,3,FALSE)","v":"OpzGigabit25Gbps"},{"$f":"VLOOKUP(L201,Tabella_prezzi!$A$1:$L$189,4,FALSE)","v":249.64},null,"L7N07",{"$f":"VLOOKUP(L201,Tabella_prezzi!$A$1:$L$189,6,FALSE)","v":"TS4L7-LAN25"}]
["QLogic FastLinQ 41262 Dual Port 25Gb SFP28 Adapter, Low Profile + Optics",null,null,{"$f":"VLOOKUP(L202,Tabella_prezzi!$A$1:$L$189,9,FALSE)","v":"QLogic FastLinQ 41262 Dual Port 25Gb SFP28 Adapter, Low Profile + Optics"},null,"540-BBCX",1,{"$f":"VLOOKUP(L202,Tabella_prezzi!$A$1:$L$189,9,FALSE)","v":"QLogic FastLinQ 41262 Dual Port 25Gb SFP28 Adapter, Low Profile + Optics"},{"$f":"VLOOKUP(L202,Tabella_prezzi!$A$1:$L$189,3,FALSE)","v":"OpzGigabit10Gbps CNA"},{"$f":"VLOOKUP(L202,Tabella_prezzi!$A$1:$L$189,4,FALSE)","v":153.19},null,"L7N08",{"$f":"VLOOKUP(L202,Tabella_prezzi!$A$1:$L$189,6,FALSE)","v":"TS4L7-CNA10"}]
["Intel X710-T2L Dual Port 10GbE BASE-T Adapter, PCIe LP",null,null,{"$f":"VLOOKUP(L203,Tabella_prezzi!$A$1:$L$189,9,FALSE)","v":"Intel X710-T2L Dual Port 10GbE BASE-T Adapter, PCIe LP"},null,"540-BBCX",1,{"$f":"VLOOKUP(L203,Tabella_prezzi!$A$1:$L$189,9,FALSE)","v":"Intel X710-T2L Dual Port 10GbE BASE-T Adapter, PCIe LP"},{"$f":"VLOOKUP(L203,Tabella_prezzi!$A$1:$L$189,3,FALSE)","v":"Opz10Gigabit BaseT"},{"$f":"VLOOKUP(L203,Tabella_prezzi!$A$1:$L$189,4,FALSE)","v":147.52000000000001},null,"L7N09",{"$f":"VLOOKUP(L203,Tabella_prezzi!$A$1:$L$189,6,FALSE)","v":"TS4L7-BaseT-LP"}]
["Intel E810 Dual Port 100GbE QSFP28 Adapter, PCIe Low Profile + Optics",null,null,{"$f":"VLOOKUP(L204,Tabella_prezzi!$A$1:$L$189,9,FALSE)","v":"Intel E810 Dual Port 100GbE QSFP28 Adapter, PCIe Low Profile + Optics"},null,"540-BBCX",1,{"$f":"VLOOKUP(L204,Tabella_prezzi!$A$1:$L$189,9,FALSE)","v":"Intel E810 Dual Port 100GbE QSFP28 Adapter, PCIe Low Profile + Optics"},{"$f":"VLOOKUP(L204,Tabella_prezzi!$A$1:$L$189,3,FALSE)","v":"Opz100Gbit"},{"$f":"VLOOKUP(L204,Tabella_prezzi!$A$1:$L$189,4,FALSE)","v":811.34},null,"L7N10",{"$f":"VLOOKUP(L204,Tabella_prezzi!$A$1:$L$189,6,FALSE)","v":"TS4L7- Opz100Gbit"}]
["QLogic 2772 Dual Port 32GbE Fibre Channel HBA, PCIe Low Profile+ Optics",null,null,{"$f":"VLOOKUP(L205,Tabella_prezzi!$A$1:$L$189,9,FALSE)","v":"QLogic 2772 Dual Port 32GbE Fibre Channel HBA, PCIe Low Profile+ Optics"},null,"540-BBCX",1,{"$f":"VLOOKUP(L205,Tabella_prezzi!$A$1:$L$189,9,FALSE)","v":"QLogic 2772 Dual Port 32GbE Fibre Channel HBA, PCIe Low Profile+ Optics"},{"$f":"VLOOKUP(L205,Tabella_prezzi!$A$1:$L$189,3,FALSE)","v":"OpzFibreChannel"},{"$f":"VLOOKUP(L205,Tabella_prezzi!$A$1:$L$189,4,FALSE)","v":425.36},null,"L7N11",{"$f":"VLOOKUP(L205,Tabella_prezzi!$A$1:$L$189,6,FALSE)","v":"TS4L7- FibreChannel"}]
[{"$f":"D206","v":"SAS 12Gbps HBA External Controller, Full Height"},null,null,{"$f":"VLOOKUP(L206,Tabella_prezzi!$A$1:$L$189,9,FALSE)","v":"SAS 12Gbps HBA External Controller, Full Height"},null,"540-BBCX",1,{"$f":"VLOOKUP(L206,Tabella_prezzi!$A$1:$L$189,9,FALSE)","v":"SAS 12Gbps HBA External Controller, Full Height"},{"$f":"VLOOKUP(L206,Tabella_prezzi!$A$1:$L$189,3,FALSE)","v":0},{"$f":"VLOOKUP(L206,Tabella_prezzi!$A$1:$L$189,4,FALSE)","v":92},null,"L7N101",{"$f":"VLOOKUP(L206,Tabella_prezzi!$A$1:$L$189,6,FALSE)","v":"TS4L7-SAS12"}]
["SAS 12Gbps HBA External Controller, Full Height",null,null,{"$f":"VLOOKUP(L207,Tabella_prezzi!$A$1:$L$189,9,FALSE)","v":"SAS 12Gbps HBA External Controller, Full Height"},null,"540-BBCX",1,{"$f":"VLOOKUP(L207,Tabella_prezzi!$A$1:$L$189,9,FALSE)","v":"SAS 12Gbps HBA External Controller, Full Height"},{"$f":"VLOOKUP(L207,Tabella_prezzi!$A$1:$L$189,3,FALSE)","v":0},{"$f":"VLOOKUP(L207,Tabella_prezzi!$A$1:$L$189,4,FALSE)","v":92},null,"L7N101",{"$f":"VLOOKUP(L207,Tabella_prezzi!$A$1:$L$189,6,FALSE)","v":"TS4L7-SAS12"}]
[{"$f":"\"\"","v":""},null,null,null,null,null,{"$f":"\"\"","v":""},null,{"$f":"\"\"","v":""},null,null,{"$f":"\"\"","v":""},{"$f":"\"\"","v":""}]
[{"$f":"D209","v":"Broadcom 57412 Dual Port 10Gb, SFP+, PCIe Adapter, Low Profile + Optics"},null,null,{"$f":"VLOOKUP(L209,Tabella_prezzi!$A$1:$L$189,9,FALSE)","v":"Broadcom 57412 Dual Port 10Gb, SFP+, PCIe Adapter, Low Profile + Optics"},null,null,1,null,{"$f":"VLOOKUP(L209,Tabella_prezzi!$A$1:$L$189,3,FALSE)","v":"OpzGigabit10Gbps"},null,{"$f":"VLOOKUP(L209,Tabella_prezzi!$A$1:$L$189,4,FALSE)","v":160.47999999999999},"L7N06",{"$f":"VLOOKUP(L209,Tabella_prezzi!$A$1:$L$189,6,FALSE)","v":"TS4L7-LAN10"}]
[{"$f":"D210","v":"Intel Ethernet XXV710 Dual Port 10/25GbE SFP28 Adapter, PCIe Low Profile + Optics"},null,null,{"$f":"VLOOKUP(L210,Tabella_prezzi!$A$1:$L$189,9,FALSE)","v":"Intel Ethernet XXV710 Dual Port 10/25GbE SFP28 Adapter, PCIe Low Profile + Optics"},null,null,1,{"$f":"VLOOKUP(L210,Tabella_prezzi!$A$1:$L$189,9,FALSE)","v":"Intel Ethernet XXV710 Dual Port 10/25GbE SFP28 Adapter, PCIe Low Profile + Optics"},{"$f":"VLOOKUP(L210,Tabella_prezzi!$A$1:$L$189,3,FALSE)","v":"OpzGigabit25Gbps"},null,{"$f":"VLOOKUP(L210,Tabella_prezzi!$A$1:$L$189,4,FALSE)","v":249.64},"L7N07",{"$f":"VLOOKUP(L210,Tabella_prezzi!$A$1:$L$189,6,FALSE)","v":"TS4L7-LAN25"}]
[{"$f":"D211","v":"QLogic FastLinQ 41262 Dual Port 25Gb SFP28 Adapter, Low Profile + Optics"},null,null,{"$f":"VLOOKUP(L211,Tabella_prezzi!$A$1:$L$189,9,FALSE)","v":"QLogic FastLinQ 41262 Dual Port 25Gb SFP28 Adapter, Low Profile + Optics"},null,null,1,null,{"$f":"VLOOKUP(L211,Tabella_prezzi!$A$1:$L$189,3,FALSE)","v":"OpzGigabit10Gbps CNA"},null,{"$f":"VLOOKUP(L211,Tabella_prezzi!$A$1:$L$189,4,FALSE)","v":153.19},"L7N08",{"$f":"VLOOKUP(L211,Tabella_prezzi!$A$1:$L$189,6,FALSE)","v":"TS4L7-CNA10"}]
[{"$f":"D212","v":"Intel X710-T2L Dual Port 10GbE BASE-T Adapter, PCIe LP"},null,null,{"$f":"VLOOKUP(L212,Tabella_prezzi!$A$1:$L$189,9,FALSE)","v":"Intel X710-T2L Dual Port 10GbE BASE-T Adapter, PCIe LP"},null,null,1,null,{"$f":"VLOOKUP(L212,Tabella_prezzi!$A$1:$L$189,3,FALSE)","v":"Opz10Gigabit BaseT"},null,{"$f":"VLOOKUP(L212,Tabella_prezzi!$A$1:$L$189,4,FALSE)","v":147.52000000000001},"L7N09",{"$f":"VLOOKUP(L212,Tabella_prezzi!$A$1:$L$189,6,FALSE)","v":"TS4L7-BaseT-LP"}]
[{"$f":"D213","v":"SAS 12Gbps HBA External Controller, Full Height"},null,"TS3L7-MCX4DP",{"$f":"VLOOKUP(L213,Tabella_prezzi!$A$1:$L$189,9,FALSE)","v":"SAS 12Gbps HBA External Controller, Full Height"},null,null,1,{"$f":"VLOOKUP(L213,Tabella_prezzi!$A$1:$L$189,9,FALSE)","v":"SAS 12Gbps HBA External Controller, Full Height"},{"$f":"VLOOKUP(L213,Tabella_prezzi!$A$1:$L$189,3,FALSE)","v":0},null,{"$f":"VLOOKUP(L213,Tabella_prezzi!$A$1:$L$189,4,FALSE)","v":92},"L7N101",{"$f":"VLOOKUP(L213,Tabella_prezzi!$A$1:$L$189,6,FALSE)","v":"TS4L7-SAS12"}]
["[TS3L7-BOSS480] BOSS controller card, full height, with 2 480G M.2 Drives",null,null,{"$f":"VLOOKUP(L214,Tabella_prezzi!$A$1:$L$189,8,FALSE)","v":"BOSS controller card, full height, with 2 480G M.2 Drives"},null,null,1,null,{"$f":"VLOOKUP(L214,Tabella_prezzi!$A$1:$L$189,3,FALSE)","v":0},null,{"$f":"VLOOKUP(L214,Tabella_prezzi!$A$1:$L$189,4,FALSE)","v":748},"L7N33",{"$f":"VLOOKUP(L214,Tabella_prezzi!$A$1:$L$189,6,FALSE)","v":"TS4L7-BOSS480"}]
["[TS3L7-SAS12] SAS 12Gbps HBA External Controller, Full Height",null,null,{"$f":"VLOOKUP(L215,Tabella_prezzi!$A$1:$L$189,8,FALSE)","v":"SAS 12Gbps HBA External Controller, Full Height"},null,null,1,{"$f":"VLOOKUP(L215,Tabella_prezzi!$A$1:$L$189,9,FALSE)","v":"SAS 12Gbps HBA External Controller, Full Height"},{"$f":"VLOOKUP(L215,Tabella_prezzi!$A$1:$L$189,3,FALSE)","v":0},null,{"$f":"VLOOKUP(L215,Tabella_prezzi!$A$1:$L$189,4,FALSE)","v":92},"L7N101",{"$f":"VLOOKUP(L215,Tabella_prezzi!$A$1:$L$189,6,FALSE)","v":"TS4L7-SAS12"}]
["[TS3L7-H840] PERC H840 RAID Adapter for External MD14XX Only, 8GB NV Cache",null,null,{"$f":"VLOOKUP(L216,Tabella_prezzi!$A$1:$L$189,8,FALSE)","v":"PERC H840 RAID Adapter for External MD14XX Only, 8GB NV Cache, Full Height"},null,null,1,null,{"$f":"VLOOKUP(L216,Tabella_prezzi!$A$1:$L$189,3,FALSE)","v":"OpzH840"},null,{"$f":"VLOOKUP(L216,Tabella_prezzi!$A$1:$L$189,4,FALSE)","v":479},"L7N71",{"$f":"VLOOKUP(L216,Tabella_prezzi!$A$1:$L$189,6,FALSE)","v":"TS4L7-H840"}]
["[TS3L7-57416] Broadcom 57416 Dual Port 10Gb, Base-T, PCIe Adapter",null,null,{"$f":"VLOOKUP(L217,Tabella_prezzi!$A$1:$L$189,8,FALSE)","v":"Broadcom 57416 Dual Port 10Gb, Base-T, PCIe Adapter, Full Height"},null,null,1,null,{"$f":"VLOOKUP(L217,Tabella_prezzi!$A$1:$L$189,3,FALSE)","v":0},null,{"$f":"VLOOKUP(L217,Tabella_prezzi!$A$1:$L$189,4,FALSE)","v":334},"L7N46",{"$f":"VLOOKUP(L217,Tabella_prezzi!$A$1:$L$189,6,FALSE)","v":"TS4L7-57416"}]
["[TS3L7-X710DP] Intel X710 Dual Port 10Gb Direct Attach, SFP+,PCIe",null,null,{"$f":"VLOOKUP(L218,Tabella_prezzi!$A$1:$L$189,8,FALSE)","v":"Intel X710 Dual Port 10Gb SFP+ FULL"},null,null,1,null,{"$f":"VLOOKUP(L218,Tabella_prezzi!$A$1:$L$189,3,FALSE)","v":0},null,{"$f":"VLOOKUP(L218,Tabella_prezzi!$A$1:$L$189,4,FALSE)","v":342},"L7N42",{"$f":"VLOOKUP(L218,Tabella_prezzi!$A$1:$L$189,6,FALSE)","v":"TS4L7-X710DP"}]
["[TS3L7-X710QP] Intel X710 Quad Port 10Gb Direct Attach, SFP+, PCIe",null,null,{"$f":"VLOOKUP(L219,Tabella_prezzi!$A$1:$L$189,8,FALSE)","v":"Intel X710 Quad Port 10Gb SFP+ FULL"},null,null,1,null,{"$f":"VLOOKUP(L219,Tabella_prezzi!$A$1:$L$189,3,FALSE)","v":0},null,{"$f":"VLOOKUP(L219,Tabella_prezzi!$A$1:$L$189,4,FALSE)","v":518},"L7N43",{"$f":"VLOOKUP(L219,Tabella_prezzi!$A$1:$L$189,6,FALSE)","v":"TS4L7-X710QP"}]
["[TS3L7-MCX4DP] Mellanox ConnectX-4 Lx Dual Port 25GbE SFP28 FL 2 x SFP28 SR Optic, 25GbE",null,"TS3L7-MCX4DP","Mellanox ConnectX-4 Lx Dual Port 25GbE SFP28 Network Adapter, PCIe Full Height, 2 x SFP28 SR Optic, 25GbE",null,null,1,{"$f":"VLOOKUP(L220,Tabella_prezzi!$A$1:$L$189,9,FALSE)","v":"Mellanox ConnectX-4 Lx Dual Port 25GbE SFP28 Network Adapter, PCIe Full Height, 2 x SFP28 SR Optic, 25GbE"},{"$f":"VLOOKUP(L220,Tabella_prezzi!$A$1:$L$189,3,FALSE)","v":0},null,{"$f":"VLOOKUP(L220,Tabella_prezzi!$A$1:$L$189,4,FALSE)","v":419},"L7N94",{"$f":"VLOOKUP(L220,Tabella_prezzi!$A$1:$L$189,6,FALSE)","v":"TS4L7-MCX4DP"}]
[]
["TS3L2_PCI_B"]
[{"$f":"\"\"","v":""},null,null,null,null,null,{"$f":"\"\"","v":""},null,{"$f":"\"\"","v":""},null,null,{"$f":"\"\"","v":""},{"$f":"\"\"","v":""}]
[{"$f":"D224","v":"Broadcom 5719 Quad Port 1Gb Network Interface Card, Low Profile "},null,null,{"$f":"VLOOKUP(L224,Tabella_prezzi!$A$1:$L$189,8,FALSE)","v":"Broadcom 5719 Quad Port 1Gb Network Interface Card, Low Profile "},null,"540-BBCX",1,{"$f":"VLOOKUP(L224,Tabella_prezzi!$A$1:$L$189,9,FALSE)","v":"Broadcom 5719 Quad Port 1Gb Network Interface Card, Low Profile "},{"$f":"VLOOKUP(L224,Tabella_prezzi!$A$1:$L$189,3,FALSE)","v":"OpzGigabit"},{"$f":"VLOOKUP(L224,Tabella_prezzi!$A$1:$L$189,4,FALSE)","v":29.18},null,"L7N05",{"$f":"VLOOKUP(L224,Tabella_prezzi!$A$1:$L$189,6,FALSE)","v":"TS4L7-LAN1"}]
["Broadcom 57412 Dual Port 10Gb, SFP+, PCIe Adapter, Low Profile + Optics",null,null,{"$f":"VLOOKUP(L225,Tabella_prezzi!$A$1:$L$189,8,FALSE)","v":"Broadcom 57412 Dual Port 10Gb, SFP+, PCIe Adapter, Low Profile + Optics"},null,"540-BBCX",1,{"$f":"VLOOKUP(L225,Tabella_prezzi!$A$1:$L$189,9,FALSE)","v":"Broadcom 57412 Dual Port 10Gb, SFP+, PCIe Adapter, Low Profile + Optics"},{"$f":"VLOOKUP(L225,Tabella_prezzi!$A$1:$L$189,3,FALSE)","v":"OpzGigabit10Gbps"},{"$f":"VLOOKUP(L225,Tabella_prezzi!$A$1:$L$189,4,FALSE)","v":160.47999999999999},null,"L7N06",{"$f":"VLOOKUP(L225,Tabella_prezzi!$A$1:$L$189,6,FALSE)","v":"TS4L7-LAN10"}]
["Intel Ethernet XXV710 Dual Port 10/25GbE SFP28 Adapter, PCIe Low Profile + Optics",null,null,{"$f":"VLOOKUP(L226,Tabella_prezzi!$A$1:$L$189,8,FALSE)","v":"Intel Ethernet XXV710 Dual Port 10/25GbE SFP28 Adapter, PCIe Low Profile + Optics"},null,"540-BBCX",1,{"$f":"VLOOKUP(L226,Tabella_prezzi!$A$1:$L$189,9,FALSE)","v":"Intel Ethernet XXV710 Dual Port 10/25GbE SFP28 Adapter, PCIe Low Profile + Optics"},{"$f":"VLOOKUP(L226,Tabella_prezzi!$A$1:$L$189,3,FALSE)","v":"OpzGigabit25Gbps"},{"$f":"VLOOKUP(L226,Tabella_prezzi!$A$1:$L$189,4,FALSE)","v":249.64},null,"L7N07",{"$f":"VLOOKUP(L226,Tabella_prezzi!$A$1:$L$189,6,FALSE)","v":"TS4L7-LAN25"}]
["QLogic FastLinQ 41262 Dual Port 25Gb SFP28 Adapter, Low Profile + Optics",null,null,{"$f":"VLOOKUP(L227,Tabella_prezzi!$A$1:$L$189,8,FALSE)","v":"QLogic FastLinQ 41262 Dual Port 25Gb SFP28 Adapter, Low Profile + Optics"},null,"540-BBCX",1,{"$f":"VLOOKUP(L227,Tabella_prezzi!$A$1:$L$189,9,FALSE)","v":"QLogic FastLinQ 41262 Dual Port 25Gb SFP28 Adapter, Low Profile + Optics"},{"$f":"VLOOKUP(L227,Tabella_prezzi!$A$1:$L$189,3,FALSE)","v":"OpzGigabit10Gbps CNA"},{"$f":"VLOOKUP(L227,Tabella_prezzi!$A$1:$L$189,4,FALSE)","v":153.19},null,"L7N08",{"$f":"VLOOKUP(L227,Tabella_prezzi!$A$1:$L$189,6,FALSE)","v":"TS4L7-CNA10"}]
["Intel X710-T2L Dual Port 10GbE BASE-T Adapter, PCIe LP",null,null,{"$f":"VLOOKUP(L228,Tabella_prezzi!$A$1:$L$189,8,FALSE)","v":"Intel X710-T2L Dual Port 10GbE BASE-T Adapter, PCIe LP"},null,"540-BBCX",1,{"$f":"VLOOKUP(L228,Tabella_prezzi!$A$1:$L$189,9,FALSE)","v":"Intel X710-T2L Dual Port 10GbE BASE-T Adapter, PCIe LP"},{"$f":"VLOOKUP(L228,Tabella_prezzi!$A$1:$L$189,3,FALSE)","v":"Opz10Gigabit BaseT"},{"$f":"VLOOKUP(L228,Tabella_prezzi!$A$1:$L$189,4,FALSE)","v":147.52000000000001},null,"L7N09",{"$f":"VLOOKUP(L228,Tabella_prezzi!$A$1:$L$189,6,FALSE)","v":"TS4L7-BaseT-LP"}]
["Intel E810 Dual Port 100GbE QSFP28 Adapter, PCIe Low Profile + Optics",null,null,{"$f":"VLOOKUP(L229,Tabella_prezzi!$A$1:$L$189,8,FALSE)","v":"Intel E810 Dual Port 100GbE QSFP28 Adapter, PCIe Low Profile + Optics"},null,"540-BBCX",1,{"$f":"VLOOKUP(L229,Tabella_prezzi!$A$1:$L$189,9,FALSE)","v":"Intel E810 Dual Port 100GbE QSFP28 Adapter, PCIe Low Profile + Optics"},{"$f":"VLOOKUP(L229,Tabella_prezzi!$A$1:$L$189,3,FALSE)","v":"Opz100Gbit"},{"$f":"VLOOKUP(L229,Tabella_prezzi!$A$1:$L$189,4,FALSE)","v":811.34},null,"L7N10",{"$f":"VLOOKUP(L229,Tabella_prezzi!$A$1:$L$189,6,FALSE)","v":"TS4L7- Opz100Gbit"}]
["QLogic 2772 Dual Port 32GbE Fibre Channel HBA, PCIe Low Profile+ Optics",null,null,{"$f":"VLOOKUP(L230,Tabella_prezzi!$A$1:$L$189,8,FALSE)","v":"QLogic 2772 Dual Port 32GbE Fibre Channel HBA, PCIe Low Profile+ Optics"},null,"540-BBCX",1,{"$f":"VLOOKUP(L230,Tabella_prezzi!$A$1:$L$189,9,FALSE)","v":"QLogic 2772 Dual Port 32GbE Fibre Channel HBA, PCIe Low Profile+ Optics"},{"$f":"VLOOKUP(L230,Tabella_prezzi!$A$1:$L$189,3,FALSE)","v":"OpzFibreChannel"},{"$f":"VLOOKUP(L230,Tabella_prezzi!$A$1:$L$189,4,FALSE)","v":425.36},null,"L7N11",{"$f":"VLOOKUP(L230,Tabella_prezzi!$A$1:$L$189,6,FALSE)","v":"TS4L7- FibreChannel"}]
["-=-=-=-=-=-=-=-=-=-=-=-=-=-=-=-=-20%-=-=-=-=-=-=-=-=-=-=-=-=-=-=-=-=-",null,null,null,null,null,{"$f":"\"\"","v":""},null,{"$f":"\"\"","v":""},null,null,{"$f":"\"\"","v":""},{"$f":"\"\"","v":""}]
["[TS3L7-BOSS480] BOSS controller card, full height, with 2 480G M.2 Drives",null,null,{"$f":"VLOOKUP(L232,Tabella_prezzi!$A$1:$L$189,8,FALSE)","v":"BOSS controller card, full height, with 2 480G M.2 Drives"},null,null,1,null,{"$f":"VLOOKUP(L232,Tabella_prezzi!$A$1:$L$189,3,FALSE)","v":0},null,{"$f":"VLOOKUP(L232,Tabella_prezzi!$A$1:$L$189,4,FALSE)","v":748},"L7N33",{"$f":"VLOOKUP(L232,Tabella_prezzi!$A$1:$L$189,6,FALSE)","v":"TS4L7-BOSS480"}]
["[TS3L7-SAS12] SAS 12Gbps HBA External Controller, Full Height",null,null,{"$f":"VLOOKUP(L233,Tabella_prezzi!$A$1:$L$189,8,FALSE)","v":"SAS 12Gbps HBA External Controller, Full Height"},null,null,1,{"$f":"VLOOKUP(L233,Tabella_prezzi!$A$1:$L$189,9,FALSE)","v":"SAS 12Gbps HBA External Controller, Full Height"},{"$f":"VLOOKUP(L233,Tabella_prezzi!$A$1:$L$189,3,FALSE)","v":0},null,{"$f":"VLOOKUP(L233,Tabella_prezzi!$A$1:$L$189,4,FALSE)","v":92},"L7N101",{"$f":"VLOOKUP(L233,Tabella_prezzi!$A$1:$L$189,6,FALSE)","v":"TS4L7-SAS12"}]
["[TS3L7-H840] PERC H840 RAID Adapter for External MD14XX Only, 8GB NV Cache",null,null,{"$f":"VLOOKUP(L234,Tabella_prezzi!$A$1:$L$189,8,FALSE)","v":"PERC H840 RAID Adapter for External MD14XX Only, 8GB NV Cache, Full Height"},null,null,1,null,{"$f":"VLOOKUP(L234,Tabella_prezzi!$A$1:$L$189,3,FALSE)","v":"OpzH840"},null,{"$f":"VLOOKUP(L234,Tabella_prezzi!$A$1:$L$189,4,FALSE)","v":479},"L7N71",{"$f":"VLOOKUP(L234,Tabella_prezzi!$A$1:$L$189,6,FALSE)","v":"TS4L7-H840"}]
["[TS3L7-57416] Broadcom 57416 Dual Port 10Gb, Base-T, PCIe Adapter",null,null,{"$f":"VLOOKUP(L235,Tabella_prezzi!$A$1:$L$189,8,FALSE)","v":"Broadcom 57416 Dual Port 10Gb, Base-T, PCIe Adapter, Full Height"},null,null,1,null,{"$f":"VLOOKUP(L235,Tabella_prezzi!$A$1:$L$189,3,FALSE)","v":0},null,{"$f":"VLOOKUP(L235,Tabella_prezzi!$A$1:$L$189,4,FALSE)","v":334},"L7N46",{"$f":"VLOOKUP(L235,Tabella_prezzi!$A$1:$L$189,6,FALSE)","v":"TS4L7-57416"}]
["[TS3L7-X710DP] Intel X710 Dual Port 10Gb Direct Attach, SFP+,PCIe",null,null,{"$f":"VLOOKUP(L236,Tabella_prezzi!$A$1:$L$189,8,FALSE)","v":"Intel X710 Dual Port 10Gb SFP+ FULL"},null,null,1,null,{"$f":"VLOOKUP(L236,Tabella_prezzi!$A$1:$L$189,3,FALSE)","v":0},null,{"$f":"VLOOKUP(L236,Tabella_prezzi!$A$1:$L$189,4,FALSE)","v":342},"L7N42",{"$f":"VLOOKUP(L236,Tabella_prezzi!$A$1:$L$189,6,FALSE)","v":"TS4L7-X710DP"}]
["[TS3L7-X710QP] Intel X710 Quad Port 10Gb Direct Attach, SFP+, PCIe",null,null,{"$f":"VLOOKUP(L237,Tabella_prezzi!$A$1:$L$189,8,FALSE)","v":"Intel X710 Quad Port 10Gb SFP+ FULL"},null,null,1,null,{"$f":"VLOOKUP(L237,Tabella_prezzi!$A$1:$L$189,3,FALSE)","v":0},null,{"$f":"VLOOKUP(L237,Tabella_prezzi!$A$1:$L$189,4,FALSE)","v":518},"L7N43",{"$f":"VLOOKUP(L237,Tabella_prezzi!$A$1:$L$189,6,FALSE)","v":"TS4L7-X710QP"}]
["[TS3L7-CONX6DP] Mellanox ConnectX-6 DX Dual Port 100GbE QFSFP56 Network Adapter",null,null,{"$f":"VLOOKUP(L238,Tabella_prezzi!$A$1:$L$189,8,FALSE)","v":"Mellanox ConnectX-6 DX Dual Port 100GbE QFSFP56 FULL"},null,null,1,{"$f":"VLOOKUP(L238,Tabella_prezzi!$A$1:$L$189,9,FALSE)","v":"Mellanox ConnectX-6 DX Dual Port 100GbE QFSFP56 FULL"},{"$f":"VLOOKUP(L238,Tabella_prezzi!$A$1:$L$189,3,FALSE)","v":0},null,{"$f":"VLOOKUP(L238,Tabella_prezzi!$A$1:$L$189,4,FALSE)","v":812},"L7N40",{"$f":"VLOOKUP(L238,Tabella_prezzi!$A$1:$L$189,6,FALSE)","v":"TS4L7-CONX6DP"}]
["[TS3L7-MCX4DP] Mellanox ConnectX-4 Lx Dual Port 25GbE SFP28 FL 2 x SFP28 SR Optic, 25GbE",null,"TS3L7-MCX4DP","Mellanox ConnectX-4 Lx Dual Port 25GbE SFP28 Network Adapter, PCIe Full Height, 2 x SFP28 SR Optic, 25GbE",null,null,1,{"$f":"VLOOKUP(L239,Tabella_prezzi!$A$1:$L$189,9,FALSE)","v":"Mellanox ConnectX-4 Lx Dual Port 25GbE SFP28 Network Adapter, PCIe Full Height, 2 x SFP28 SR Optic, 25GbE"},{"$f":"VLOOKUP(L239,Tabella_prezzi!$A$1:$L$189,3,FALSE)","v":0},null,{"$f":"VLOOKUP(L239,Tabella_prezzi!$A$1:$L$189,4,FALSE)","v":419},"L7N94",{"$f":"VLOOKUP(L239,Tabella_prezzi!$A$1:$L$189,6,FALSE)","v":"TS4L7-MCX4DP"}]
[]
["TS3L2_PCI_C"]
[{"$f":"\"\"","v":""},null,null,null,null,null,{"$f":"\"\"","v":""},null,{"$f":"\"\"","v":""},null,null,{"$f":"\"\"","v":""},{"$f":"\"\"","v":""}]
["[TS3L7-LAN1-L] Broadcom 5719 Quad Port 1Gb Network Interface Card,",null,null,{"$f":"VLOOKUP(L243,Tabella_prezzi!$A$1:$L$189,8,FALSE)","v":"Broadcom 5719 Quad Port 1GbE BASE-T Adapter, OCP NIC 3.0"},null,null,1,{"$f":"VLOOKUP(L243,Tabella_prezzi!$A$1:$L$189,9,FALSE)","v":"Broadcom 5719 Quad Port 1GbE BASE-T Adapter, OCP NIC 3.0"},{"$f":"VLOOKUP(L243,Tabella_prezzi!$A$1:$L$189,3,FALSE)","v":"OpzGigabit"},{"$f":"VLOOKUP(L243,Tabella_prezzi!$A$1:$L$189,4,FALSE)","v":29.18},null,"L7N75",{"$f":"VLOOKUP(L243,Tabella_prezzi!$A$1:$L$189,6,FALSE)","v":"TS4L7-LAN1-OCP"}]
["[TS3L7-LAN10-L] Broadcom 57412 Dual Port 10Gb, SFP+, PCIe Adapter",null,null,{"$f":"VLOOKUP(L244,Tabella_prezzi!$A$1:$L$189,8,FALSE)","v":"\tBroadcom 57412 Dual Port 10GbE SFP+, OCP NIC 3.0"},null,null,1,{"$f":"VLOOKUP(L244,Tabella_prezzi!$A$1:$L$189,9,FALSE)","v":"\tBroadcom 57412 Dual Port 10GbE SFP+, OCP NIC 3.0"},{"$f":"VLOOKUP(L244,Tabella_prezzi!$A$1:$L$189,3,FALSE)","v":"OpzGigabit10Gbps"},{"$f":"VLOOKUP(L244,Tabella_prezzi!$A$1:$L$189,4,FALSE)","v":160.47999999999999},null,"L7N76",{"$f":"VLOOKUP(L244,Tabella_prezzi!$A$1:$L$189,6,FALSE)","v":"TS4L7-LAN10-OCP"}]
["[TS3L7-LAN25-L] QLogic 41262 Dual Port 25Gb SFP28 Adapter",null,null,{"$f":"VLOOKUP(L245,Tabella_prezzi!$A$1:$L$189,8,FALSE)","v":"Intel Ethernet XXV710 Dual Port 10/25GbE SFP28 Adapter, PCIe Low Profile + Optics"},null,null,1,{"$f":"VLOOKUP(L245,Tabella_prezzi!$A$1:$L$189,9,FALSE)","v":"Intel Ethernet XXV710 Dual Port 10/25GbE SFP28 Adapter, PCIe Low Profile + Optics"},{"$f":"VLOOKUP(L245,Tabella_prezzi!$A$1:$L$189,3,FALSE)","v":"OpzGigabit25Gbps"},{"$f":"VLOOKUP(L245,Tabella_prezzi!$A$1:$L$189,4,FALSE)","v":249.64},null,"L7N77",{"$f":"VLOOKUP(L245,Tabella_prezzi!$A$1:$L$189,6,FALSE)","v":"TS4L7-LAN25-L"}]
["[TS3L7CNA10-L] QLogic 41112 Dual Port 10Gb SFP+ Adapter",null,null,{"$f":"VLOOKUP(L246,Tabella_prezzi!$A$1:$L$189,8,FALSE)","v":"QLogic 41262 Dual Port 25Gb SFP28 Adapter, Low Profile + Optics"},null,null,1,{"$f":"VLOOKUP(L246,Tabella_prezzi!$A$1:$L$189,9,FALSE)","v":"QLogic 41262 Dual Port 25Gb SFP28 Adapter, Low Profile + Optics"},{"$f":"VLOOKUP(L246,Tabella_prezzi!$A$1:$L$189,3,FALSE)","v":"OpzGigabit10Gbps CNA"},{"$f":"VLOOKUP(L246,Tabella_prezzi!$A$1:$L$189,4,FALSE)","v":153.19},null,"L7N78",{"$f":"VLOOKUP(L246,Tabella_prezzi!$A$1:$L$189,6,FALSE)","v":"TS4L7-CNA10-L"}]
["[TS3L7-FC16-L] Qlogic 2692 Dual Port 16Gb Fibre Channel HBA",null,null,{"$f":"VLOOKUP(L247,Tabella_prezzi!$A$1:$L$189,8,FALSE)","v":"Intel X710-T2L Dual Port 10GbE BASE-T, OCP NIC 3.0"},null,null,1,{"$f":"VLOOKUP(L247,Tabella_prezzi!$A$1:$L$189,9,FALSE)","v":"Intel X710-T2L Dual Port 10GbE BASE-T, OCP NIC 3.0"},{"$f":"VLOOKUP(L247,Tabella_prezzi!$A$1:$L$189,3,FALSE)","v":"Opz10Gigabit BaseT"},{"$f":"VLOOKUP(L247,Tabella_prezzi!$A$1:$L$189,4,FALSE)","v":147.52000000000001},null,"L7N79",{"$f":"VLOOKUP(L247,Tabella_prezzi!$A$1:$L$189,6,FALSE)","v":"TS4L7- BaseT-L"}]
["[TS3L7-NVME1600] Dell 1.6TB, NVMe, Mixed Use Express Flash, HHHL",null,null,{"$f":"VLOOKUP(L248,Tabella_prezzi!$A$1:$L$189,8,FALSE)","v":"1.6TB SSD SAS ISE MU 12Gbp"},null,null,1,{"$f":"VLOOKUP(L248,Tabella_prezzi!$A$1:$L$189,9,FALSE)","v":"1.6TB SSD SAS ISE MU 12Gbps 512e 2.5in Hot-Plug PM6 3 DWPD"},{"$f":"VLOOKUP(L248,Tabella_prezzi!$A$1:$L$189,3,FALSE)","v":"OpzSSD-MU1,6TB"},{"$f":"VLOOKUP(L248,Tabella_prezzi!$A$1:$L$189,4,FALSE)","v":473.08},null,"L7N17",{"$f":"VLOOKUP(L248,Tabella_prezzi!$A$1:$L$189,6,FALSE)","v":"TS4L7-SSD-MU1,6TB"}]
["[TS3L7-NVME800] Dell 1.6TB, NVMe, Mixed Use Express Flash, HHHL",null,null,{"$f":"VLOOKUP(L249,Tabella_prezzi!$A$1:$L$189,8,FALSE)","v":"960GB SSD SAS ISE RI 12Gbps"},null,null,1,{"$f":"VLOOKUP(L249,Tabella_prezzi!$A$1:$L$189,9,FALSE)","v":"960GB SSD SAS ISE RI 12Gbps 512e 2.5in Hot-Plug 1 DWPD"},{"$f":"VLOOKUP(L249,Tabella_prezzi!$A$1:$L$189,3,FALSE)","v":"OpzSSD-RI800GB"},{"$f":"VLOOKUP(L249,Tabella_prezzi!$A$1:$L$189,4,FALSE)","v":283.68},null,"L7N18",{"$f":"VLOOKUP(L249,Tabella_prezzi!$A$1:$L$189,6,FALSE)","v":"TS4L7-SSD-RI800GB"}]
["-=-=-=-=-=-=-=-=-=-=-=-=-=-=-=-=-20%-=-=-=-=-=-=-=-=-=-=-=-=-=-=-=-=-",null,null,null,null,null,{"$f":"\"\"","v":""},null,{"$f":"\"\"","v":""},null,null,{"$f":"\"\"","v":""},{"$f":"\"\"","v":""}]
["[TS3L7-57416-L] Broadcom 57416 Dual Port 10Gb, Base-T, PCIe Adapter","Broadcom 57416 Dual Port 10Gb, Base-T, PCIe Adapter, Low Profile","TS3L7-57416-L",{"$f":"VLOOKUP(L251,Tabella_prezzi!$A$1:$L$189,8,FALSE)","v":"Estensione della manutenzione GPU in garanzia per ulteriori 24 mesi"},null,null,1,{"$f":"VLOOKUP(L251,Tabella_prezzi!$A$1:$L$189,9,FALSE)","v":"Estensione della manutenzione GPU in garanzia per ulteriori 24 mesi"},{"$f":"VLOOKUP(L251,Tabella_prezzi!$A$1:$L$189,3,FALSE)","v":"OpzEstensione24-GPU"},null,{"$f":"VLOOKUP(L251,Tabella_prezzi!$A$1:$L$189,4,FALSE)","v":115.54},"L7N31",{"$f":"VLOOKUP(L251,Tabella_prezzi!$A$1:$L$189,6,FALSE)","v":"TS4L7-OpzEst24GPU"}]
["[TS3L7-MCX4DP-L] Mellanox ConnectX-4 Lx Dual Port 25GbE SFP28 LP 2 x SFP28 SR Optic, 25GbE","Mellanox ConnectX-4 Lx Dual Port 25GbE SFP28 Network Adapter, Low Profile, 2 x SFP28 SR Optic, 25GbE","TS3L7-MCX4DP-L","Mellanox ConnectX-4 Lx Dual Port 25GbE SFP28 Network Adapter, Low Profile, 2 x SFP28 SR Optic, 25GbE",null,null,1,{"$f":"VLOOKUP(L252,Tabella_prezzi!$A$1:$L$189,9,FALSE)","v":"Mellanox ConnectX-4 Lx Dual Port 25GbE SFP28 Network Adapter, Low Profile, 2 x SFP28 SR Optic, 25GbE"},{"$f":"VLOOKUP(L252,Tabella_prezzi!$A$1:$L$189,3,FALSE)","v":0},null,{"$f":"VLOOKUP(L252,Tabella_prezzi!$A$1:$L$189,4,FALSE)","v":419},"L7N95",{"$f":"VLOOKUP(L252,Tabella_prezzi!$A$1:$L$189,6,FALSE)","v":"TS4L7-MCX4DP-L"}]
["[TS3L7-H840-L] PERC H840 RAID Adapter, Low Profile for External Enclosure ",null,"TS3L7-57416-L",{"$f":"VLOOKUP(L253,Tabella_prezzi!$A$1:$L$189,8,FALSE)","v":"PERC H840 RAID Adapter, Low Profile for External Enclosure "},null,null,1,{"$f":"VLOOKUP(L253,Tabella_prezzi!$A$1:$L$189,9,FALSE)","v":"PERC H840 RAID Adapter, Low Profile for External Enclosure "},{"$f":"VLOOKUP(L253,Tabella_prezzi!$A$1:$L$189,3,FALSE)","v":0},null,{"$f":"VLOOKUP(L253,Tabella_prezzi!$A$1:$L$189,4,FALSE)","v":479},"L7N102",{"$f":"VLOOKUP(L253,Tabella_prezzi!$A$1:$L$189,6,FALSE)","v":"TS4L7-H840-L"}]
["[TS3L7-SAS12-L] SAS 12Gbps HBA External Controller, Low Profile","SAS 12Gbps HBA External Controller, Low Profile","TS3L7-57416-L",{"$f":"VLOOKUP(L254,Tabella_prezzi!$A$1:$L$189,8,FALSE)","v":"SAS 12Gbps HBA External Controller, Low Profile"},null,null,1,{"$f":"VLOOKUP(L254,Tabella_prezzi!$A$1:$L$189,9,FALSE)","v":"SAS 12Gbps HBA External Controller, Low Profile"},{"$f":"VLOOKUP(L254,Tabella_prezzi!$A$1:$L$189,3,FALSE)","v":0},null,{"$f":"VLOOKUP(L254,Tabella_prezzi!$A$1:$L$189,4,FALSE)","v":92},"L7N100",{"$f":"VLOOKUP(L254,Tabella_prezzi!$A$1:$L$189,6,FALSE)","v":"TS4L7-SAS12-L"}]
["[TS3L7-X710DP-L] Intel X710 Dual Port 10Gb Direct Attach, SFP+,PCIe","Intel X710 2-port 10GbE Adapter, Low Profile Low Profile, Cuskit","TS3L7-X710DP-L",{"$f":"VLOOKUP(L255,Tabella_prezzi!$A$1:$L$189,8,FALSE)","v":"Intel X710 Dual Port 10Gb SFP+ LOW"},null,null,1,{"$f":"VLOOKUP(L255,Tabella_prezzi!$A$1:$L$189,9,FALSE)","v":"Intel X710 Dual Port 10Gb SFP+ LOW"},{"$f":"VLOOKUP(L255,Tabella_prezzi!$A$1:$L$189,3,FALSE)","v":0},null,{"$f":"VLOOKUP(L255,Tabella_prezzi!$A$1:$L$189,4,FALSE)","v":342},"L7N41",{"$f":"VLOOKUP(L255,Tabella_prezzi!$A$1:$L$189,6,FALSE)","v":"TS4L7-X710DP-L"}]
[]
["TS3L2_PCI_D"]
[{"$f":"\"\"","v":""},null,null,null,null,null,{"$f":"\"\"","v":""},null,{"$f":"\"\"","v":""},null,null,{"$f":"\"\"","v":""},{"$f":"\"\"","v":""}]
["[TS3L7-LAN1] Broadcom 5719 Quad Port 1Gb Network Interface Card,",null,null,{"$f":"VLOOKUP(L259,Tabella_prezzi!$A$1:$L$189,8,FALSE)","v":"Broadcom 5719 Quad Port 1Gb Network Interface Card, Low Profile "},null,"540-BBCX",1,{"$f":"VLOOKUP(L259,Tabella_prezzi!$A$1:$L$189,9,FALSE)","v":"Broadcom 5719 Quad Port 1Gb Network Interface Card, Low Profile "},{"$f":"VLOOKUP(L259,Tabella_prezzi!$A$1:$L$189,3,FALSE)","v":"OpzGigabit"},{"$f":"VLOOKUP(L259,Tabella_prezzi!$A$1:$L$189,4,FALSE)","v":29.18},null,"L7N05",{"$f":"VLOOKUP(L259,Tabella_prezzi!$A$1:$L$189,6,FALSE)","v":"TS4L7-LAN1"}]
["[TS3L7-LAN10] Broadcom 57412 Dual Port 10Gb, SFP+, PCIe Adapter",null,null,{"$f":"VLOOKUP(L260,Tabella_prezzi!$A$1:$L$189,8,FALSE)","v":"Broadcom 57412 Dual Port 10Gb, SFP+, PCIe Adapter, Low Profile + Optics"},null,"540-BBCX",1,{"$f":"VLOOKUP(L260,Tabella_prezzi!$A$1:$L$189,9,FALSE)","v":"Broadcom 57412 Dual Port 10Gb, SFP+, PCIe Adapter, Low Profile + Optics"},{"$f":"VLOOKUP(L260,Tabella_prezzi!$A$1:$L$189,3,FALSE)","v":"OpzGigabit10Gbps"},{"$f":"VLOOKUP(L260,Tabella_prezzi!$A$1:$L$189,4,FALSE)","v":160.47999999999999},null,"L7N06",{"$f":"VLOOKUP(L260,Tabella_prezzi!$A$1:$L$189,6,FALSE)","v":"TS4L7-LAN10"}]
["[TS3L7-LAN25] QLogic 41262 Dual Port 25Gb SFP28 Adapter",null,null,{"$f":"VLOOKUP(L261,Tabella_prezzi!$A$1:$L$189,8,FALSE)","v":"Intel Ethernet XXV710 Dual Port 10/25GbE SFP28 Adapter, PCIe Low Profile + Optics"},null,"540-BBCX",1,{"$f":"VLOOKUP(L261,Tabella_prezzi!$A$1:$L$189,9,FALSE)","v":"Intel Ethernet XXV710 Dual Port 10/25GbE SFP28 Adapter, PCIe Low Profile + Optics"},{"$f":"VLOOKUP(L261,Tabella_prezzi!$A$1:$L$189,3,FALSE)","v":"OpzGigabit25Gbps"},{"$f":"VLOOKUP(L261,Tabella_prezzi!$A$1:$L$189,4,FALSE)","v":249.64},null,"L7N07",{"$f":"VLOOKUP(L261,Tabella_prezzi!$A$1:$L$189,6,FALSE)","v":"TS4L7-LAN25"}]
["[TS3L7CNA10] QLogic 41112 Dual Port 10Gb SFP+ Adapter",null,null,{"$f":"VLOOKUP(L262,Tabella_prezzi!$A$1:$L$189,8,FALSE)","v":"QLogic FastLinQ 41262 Dual Port 25Gb SFP28 Adapter, Low Profile + Optics"},null,"540-BBCX",1,{"$f":"VLOOKUP(L262,Tabella_prezzi!$A$1:$L$189,9,FALSE)","v":"QLogic FastLinQ 41262 Dual Port 25Gb SFP28 Adapter, Low Profile + Optics"},{"$f":"VLOOKUP(L262,Tabella_prezzi!$A$1:$L$189,3,FALSE)","v":"OpzGigabit10Gbps CNA"},{"$f":"VLOOKUP(L262,Tabella_prezzi!$A$1:$L$189,4,FALSE)","v":153.19},null,"L7N08",{"$f":"VLOOKUP(L262,Tabella_prezzi!$A$1:$L$189,6,FALSE)","v":"TS4L7-CNA10"}]
["[TS3L7-FC16] Qlogic 2692 Dual Port 16Gb Fibre Channel HBA",null,null,{"$f":"VLOOKUP(L263,Tabella_prezzi!$A$1:$L$189,8,FALSE)","v":"Intel X710-T2L Dual Port 10GbE BASE-T Adapter, PCIe LP"},null,"540-BBCX",1,{"$f":"VLOOKUP(L263,Tabella_prezzi!$A$1:$L$189,9,FALSE)","v":"Intel X710-T2L Dual Port 10GbE BASE-T Adapter, PCIe LP"},{"$f":"VLOOKUP(L263,Tabella_prezzi!$A$1:$L$189,3,FALSE)","v":"Opz10Gigabit BaseT"},{"$f":"VLOOKUP(L263,Tabella_prezzi!$A$1:$L$189,4,FALSE)","v":147.52000000000001},null,"L7N09",{"$f":"VLOOKUP(L263,Tabella_prezzi!$A$1:$L$189,6,FALSE)","v":"TS4L7-BaseT-LP"}]
["[TS3L7-NVME1600] Dell 1.6TB, NVMe, Mixed Use Express Flash, HHHL",null,null,{"$f":"VLOOKUP(L264,Tabella_prezzi!$A$1:$L$189,8,FALSE)","v":"1.6TB SSD SAS ISE MU 12Gbp"},null,"540-BBCX",1,{"$f":"VLOOKUP(L264,Tabella_prezzi!$A$1:$L$189,9,FALSE)","v":"1.6TB SSD SAS ISE MU 12Gbps 512e 2.5in Hot-Plug PM6 3 DWPD"},{"$f":"VLOOKUP(L264,Tabella_prezzi!$A$1:$L$189,3,FALSE)","v":"OpzSSD-MU1,6TB"},{"$f":"VLOOKUP(L264,Tabella_prezzi!$A$1:$L$189,4,FALSE)","v":473.08},null,"L7N17",{"$f":"VLOOKUP(L264,Tabella_prezzi!$A$1:$L$189,6,FALSE)","v":"TS4L7-SSD-MU1,6TB"}]
["[TS3L7-NVME800] Dell 1.6TB, NVMe, Mixed Use Express Flash, HHHL",null,null,{"$f":"VLOOKUP(L265,Tabella_prezzi!$A$1:$L$189,8,FALSE)","v":"960GB SSD SAS ISE RI 12Gbps"},null,"540-BBCX",1,{"$f":"VLOOKUP(L265,Tabella_prezzi!$A$1:$L$189,9,FALSE)","v":"960GB SSD SAS ISE RI 12Gbps 512e 2.5in Hot-Plug 1 DWPD"},{"$f":"VLOOKUP(L265,Tabella_prezzi!$A$1:$L$189,3,FALSE)","v":"OpzSSD-RI800GB"},{"$f":"VLOOKUP(L265,Tabella_prezzi!$A$1:$L$189,4,FALSE)","v":283.68},null,"L7N18",{"$f":"VLOOKUP(L265,Tabella_prezzi!$A$1:$L$189,6,FALSE)","v":"TS4L7-SSD-RI800GB"}]
["-=-=-=-=-=-=-=-=-=-=-=-=-=-=-=-=-20%-=-=-=-=-=-=-=-=-=-=-=-=-=-=-=-=-",null,null,null,null,null,{"$f":"\"\"","v":""},null,{"$f":"\"\"","v":""},null,null,{"$f":"\"\"","v":""},{"$f":"\"\"","v":""}]
["[TS3L7-BOSS480] BOSS controller card, full height, with 2 480G M.2 Drives",null,null,{"$f":"VLOOKUP(L267,Tabella_prezzi!$A$1:$L$189,8,FALSE)","v":"BOSS controller card, full height, with 2 480G M.2 Drives"},null,null,1,null,{"$f":"VLOOKUP(L267,Tabella_prezzi!$A$1:$L$189,3,FALSE)","v":0},null,{"$f":"VLOOKUP(L267,Tabella_prezzi!$A$1:$L$189,4,FALSE)","v":748},"L7N33",{"$f":"VLOOKUP(L267,Tabella_prezzi!$A$1:$L$189,6,FALSE)","v":"TS4L7-BOSS480"}]
["[TS3L7-SAS12] SAS 12Gbps HBA External Controller, Full Height",null,null,{"$f":"VLOOKUP(L268,Tabella_prezzi!$A$1:$L$189,8,FALSE)","v":"SAS 12Gbps HBA External Controller, Full Height"},null,null,1,{"$f":"VLOOKUP(L268,Tabella_prezzi!$A$1:$L$189,9,FALSE)","v":"SAS 12Gbps HBA External Controller, Full Height"},{"$f":"VLOOKUP(L268,Tabella_prezzi!$A$1:$L$189,3,FALSE)","v":0},null,{"$f":"VLOOKUP(L268,Tabella_prezzi!$A$1:$L$189,4,FALSE)","v":92},"L7N101",{"$f":"VLOOKUP(L268,Tabella_prezzi!$A$1:$L$189,6,FALSE)","v":"TS4L7-SAS12"}]
["[TS3L7-H840] PERC H840 RAID Adapter for External MD14XX Only, 8GB NV Cache",null,null,{"$f":"VLOOKUP(L269,Tabella_prezzi!$A$1:$L$189,8,FALSE)","v":"PERC H840 RAID Adapter for External MD14XX Only, 8GB NV Cache, Full Height"},null,null,1,null,{"$f":"VLOOKUP(L269,Tabella_prezzi!$A$1:$L$189,3,FALSE)","v":"OpzH840"},null,{"$f":"VLOOKUP(L269,Tabella_prezzi!$A$1:$L$189,4,FALSE)","v":479},"L7N71",{"$f":"VLOOKUP(L269,Tabella_prezzi!$A$1:$L$189,6,FALSE)","v":"TS4L7-H840"}]
["[TS3L7-57416] Broadcom 57416 Dual Port 10Gb, Base-T, PCIe Adapter",null,null,{"$f":"VLOOKUP(L270,Tabella_prezzi!$A$1:$L$189,8,FALSE)","v":"Broadcom 57416 Dual Port 10Gb, Base-T, PCIe Adapter, Full Height"},null,null,1,null,{"$f":"VLOOKUP(L270,Tabella_prezzi!$A$1:$L$189,3,FALSE)","v":0},null,{"$f":"VLOOKUP(L270,Tabella_prezzi!$A$1:$L$189,4,FALSE)","v":334},"L7N46",{"$f":"VLOOKUP(L270,Tabella_prezzi!$A$1:$L$189,6,FALSE)","v":"TS4L7-57416"}]
["[TS3L7-X710DP] Intel X710 Dual Port 10Gb Direct Attach, SFP+,PCIe",null,null,{"$f":"VLOOKUP(L271,Tabella_prezzi!$A$1:$L$189,8,FALSE)","v":"Intel X710 Dual Port 10Gb SFP+ FULL"},null,null,1,null,{"$f":"VLOOKUP(L271,Tabella_prezzi!$A$1:$L$189,3,FALSE)","v":0},null,{"$f":"VLOOKUP(L271,Tabella_prezzi!$A$1:$L$189,4,FALSE)","v":342},"L7N42",{"$f":"VLOOKUP(L271,Tabella_prezzi!$A$1:$L$189,6,FALSE)","v":"TS4L7-X710DP"}]
["[TS3L7-X710QP] Intel X710 Quad Port 10Gb Direct Attach, SFP+, PCIe",null,null,{"$f":"VLOOKUP(L272,Tabella_prezzi!$A$1:$L$189,8,FALSE)","v":"Intel X710 Quad Port 10Gb SFP+ FULL"},null,null,1,null,{"$f":"VLOOKUP(L272,Tabella_prezzi!$A$1:$L$189,3,FALSE)","v":0},null,{"$f":"VLOOKUP(L272,Tabella_prezzi!$A$1:$L$189,4,FALSE)","v":518},"L7N43",{"$f":"VLOOKUP(L272,Tabella_prezzi!$A$1:$L$189,6,FALSE)","v":"TS4L7-X710QP"}]
["[TS3L7-CONX6DP] Mellanox ConnectX-6 DX Dual Port 100GbE QFSFP56 Network Adapter",null,null,{"$f":"VLOOKUP(L273,Tabella_prezzi!$A$1:$L$189,8,FALSE)","v":"Mellanox ConnectX-6 DX Dual Port 100GbE QFSFP56 FULL"},null,null,1,{"$f":"VLOOKUP(L273,Tabella_prezzi!$A$1:$L$189,9,FALSE)","v":"Mellanox ConnectX-6 DX Dual Port 100GbE QFSFP56 FULL"},{"$f":"VLOOKUP(L273,Tabella_prezzi!$A$1:$L$189,3,FALSE)","v":0},null,{"$f":"VLOOKUP(L273,Tabella_prezzi!$A$1:$L$189,4,FALSE)","v":812},"L7N40",{"$f":"VLOOKUP(L273,Tabella_prezzi!$A$1:$L$189,6,FALSE)","v":"TS4L7-CONX6DP"}]
["[TS3L7-CONX6SP] Mellanox ConnectX-6 Single Port HDR100 QSFP56 Infiniband Adapter",null,null,{"$f":"VLOOKUP(L274,Tabella_prezzi!$A$1:$L$189,8,FALSE)","v":"Mellanox ConnectX-6 Single Port HDR100 QSFP56 Infiniband FULL"},null,null,1,{"$f":"VLOOKUP(L274,Tabella_prezzi!$A$1:$L$189,9,FALSE)","v":"Mellanox ConnectX-6 Single Port HDR100 QSFP56 Infiniband FULL"},{"$f":"VLOOKUP(L274,Tabella_prezzi!$A$1:$L$189,3,FALSE)","v":0},null,{"$f":"VLOOKUP(L274,Tabella_prezzi!$A$1:$L$189,4,FALSE)","v":720},"L7N39",{"$f":"VLOOKUP(L274,Tabella_prezzi!$A$1:$L$189,6,FALSE)","v":"TS4L7-CONX6SP"}]
["[TS3L7-MCX4DP] Mellanox ConnectX-4 Lx Dual Port 25GbE SFP28 FL 2 x SFP28 SR Optic, 25GbE",null,"TS3L7-MCX4DP","Mellanox ConnectX-4 Lx Dual Port 25GbE SFP28 Network Adapter, PCIe Full Height, 2 x SFP28 SR Optic, 25GbE",null,null,1,{"$f":"VLOOKUP(L275,Tabella_prezzi!$A$1:$L$189,9,FALSE)","v":"Mellanox ConnectX-4 Lx Dual Port 25GbE SFP28 Network Adapter, PCIe Full Height, 2 x SFP28 SR Optic, 25GbE"},{"$f":"VLOOKUP(L275,Tabella_prezzi!$A$1:$L$189,3,FALSE)","v":0},null,{"$f":"VLOOKUP(L275,Tabella_prezzi!$A$1:$L$189,4,FALSE)","v":419},"L7N94",{"$f":"VLOOKUP(L275,Tabella_prezzi!$A$1:$L$189,6,FALSE)","v":"TS4L7-MCX4DP"}]
[]
["TS3L2_PCI_E"]
[{"$f":"\"\"","v":""},null,null,null,null,null,{"$f":"\"\"","v":""},null,{"$f":"\"\"","v":""},null,null,{"$f":"\"\"","v":""},{"$f":"\"\"","v":""}]
["[TS3L7-LAN1] Broadcom 5719 Quad Port 1Gb Network Interface Card,",null,null,{"$f":"VLOOKUP(L279,Tabella_prezzi!$A$1:$L$189,8,FALSE)","v":"Broadcom 5719 Quad Port 1Gb Network Interface Card, Low Profile "},null,"540-BBCX",1,{"$f":"VLOOKUP(L279,Tabella_prezzi!$A$1:$L$189,9,FALSE)","v":"Broadcom 5719 Quad Port 1Gb Network Interface Card, Low Profile "},{"$f":"VLOOKUP(L279,Tabella_prezzi!$A$1:$L$189,3,FALSE)","v":"OpzGigabit"},{"$f":"VLOOKUP(L279,Tabella_prezzi!$A$1:$L$189,4,FALSE)","v":29.18},null,"L7N05",{"$f":"VLOOKUP(L279,Tabella_prezzi!$A$1:$L$189,6,FALSE)","v":"TS4L7-LAN1"}]
["[TS3L7-LAN10] Broadcom 57412 Dual Port 10Gb, SFP+, PCIe Adapter",null,null,{"$f":"VLOOKUP(L280,Tabella_prezzi!$A$1:$L$189,8,FALSE)","v":"Broadcom 57412 Dual Port 10Gb, SFP+, PCIe Adapter, Low Profile + Optics"},null,"540-BBCX",1,{"$f":"VLOOKUP(L280,Tabella_prezzi!$A$1:$L$189,9,FALSE)","v":"Broadcom 57412 Dual Port 10Gb, SFP+, PCIe Adapter, Low Profile + Optics"},{"$f":"VLOOKUP(L280,Tabella_prezzi!$A$1:$L$189,3,FALSE)","v":"OpzGigabit10Gbps"},{"$f":"VLOOKUP(L280,Tabella_prezzi!$A$1:$L$189,4,FALSE)","v":160.47999999999999},null,"L7N06",{"$f":"VLOOKUP(L280,Tabella_prezzi!$A$1:$L$189,6,FALSE)","v":"TS4L7-LAN10"}]
["[TS3L7-LAN25] QLogic 41262 Dual Port 25Gb SFP28 Adapter",null,null,{"$f":"VLOOKUP(L281,Tabella_prezzi!$A$1:$L$189,8,FALSE)","v":"Intel Ethernet XXV710 Dual Port 10/25GbE SFP28 Adapter, PCIe Low Profile + Optics"},null,"540-BBCX",1,{"$f":"VLOOKUP(L281,Tabella_prezzi!$A$1:$L$189,9,FALSE)","v":"Intel Ethernet XXV710 Dual Port 10/25GbE SFP28 Adapter, PCIe Low Profile + Optics"},{"$f":"VLOOKUP(L281,Tabella_prezzi!$A$1:$L$189,3,FALSE)","v":"OpzGigabit25Gbps"},{"$f":"VLOOKUP(L281,Tabella_prezzi!$A$1:$L$189,4,FALSE)","v":249.64},null,"L7N07",{"$f":"VLOOKUP(L281,Tabella_prezzi!$A$1:$L$189,6,FALSE)","v":"TS4L7-LAN25"}]
["[TS3L7CNA10] QLogic 41112 Dual Port 10Gb SFP+ Adapter",null,null,{"$f":"VLOOKUP(L282,Tabella_prezzi!$A$1:$L$189,8,FALSE)","v":"QLogic FastLinQ 41262 Dual Port 25Gb SFP28 Adapter, Low Profile + Optics"},null,"540-BBCX",1,{"$f":"VLOOKUP(L282,Tabella_prezzi!$A$1:$L$189,9,FALSE)","v":"QLogic FastLinQ 41262 Dual Port 25Gb SFP28 Adapter, Low Profile + Optics"},{"$f":"VLOOKUP(L282,Tabella_prezzi!$A$1:$L$189,3,FALSE)","v":"OpzGigabit10Gbps CNA"},{"$f":"VLOOKUP(L282,Tabella_prezzi!$A$1:$L$189,4,FALSE)","v":153.19},null,"L7N08",{"$f":"VLOOKUP(L282,Tabella_prezzi!$A$1:$L$189,6,FALSE)","v":"TS4L7-CNA10"}]
["[TS3L7-FC16] Qlogic 2692 Dual Port 16Gb Fibre Channel HBA",null,null,{"$f":"VLOOKUP(L283,Tabella_prezzi!$A$1:$L$189,8,FALSE)","v":"Intel X710-T2L Dual Port 10GbE BASE-T Adapter, PCIe LP"},null,"540-BBCX",1,{"$f":"VLOOKUP(L283,Tabella_prezzi!$A$1:$L$189,9,FALSE)","v":"Intel X710-T2L Dual Port 10GbE BASE-T Adapter, PCIe LP"},{"$f":"VLOOKUP(L283,Tabella_prezzi!$A$1:$L$189,3,FALSE)","v":"Opz10Gigabit BaseT"},{"$f":"VLOOKUP(L283,Tabella_prezzi!$A$1:$L$189,4,FALSE)","v":147.52000000000001},null,"L7N09",{"$f":"VLOOKUP(L283,Tabella_prezzi!$A$1:$L$189,6,FALSE)","v":"TS4L7-BaseT-LP"}]
["[TS3L7-NVME1600] Dell 1.6TB, NVMe, Mixed Use Express Flash, HHHL",null,null,{"$f":"VLOOKUP(L284,Tabella_prezzi!$A$1:$L$189,8,FALSE)","v":"1.6TB SSD SAS ISE MU 12Gbp"},null,"540-BBCX",1,{"$f":"VLOOKUP(L284,Tabella_prezzi!$A$1:$L$189,9,FALSE)","v":"1.6TB SSD SAS ISE MU 12Gbps 512e 2.5in Hot-Plug PM6 3 DWPD"},{"$f":"VLOOKUP(L284,Tabella_prezzi!$A$1:$L$189,3,FALSE)","v":"OpzSSD-MU1,6TB"},{"$f":"VLOOKUP(L284,Tabella_prezzi!$A$1:$L$189,4,FALSE)","v":473.08},null,"L7N17",{"$f":"VLOOKUP(L284,Tabella_prezzi!$A$1:$L$189,6,FALSE)","v":"TS4L7-SSD-MU1,6TB"}]
["[TS3L7-NVME800] Dell 1.6TB, NVMe, Mixed Use Express Flash, HHHL",null,null,{"$f":"VLOOKUP(L285,Tabella_prezzi!$A$1:$L$189,8,FALSE)","v":"960GB SSD SAS ISE RI 12Gbps"},null,"540-BBCX",1,{"$f":"VLOOKUP(L285,Tabella_prezzi!$A$1:$L$189,9,FALSE)","v":"960GB SSD SAS ISE RI 12Gbps 512e 2.5in Hot-Plug 1 DWPD"},{"$f":"VLOOKUP(L285,Tabella_prezzi!$A$1:$L$189,3,FALSE)","v":"OpzSSD-RI800GB"},{"$f":"VLOOKUP(L285,Tabella_prezzi!$A$1:$L$189,4,FALSE)","v":283.68},null,"L7N18",{"$f":"VLOOKUP(L285,Tabella_prezzi!$A$1:$L$189,6,FALSE)","v":"TS4L7-SSD-RI800GB"}]
["-=-=-=-=-=-=-=-=-=-=-=-=-=-=-=-=-20%-=-=-=-=-=-=-=-=-=-=-=-=-=-=-=-=-",null,null,null,null,null,{"$f":"\"\"","v":""},null,{"$f":"\"\"","v":""},null,null,{"$f":"\"\"","v":""},{"$f":"\"\"","v":""}]
["[TS3L7-BOSS480] BOSS controller card, full height, with 2 480G M.2 Drives",null,null,{"$f":"VLOOKUP(L287,Tabella_prezzi!$A$1:$L$189,8,FALSE)","v":"BOSS controller card, full height, with 2 480G M.2 Drives"},null,null,1,null,{"$f":"VLOOKUP(L287,Tabella_prezzi!$A$1:$L$189,3,FALSE)","v":0},null,{"$f":"VLOOKUP(L287,Tabella_prezzi!$A$1:$L$189,4,FALSE)","v":748},"L7N33",{"$f":"VLOOKUP(L287,Tabella_prezzi!$A$1:$L$189,6,FALSE)","v":"TS4L7-BOSS480"}]
["[TS3L7-SAS12] SAS 12Gbps HBA External Controller, Full Height",null,null,{"$f":"VLOOKUP(L288,Tabella_prezzi!$A$1:$L$189,8,FALSE)","v":"SAS 12Gbps HBA External Controller, Full Height"},null,null,1,{"$f":"VLOOKUP(L288,Tabella_prezzi!$A$1:$L$189,9,FALSE)","v":"SAS 12Gbps HBA External Controller, Full Height"},{"$f":"VLOOKUP(L288,Tabella_prezzi!$A$1:$L$189,3,FALSE)","v":0},null,{"$f":"VLOOKUP(L288,Tabella_prezzi!$A$1:$L$189,4,FALSE)","v":92},"L7N101",{"$f":"VLOOKUP(L288,Tabella_prezzi!$A$1:$L$189,6,FALSE)","v":"TS4L7-SAS12"}]
["[TS3L7-H840] PERC H840 RAID Adapter for External MD14XX Only, 8GB NV Cache",null,null,{"$f":"VLOOKUP(L289,Tabella_prezzi!$A$1:$L$189,8,FALSE)","v":"PERC H840 RAID Adapter for External MD14XX Only, 8GB NV Cache, Full Height"},null,null,1,null,{"$f":"VLOOKUP(L289,Tabella_prezzi!$A$1:$L$189,3,FALSE)","v":"OpzH840"},null,{"$f":"VLOOKUP(L289,Tabella_prezzi!$A$1:$L$189,4,FALSE)","v":479},"L7N71",{"$f":"VLOOKUP(L289,Tabella_prezzi!$A$1:$L$189,6,FALSE)","v":"TS4L7-H840"}]
["[TS3L7-57416] Broadcom 57416 Dual Port 10Gb, Base-T, PCIe Adapter",null,null,{"$f":"VLOOKUP(L290,Tabella_prezzi!$A$1:$L$189,8,FALSE)","v":"Broadcom 57416 Dual Port 10Gb, Base-T, PCIe Adapter, Full Height"},null,null,1,null,{"$f":"VLOOKUP(L290,Tabella_prezzi!$A$1:$L$189,3,FALSE)","v":0},null,{"$f":"VLOOKUP(L290,Tabella_prezzi!$A$1:$L$189,4,FALSE)","v":334},"L7N46",{"$f":"VLOOKUP(L290,Tabella_prezzi!$A$1:$L$189,6,FALSE)","v":"TS4L7-57416"}]
["[TS3L7-A10080GB] NVIDIA Ampere A100, PCIe, 300W, 80GB Passive, Double Wide, Full Height GPU",null,null,{"$f":"VLOOKUP(L291,Tabella_prezzi!$A$1:$L$189,8,FALSE)","v":"NVIDIA Ampere A100, PCIe, 300W, 80GB Passive, Double Wide, Full Height GPU"},null,null,1,null,{"$f":"VLOOKUP(L291,Tabella_prezzi!$A$1:$L$189,3,FALSE)","v":0},null,{"$f":"VLOOKUP(L291,Tabella_prezzi!$A$1:$L$189,4,FALSE)","v":12460},"L7N131",{"$f":"VLOOKUP(L291,Tabella_prezzi!$A$1:$L$189,6,FALSE)","v":"TS4L7-A10080GB"}]
["[TS3L7-GPUA30] NVIDIA Ampere A30, PCIe, 165W, 24GB Passive, Double Wide, Full Height GPU",null,null,{"$f":"VLOOKUP(L292,Tabella_prezzi!$A$1:$L$189,8,FALSE)","v":"NVIDIA Ampere A30, PCIe, 165W, 24GB Passive, Double Wide, Full Height GPU"},null,null,1,null,{"$f":"VLOOKUP(L292,Tabella_prezzi!$A$1:$L$189,3,FALSE)","v":0},null,{"$f":"VLOOKUP(L292,Tabella_prezzi!$A$1:$L$189,4,FALSE)","v":4657},"L7N133",{"$f":"VLOOKUP(L292,Tabella_prezzi!$A$1:$L$189,6,FALSE)","v":"TS4L7-GPUA30"}]
["[TS3L7-GPUA16] NVIDIA Ampere A16, PCIe, 250W, 64GB Passive, Double Wide, Full Height GPU",null,null,{"$f":"VLOOKUP(L293,Tabella_prezzi!$A$1:$L$189,8,FALSE)","v":"NVIDIA Ampere A16, PCIe, 250W, 64GB Passive, Double Wide, Full Height GPU"},null,null,1,null,{"$f":"VLOOKUP(L293,Tabella_prezzi!$A$1:$L$189,3,FALSE)","v":0},null,{"$f":"VLOOKUP(L293,Tabella_prezzi!$A$1:$L$189,4,FALSE)","v":3394},"L7N134",{"$f":"VLOOKUP(L293,Tabella_prezzi!$A$1:$L$189,6,FALSE)","v":"TS4L7-GPUA16"}]
["[TS3L7-X710DP] Intel X710 Dual Port 10Gb Direct Attach, SFP+,PCIe",null,null,{"$f":"VLOOKUP(L294,Tabella_prezzi!$A$1:$L$189,8,FALSE)","v":"Intel X710 Dual Port 10Gb SFP+ FULL"},null,null,1,null,{"$f":"VLOOKUP(L294,Tabella_prezzi!$A$1:$L$189,3,FALSE)","v":0},null,{"$f":"VLOOKUP(L294,Tabella_prezzi!$A$1:$L$189,4,FALSE)","v":342},"L7N42",{"$f":"VLOOKUP(L294,Tabella_prezzi!$A$1:$L$189,6,FALSE)","v":"TS4L7-X710DP"}]
["[TS3L7-X710QP] Intel X710 Quad Port 10Gb Direct Attach, SFP+, PCIe",null,null,{"$f":"VLOOKUP(L295,Tabella_prezzi!$A$1:$L$189,8,FALSE)","v":"Intel X710 Quad Port 10Gb SFP+ FULL"},null,null,1,null,{"$f":"VLOOKUP(L295,Tabella_prezzi!$A$1:$L$189,3,FALSE)","v":0},null,{"$f":"VLOOKUP(L295,Tabella_prezzi!$A$1:$L$189,4,FALSE)","v":518},"L7N43",{"$f":"VLOOKUP(L295,Tabella_prezzi!$A$1:$L$189,6,FALSE)","v":"TS4L7-X710QP"}]
["[TS3L7-CONX6DP] Mellanox ConnectX-6 DX Dual Port 100GbE QFSFP56 Network Adapter",null,null,{"$f":"VLOOKUP(L296,Tabella_prezzi!$A$1:$L$189,8,FALSE)","v":"Mellanox ConnectX-6 DX Dual Port 100GbE QFSFP56 FULL"},null,null,1,{"$f":"VLOOKUP(L296,Tabella_prezzi!$A$1:$L$189,9,FALSE)","v":"Mellanox ConnectX-6 DX Dual Port 100GbE QFSFP56 FULL"},{"$f":"VLOOKUP(L296,Tabella_prezzi!$A$1:$L$189,3,FALSE)","v":0},null,{"$f":"VLOOKUP(L296,Tabella_prezzi!$A$1:$L$189,4,FALSE)","v":812},"L7N40",{"$f":"VLOOKUP(L296,Tabella_prezzi!$A$1:$L$189,6,FALSE)","v":"TS4L7-CONX6DP"}]
["[TS3L7-CONX6SP] Mellanox ConnectX-6 Single Port HDR100 QSFP56 Infiniband Adapter",null,null,{"$f":"VLOOKUP(L297,Tabella_prezzi!$A$1:$L$189,8,FALSE)","v":"Mellanox ConnectX-6 Single Port HDR100 QSFP56 Infiniband FULL"},null,null,1,{"$f":"VLOOKUP(L297,Tabella_prezzi!$A$1:$L$189,9,FALSE)","v":"Mellanox ConnectX-6 Single Port HDR100 QSFP56 Infiniband FULL"},{"$f":"VLOOKUP(L297,Tabella_prezzi!$A$1:$L$189,3,FALSE)","v":0},null,{"$f":"VLOOKUP(L297,Tabella_prezzi!$A$1:$L$189,4,FALSE)","v":720},"L7N39",{"$f":"VLOOKUP(L297,Tabella_prezzi!$A$1:$L$189,6,FALSE)","v":"TS4L7-CONX6SP"}]
["[TS3L7-MCX4DP] Mellanox ConnectX-4 Lx Dual Port 25GbE SFP28 FL 2 x SFP28 SR Optic, 25GbE",null,"TS3L7-MCX4DP","Mellanox ConnectX-4 Lx Dual Port 25GbE SFP28 Network Adapter, PCIe Full Height, 2 x SFP28 SR Optic, 25GbE",null,null,1,{"$f":"VLOOKUP(L298,Tabella_prezzi!$A$1:$L$189,9,FALSE)","v":"Mellanox ConnectX-4 Lx Dual Port 25GbE SFP28 Network Adapter, PCIe Full Height, 2 x SFP28 SR Optic, 25GbE"},{"$f":"VLOOKUP(L298,Tabella_prezzi!$A$1:$L$189,3,FALSE)","v":0},null,{"$f":"VLOOKUP(L298,Tabella_prezzi!$A$1:$L$189,4,FALSE)","v":419},"L7N94",{"$f":"VLOOKUP(L298,Tabella_prezzi!$A$1:$L$189,6,FALSE)","v":"TS4L7-MCX4DP"}]
["[TS3L7-RTX6000] NVIDIA Quadro RTX 6000 24 GB, 250W, Dual Slot, PCIe x16 Passive Cooled",null,null,{"$f":"VLOOKUP(L299,Tabella_prezzi!$A$1:$L$189,8,FALSE)","v":"NVIDIA Quadro RTX 6000 24 GB, 250W, Dual Slot, GPU"},null,null,1,null,{"$f":"VLOOKUP(L299,Tabella_prezzi!$A$1:$L$189,3,FALSE)","v":"OpzGPURTX6000"},null,{"$f":"VLOOKUP(L299,Tabella_prezzi!$A$1:$L$189,4,FALSE)","v":4800},"L7N56",{"$f":"VLOOKUP(L299,Tabella_prezzi!$A$1:$L$189,6,FALSE)","v":"TS4L7-RTX6000"}]
["[TS3L7-TESLAM10] NVIDIA Tesla M10 GPU",null,null,{"$f":"VLOOKUP(L300,Tabella_prezzi!$A$1:$L$189,8,FALSE)","v":"NVIDIA Tesla M10 GPU"},null,null,1,null,{"$f":"VLOOKUP(L300,Tabella_prezzi!$A$1:$L$189,3,FALSE)","v":"OpzGPUM10"},null,{"$f":"VLOOKUP(L300,Tabella_prezzi!$A$1:$L$189,4,FALSE)","v":2700},"L7N57",{"$f":"VLOOKUP(L300,Tabella_prezzi!$A$1:$L$189,6,FALSE)","v":"TS4L7-TESLAM10"}]
["[TS3L7-A100] NVIDIA Ampere A100, PCIe, 250W , 40GB Passive, Double Wide, Full Height GPU",null,null,{"$f":"VLOOKUP(L301,Tabella_prezzi!$A$1:$L$189,8,FALSE)","v":"NVIDIA Ampere A100, PCIe, 250W , 40GB Passive, Double Wide, Full Height GPU"},null,null,1,null,{"$f":"VLOOKUP(L301,Tabella_prezzi!$A$1:$L$189,3,FALSE)","v":0},null,{"$f":"VLOOKUP(L301,Tabella_prezzi!$A$1:$L$189,4,FALSE)","v":10130},"L7N108",{"$f":"VLOOKUP(L301,Tabella_prezzi!$A$1:$L$189,6,FALSE)","v":"TS4L7-A100"}]
[]
["TS3L2_PCI_F"]
[{"$f":"\"\"","v":""},null,null,null,null,null,{"$f":"\"\"","v":""},null,{"$f":"\"\"","v":""},null,null,{"$f":"\"\"","v":""},{"$f":"\"\"","v":""}]
["[TS3L7-LAN1] Broadcom 5719 Quad Port 1Gb Network Interface Card,",null,null,{"$f":"VLOOKUP(L305,Tabella_prezzi!$A$1:$L$189,8,FALSE)","v":"Broadcom 5719 Quad Port 1Gb Network Interface Card, Low Profile "},null,"540-BBCX",1,{"$f":"VLOOKUP(L305,Tabella_prezzi!$A$1:$L$189,9,FALSE)","v":"Broadcom 5719 Quad Port 1Gb Network Interface Card, Low Profile "},{"$f":"VLOOKUP(L305,Tabella_prezzi!$A$1:$L$189,3,FALSE)","v":"OpzGigabit"},{"$f":"VLOOKUP(L305,Tabella_prezzi!$A$1:$L$189,4,FALSE)","v":29.18},null,"L7N05",{"$f":"VLOOKUP(L305,Tabella_prezzi!$A$1:$L$189,6,FALSE)","v":"TS4L7-LAN1"}]
["[TS3L7-LAN10] Broadcom 57412 Dual Port 10Gb, SFP+, PCIe Adapter",null,null,{"$f":"VLOOKUP(L306,Tabella_prezzi!$A$1:$L$189,8,FALSE)","v":"Broadcom 57412 Dual Port 10Gb, SFP+, PCIe Adapter, Low Profile + Optics"},null,"540-BBCX",1,{"$f":"VLOOKUP(L306,Tabella_prezzi!$A$1:$L$189,9,FALSE)","v":"Broadcom 57412 Dual Port 10Gb, SFP+, PCIe Adapter, Low Profile + Optics"},{"$f":"VLOOKUP(L306,Tabella_prezzi!$A$1:$L$189,3,FALSE)","v":"OpzGigabit10Gbps"},{"$f":"VLOOKUP(L306,Tabella_prezzi!$A$1:$L$189,4,FALSE)","v":160.47999999999999},null,"L7N06",{"$f":"VLOOKUP(L306,Tabella_prezzi!$A$1:$L$189,6,FALSE)","v":"TS4L7-LAN10"}]
["[TS3L7-LAN25] QLogic 41262 Dual Port 25Gb SFP28 Adapter",null,null,{"$f":"VLOOKUP(L307,Tabella_prezzi!$A$1:$L$189,8,FALSE)","v":"Intel Ethernet XXV710 Dual Port 10/25GbE SFP28 Adapter, PCIe Low Profile + Optics"},null,"540-BBCX",1,{"$f":"VLOOKUP(L307,Tabella_prezzi!$A$1:$L$189,9,FALSE)","v":"Intel Ethernet XXV710 Dual Port 10/25GbE SFP28 Adapter, PCIe Low Profile + Optics"},{"$f":"VLOOKUP(L307,Tabella_prezzi!$A$1:$L$189,3,FALSE)","v":"OpzGigabit25Gbps"},{"$f":"VLOOKUP(L307,Tabella_prezzi!$A$1:$L$189,4,FALSE)","v":249.64},null,"L7N07",{"$f":"VLOOKUP(L307,Tabella_prezzi!$A$1:$L$189,6,FALSE)","v":"TS4L7-LAN25"}]
["[TS3L7CNA10] QLogic 41112 Dual Port 10Gb SFP+ Adapter",null,null,{"$f":"VLOOKUP(L308,Tabella_prezzi!$A$1:$L$189,8,FALSE)","v":"QLogic FastLinQ 41262 Dual Port 25Gb SFP28 Adapter, Low Profile + Optics"},null,"540-BBCX",1,{"$f":"VLOOKUP(L308,Tabella_prezzi!$A$1:$L$189,9,FALSE)","v":"QLogic FastLinQ 41262 Dual Port 25Gb SFP28 Adapter, Low Profile + Optics"},{"$f":"VLOOKUP(L308,Tabella_prezzi!$A$1:$L$189,3,FALSE)","v":"OpzGigabit10Gbps CNA"},{"$f":"VLOOKUP(L308,Tabella_prezzi!$A$1:$L$189,4,FALSE)","v":153.19},null,"L7N08",{"$f":"VLOOKUP(L308,Tabella_prezzi!$A$1:$L$189,6,FALSE)","v":"TS4L7-CNA10"}]
["[TS3L7-FC16] Qlogic 2692 Dual Port 16Gb Fibre Channel HBA",null,null,{"$f":"VLOOKUP(L309,Tabella_prezzi!$A$1:$L$189,8,FALSE)","v":"Intel X710-T2L Dual Port 10GbE BASE-T Adapter, PCIe LP"},null,"540-BBCX",1,{"$f":"VLOOKUP(L309,Tabella_prezzi!$A$1:$L$189,9,FALSE)","v":"Intel X710-T2L Dual Port 10GbE BASE-T Adapter, PCIe LP"},{"$f":"VLOOKUP(L309,Tabella_prezzi!$A$1:$L$189,3,FALSE)","v":"Opz10Gigabit BaseT"},{"$f":"VLOOKUP(L309,Tabella_prezzi!$A$1:$L$189,4,FALSE)","v":147.52000000000001},null,"L7N09",{"$f":"VLOOKUP(L309,Tabella_prezzi!$A$1:$L$189,6,FALSE)","v":"TS4L7-BaseT-LP"}]
["[TS3L7-NVME1600] Dell 1.6TB, NVMe, Mixed Use Express Flash, HHHL",null,null,{"$f":"VLOOKUP(L310,Tabella_prezzi!$A$1:$L$189,8,FALSE)","v":"1.6TB SSD SAS ISE MU 12Gbp"},null,"540-BBCX",1,{"$f":"VLOOKUP(L310,Tabella_prezzi!$A$1:$L$189,9,FALSE)","v":"1.6TB SSD SAS ISE MU 12Gbps 512e 2.5in Hot-Plug PM6 3 DWPD"},{"$f":"VLOOKUP(L310,Tabella_prezzi!$A$1:$L$189,3,FALSE)","v":"OpzSSD-MU1,6TB"},{"$f":"VLOOKUP(L310,Tabella_prezzi!$A$1:$L$189,4,FALSE)","v":473.08},null,"L7N17",{"$f":"VLOOKUP(L310,Tabella_prezzi!$A$1:$L$189,6,FALSE)","v":"TS4L7-SSD-MU1,6TB"}]
["[TS3L7-NVME800] Dell 1.6TB, NVMe, Mixed Use Express Flash, HHHL",null,null,{"$f":"VLOOKUP(L311,Tabella_prezzi!$A$1:$L$189,8,FALSE)","v":"960GB SSD SAS ISE RI 12Gbps"},null,"540-BBCX",1,{"$f":"VLOOKUP(L311,Tabella_prezzi!$A$1:$L$189,9,FALSE)","v":"960GB SSD SAS ISE RI 12Gbps 512e 2.5in Hot-Plug 1 DWPD"},{"$f":"VLOOKUP(L311,Tabella_prezzi!$A$1:$L$189,3,FALSE)","v":"OpzSSD-RI800GB"},{"$f":"VLOOKUP(L311,Tabella_prezzi!$A$1:$L$189,4,FALSE)","v":283.68},null,"L7N18",{"$f":"VLOOKUP(L311,Tabella_prezzi!$A$1:$L$189,6,FALSE)","v":"TS4L7-SSD-RI800GB"}]
["-=-=-=-=-=-=-=-=-=-=-=-=-=-=-=-=-20%-=-=-=-=-=-=-=-=-=-=-=-=-=-=-=-=-",null,null,null,null,null,{"$f":"\"\"","v":""},null,{"$f":"\"\"","v":""},null,null,{"$f":"\"\"","v":""},{"$f":"\"\"","v":""}]
["[TS3L7-BOSS480] BOSS controller card, full height, with 2 480G M.2 Drives",null,null,{"$f":"VLOOKUP(L313,Tabella_prezzi!$A$1:$L$189,8,FALSE)","v":"BOSS controller card, full height, with 2 480G M.2 Drives"},null,null,1,null,{"$f":"VLOOKUP(L313,Tabella_prezzi!$A$1:$L$189,3,FALSE)","v":0},null,{"$f":"VLOOKUP(L313,Tabella_prezzi!$A$1:$L$189,4,FALSE)","v":748},"L7N33",{"$f":"VLOOKUP(L313,Tabella_prezzi!$A$1:$L$189,6,FALSE)","v":"TS4L7-BOSS480"}]
["[TS3L7-SAS12] SAS 12Gbps HBA External Controller, Full Height",null,null,{"$f":"VLOOKUP(L314,Tabella_prezzi!$A$1:$L$189,8,FALSE)","v":"SAS 12Gbps HBA External Controller, Full Height"},null,null,1,{"$f":"VLOOKUP(L314,Tabella_prezzi!$A$1:$L$189,9,FALSE)","v":"SAS 12Gbps HBA External Controller, Full Height"},{"$f":"VLOOKUP(L314,Tabella_prezzi!$A$1:$L$189,3,FALSE)","v":0},null,{"$f":"VLOOKUP(L314,Tabella_prezzi!$A$1:$L$189,4,FALSE)","v":92},"L7N101",{"$f":"VLOOKUP(L314,Tabella_prezzi!$A$1:$L$189,6,FALSE)","v":"TS4L7-SAS12"}]
["[TS3L7-H840] PERC H840 RAID Adapter for External MD14XX Only, 8GB NV Cache",null,null,{"$f":"VLOOKUP(L315,Tabella_prezzi!$A$1:$L$189,8,FALSE)","v":"PERC H840 RAID Adapter for External MD14XX Only, 8GB NV Cache, Full Height"},null,null,1,null,{"$f":"VLOOKUP(L315,Tabella_prezzi!$A$1:$L$189,3,FALSE)","v":"OpzH840"},null,{"$f":"VLOOKUP(L315,Tabella_prezzi!$A$1:$L$189,4,FALSE)","v":479},"L7N71",{"$f":"VLOOKUP(L315,Tabella_prezzi!$A$1:$L$189,6,FALSE)","v":"TS4L7-H840"}]
["[TS3L7-57416] Broadcom 57416 Dual Port 10Gb, Base-T, PCIe Adapter",null,null,{"$f":"VLOOKUP(L316,Tabella_prezzi!$A$1:$L$189,8,FALSE)","v":"Broadcom 57416 Dual Port 10Gb, Base-T, PCIe Adapter, Full Height"},null,null,1,null,{"$f":"VLOOKUP(L316,Tabella_prezzi!$A$1:$L$189,3,FALSE)","v":0},null,{"$f":"VLOOKUP(L316,Tabella_prezzi!$A$1:$L$189,4,FALSE)","v":334},"L7N46",{"$f":"VLOOKUP(L316,Tabella_prezzi!$A$1:$L$189,6,FALSE)","v":"TS4L7-57416"}]
["[TS3L7-A10080GB] NVIDIA Ampere A100, PCIe, 300W, 80GB Passive, Double Wide, Full Height GPU",null,null,{"$f":"VLOOKUP(L317,Tabella_prezzi!$A$1:$L$189,8,FALSE)","v":"NVIDIA Ampere A100, PCIe, 300W, 80GB Passive, Double Wide, Full Height GPU"},null,null,1,null,{"$f":"VLOOKUP(L317,Tabella_prezzi!$A$1:$L$189,3,FALSE)","v":0},null,{"$f":"VLOOKUP(L317,Tabella_prezzi!$A$1:$L$189,4,FALSE)","v":12460},"L7N131",{"$f":"VLOOKUP(L317,Tabella_prezzi!$A$1:$L$189,6,FALSE)","v":"TS4L7-A10080GB"}]
["[TS3L7-GPUA30] NVIDIA Ampere A30, PCIe, 165W, 24GB Passive, Double Wide, Full Height GPU",null,null,{"$f":"VLOOKUP(L318,Tabella_prezzi!$A$1:$L$189,8,FALSE)","v":"NVIDIA Ampere A30, PCIe, 165W, 24GB Passive, Double Wide, Full Height GPU"},null,null,1,null,{"$f":"VLOOKUP(L318,Tabella_prezzi!$A$1:$L$189,3,FALSE)","v":0},null,{"$f":"VLOOKUP(L318,Tabella_prezzi!$A$1:$L$189,4,FALSE)","v":4657},"L7N133",{"$f":"VLOOKUP(L318,Tabella_prezzi!$A$1:$L$189,6,FALSE)","v":"TS4L7-GPUA30"}]
["[TS3L7-GPUA16] NVIDIA Ampere A16, PCIe, 250W, 64GB Passive, Double Wide, Full Height GPU",null,null,{"$f":"VLOOKUP(L319,Tabella_prezzi!$A$1:$L$189,8,FALSE)","v":"NVIDIA Ampere A16, PCIe, 250W, 64GB Passive, Double Wide, Full Height GPU"},null,null,1,null,{"$f":"VLOOKUP(L319,Tabella_prezzi!$A$1:$L$189,3,FALSE)","v":0},null,{"$f":"VLOOKUP(L319,Tabella_prezzi!$A$1:$L$189,4,FALSE)","v":3394},"L7N134",{"$f":"VLOOKUP(L319,Tabella_prezzi!$A$1:$L$189,6,FALSE)","v":"TS4L7-GPUA16"}]
["[TS3L7-X710DP] Intel X710 Dual Port 10Gb Direct Attach, SFP+,PCIe",null,null,{"$f":"VLOOKUP(L320,Tabella_prezzi!$A$1:$L$189,8,FALSE)","v":"Intel X710 Dual Port 10Gb SFP+ FULL"},null,null,1,null,{"$f":"VLOOKUP(L320,Tabella_prezzi!$A$1:$L$189,3,FALSE)","v":0},null,{"$f":"VLOOKUP(L320,Tabella_prezzi!$A$1:$L$189,4,FALSE)","v":342},"L7N42",{"$f":"VLOOKUP(L320,Tabella_prezzi!$A$1:$L$189,6,FALSE)","v":"TS4L7-X710DP"}]
["[TS3L7-X710QP] Intel X710 Quad Port 10Gb Direct Attach, SFP+, PCIe",null,null,{"$f":"VLOOKUP(L321,Tabella_prezzi!$A$1:$L$189,8,FALSE)","v":"Intel X710 Quad Port 10Gb SFP+ FULL"},null,null,1,null,{"$f":"VLOOKUP(L321,Tabella_prezzi!$A$1:$L$189,3,FALSE)","v":0},null,{"$f":"VLOOKUP(L321,Tabella_prezzi!$A$1:$L$189,4,FALSE)","v":518},"L7N43",{"$f":"VLOOKUP(L321,Tabella_prezzi!$A$1:$L$189,6,FALSE)","v":"TS4L7-X710QP"}]
["[TS3L7-CONX6DP] Mellanox ConnectX-6 DX Dual Port 100GbE QFSFP56 Network Adapter",null,null,{"$f":"VLOOKUP(L322,Tabella_prezzi!$A$1:$L$189,8,FALSE)","v":"Mellanox ConnectX-6 DX Dual Port 100GbE QFSFP56 FULL"},null,null,1,{"$f":"VLOOKUP(L322,Tabella_prezzi!$A$1:$L$189,9,FALSE)","v":"Mellanox ConnectX-6 DX Dual Port 100GbE QFSFP56 FULL"},{"$f":"VLOOKUP(L322,Tabella_prezzi!$A$1:$L$189,3,FALSE)","v":0},null,{"$f":"VLOOKUP(L322,Tabella_prezzi!$A$1:$L$189,4,FALSE)","v":812},"L7N40",{"$f":"VLOOKUP(L322,Tabella_prezzi!$A$1:$L$189,6,FALSE)","v":"TS4L7-CONX6DP"}]
["[TS3L7-MCX4DP] Mellanox ConnectX-4 Lx Dual Port 25GbE SFP28 FL 2 x SFP28 SR Optic, 25GbE",null,"TS3L7-MCX4DP","Mellanox ConnectX-4 Lx Dual Port 25GbE SFP28 Network Adapter, PCIe Full Height, 2 x SFP28 SR Optic, 25GbE",null,null,1,{"$f":"VLOOKUP(L323,Tabella_prezzi!$A$1:$L$189,9,FALSE)","v":"Mellanox ConnectX-4 Lx Dual Port 25GbE SFP28 Network Adapter, PCIe Full Height, 2 x SFP28 SR Optic, 25GbE"},{"$f":"VLOOKUP(L323,Tabella_prezzi!$A$1:$L$189,3,FALSE)","v":0},null,{"$f":"VLOOKUP(L323,Tabella_prezzi!$A$1:$L$189,4,FALSE)","v":419},"L7N94",{"$f":"VLOOKUP(L323,Tabella_prezzi!$A$1:$L$189,6,FALSE)","v":"TS4L7-MCX4DP"}]
["[TS3L7-RTX6000] NVIDIA Quadro RTX 6000 24 GB, 250W, Dual Slot, PCIe x16 Passive Cooled",null,null,{"$f":"VLOOKUP(L324,Tabella_prezzi!$A$1:$L$189,8,FALSE)","v":"NVIDIA Quadro RTX 6000 24 GB, 250W, Dual Slot, GPU"},null,null,1,null,{"$f":"VLOOKUP(L324,Tabella_prezzi!$A$1:$L$189,3,FALSE)","v":"OpzGPURTX6000"},null,{"$f":"VLOOKUP(L324,Tabella_prezzi!$A$1:$L$189,4,FALSE)","v":4800},"L7N56",{"$f":"VLOOKUP(L324,Tabella_prezzi!$A$1:$L$189,6,FALSE)","v":"TS4L7-RTX6000"}]
["[TS3L7-TESLAM10] NVIDIA Tesla M10 GPU",null,null,{"$f":"VLOOKUP(L325,Tabella_prezzi!$A$1:$L$189,8,FALSE)","v":"NVIDIA Tesla M10 GPU"},null,null,1,null,{"$f":"VLOOKUP(L325,Tabella_prezzi!$A$1:$L$189,3,FALSE)","v":"OpzGPUM10"},null,{"$f":"VLOOKUP(L325,Tabella_prezzi!$A$1:$L$189,4,FALSE)","v":2700},"L7N57",{"$f":"VLOOKUP(L325,Tabella_prezzi!$A$1:$L$189,6,FALSE)","v":"TS4L7-TESLAM10"}]
["[TS3L7-A100] NVIDIA Ampere A100, PCIe, 250W , 40GB Passive, Double Wide, Full Height GPU",null,null,{"$f":"VLOOKUP(L326,Tabella_prezzi!$A$1:$L$189,8,FALSE)","v":"NVIDIA Ampere A100, PCIe, 250W , 40GB Passive, Double Wide, Full Height GPU"},null,null,1,null,{"$f":"VLOOKUP(L326,Tabella_prezzi!$A$1:$L$189,3,FALSE)","v":0},null,{"$f":"VLOOKUP(L326,Tabella_prezzi!$A$1:$L$189,4,FALSE)","v":10130},"L7N108",{"$f":"VLOOKUP(L326,Tabella_prezzi!$A$1:$L$189,6,FALSE)","v":"TS4L7-A100"}]
[]
["TS3L2_PCI_G"]
[{"$f":"\"\"","v":""},null,null,null,null,null,{"$f":"\"\"","v":""},null,{"$f":"\"\"","v":""},null,null,{"$f":"\"\"","v":""},{"$f":"\"\"","v":""}]
["[TS3L7-LAN1] Broadcom 5719 Quad Port 1Gb Network Interface Card,",null,null,{"$f":"VLOOKUP(L330,Tabella_prezzi!$A$1:$L$189,8,FALSE)","v":"Broadcom 5719 Quad Port 1Gb Network Interface Card, Low Profile "},null,"540-BBCX",1,{"$f":"VLOOKUP(L330,Tabella_prezzi!$A$1:$L$189,9,FALSE)","v":"Broadcom 5719 Quad Port 1Gb Network Interface Card, Low Profile "},{"$f":"VLOOKUP(L330,Tabella_prezzi!$A$1:$L$189,3,FALSE)","v":"OpzGigabit"},{"$f":"VLOOKUP(L330,Tabella_prezzi!$A$1:$L$189,4,FALSE)","v":29.18},null,"L7N05",{"$f":"VLOOKUP(L330,Tabella_prezzi!$A$1:$L$189,6,FALSE)","v":"TS4L7-LAN1"}]
["[TS3L7-LAN10] Broadcom 57412 Dual Port 10Gb, SFP+, PCIe Adapter",null,null,{"$f":"VLOOKUP(L331,Tabella_prezzi!$A$1:$L$189,8,FALSE)","v":"Broadcom 57412 Dual Port 10Gb, SFP+, PCIe Adapter, Low Profile + Optics"},null,"540-BBCX",1,{"$f":"VLOOKUP(L331,Tabella_prezzi!$A$1:$L$189,9,FALSE)","v":"Broadcom 57412 Dual Port 10Gb, SFP+, PCIe Adapter, Low Profile + Optics"},{"$f":"VLOOKUP(L331,Tabella_prezzi!$A$1:$L$189,3,FALSE)","v":"OpzGigabit10Gbps"},{"$f":"VLOOKUP(L331,Tabella_prezzi!$A$1:$L$189,4,FALSE)","v":160.47999999999999},null,"L7N06",{"$f":"VLOOKUP(L331,Tabella_prezzi!$A$1:$L$189,6,FALSE)","v":"TS4L7-LAN10"}]
["[TS3L7-LAN25] QLogic 41262 Dual Port 25Gb SFP28 Adapter",null,null,{"$f":"VLOOKUP(L332,Tabella_prezzi!$A$1:$L$189,8,FALSE)","v":"Intel Ethernet XXV710 Dual Port 10/25GbE SFP28 Adapter, PCIe Low Profile + Optics"},null,"540-BBCX",1,{"$f":"VLOOKUP(L332,Tabella_prezzi!$A$1:$L$189,9,FALSE)","v":"Intel Ethernet XXV710 Dual Port 10/25GbE SFP28 Adapter, PCIe Low Profile + Optics"},{"$f":"VLOOKUP(L332,Tabella_prezzi!$A$1:$L$189,3,FALSE)","v":"OpzGigabit25Gbps"},{"$f":"VLOOKUP(L332,Tabella_prezzi!$A$1:$L$189,4,FALSE)","v":249.64},null,"L7N07",{"$f":"VLOOKUP(L332,Tabella_prezzi!$A$1:$L$189,6,FALSE)","v":"TS4L7-LAN25"}]
["[TS3L7CNA10] QLogic 41112 Dual Port 10Gb SFP+ Adapter",null,null,{"$f":"VLOOKUP(L333,Tabella_prezzi!$A$1:$L$189,8,FALSE)","v":"QLogic FastLinQ 41262 Dual Port 25Gb SFP28 Adapter, Low Profile + Optics"},null,"540-BBCX",1,{"$f":"VLOOKUP(L333,Tabella_prezzi!$A$1:$L$189,9,FALSE)","v":"QLogic FastLinQ 41262 Dual Port 25Gb SFP28 Adapter, Low Profile + Optics"},{"$f":"VLOOKUP(L333,Tabella_prezzi!$A$1:$L$189,3,FALSE)","v":"OpzGigabit10Gbps CNA"},{"$f":"VLOOKUP(L333,Tabella_prezzi!$A$1:$L$189,4,FALSE)","v":153.19},null,"L7N08",{"$f":"VLOOKUP(L333,Tabella_prezzi!$A$1:$L$189,6,FALSE)","v":"TS4L7-CNA10"}]
["[TS3L7-FC16] Qlogic 2692 Dual Port 16Gb Fibre Channel HBA",null,null,{"$f":"VLOOKUP(L334,Tabella_prezzi!$A$1:$L$189,8,FALSE)","v":"Intel X710-T2L Dual Port 10GbE BASE-T Adapter, PCIe LP"},null,"540-BBCX",1,{"$f":"VLOOKUP(L334,Tabella_prezzi!$A$1:$L$189,9,FALSE)","v":"Intel X710-T2L Dual Port 10GbE BASE-T Adapter, PCIe LP"},{"$f":"VLOOKUP(L334,Tabella_prezzi!$A$1:$L$189,3,FALSE)","v":"Opz10Gigabit BaseT"},{"$f":"VLOOKUP(L334,Tabella_prezzi!$A$1:$L$189,4,FALSE)","v":147.52000000000001},null,"L7N09",{"$f":"VLOOKUP(L334,Tabella_prezzi!$A$1:$L$189,6,FALSE)","v":"TS4L7-BaseT-LP"}]
["[TS3L7-NVME1600] Dell 1.6TB, NVMe, Mixed Use Express Flash, HHHL",null,null,{"$f":"VLOOKUP(L335,Tabella_prezzi!$A$1:$L$189,8,FALSE)","v":"1.6TB SSD SAS ISE MU 12Gbp"},null,"540-BBCX",1,{"$f":"VLOOKUP(L335,Tabella_prezzi!$A$1:$L$189,9,FALSE)","v":"1.6TB SSD SAS ISE MU 12Gbps 512e 2.5in Hot-Plug PM6 3 DWPD"},{"$f":"VLOOKUP(L335,Tabella_prezzi!$A$1:$L$189,3,FALSE)","v":"OpzSSD-MU1,6TB"},{"$f":"VLOOKUP(L335,Tabella_prezzi!$A$1:$L$189,4,FALSE)","v":473.08},null,"L7N17",{"$f":"VLOOKUP(L335,Tabella_prezzi!$A$1:$L$189,6,FALSE)","v":"TS4L7-SSD-MU1,6TB"}]
["[TS3L7-NVME800] Dell 1.6TB, NVMe, Mixed Use Express Flash, HHHL",null,null,{"$f":"VLOOKUP(L336,Tabella_prezzi!$A$1:$L$189,8,FALSE)","v":"960GB SSD SAS ISE RI 12Gbps"},null,"540-BBCX",1,{"$f":"VLOOKUP(L336,Tabella_prezzi!$A$1:$L$189,9,FALSE)","v":"960GB SSD SAS ISE RI 12Gbps 512e 2.5in Hot-Plug 1 DWPD"},{"$f":"VLOOKUP(L336,Tabella_prezzi!$A$1:$L$189,3,FALSE)","v":"OpzSSD-RI800GB"},{"$f":"VLOOKUP(L336,Tabella_prezzi!$A$1:$L$189,4,FALSE)","v":283.68},null,"L7N18",{"$f":"VLOOKUP(L336,Tabella_prezzi!$A$1:$L$189,6,FALSE)","v":"TS4L7-SSD-RI800GB"}]
["-=-=-=-=-=-=-=-=-=-=-=-=-=-=-=-=-20%-=-=-=-=-=-=-=-=-=-=-=-=-=-=-=-=-",null,null,null,null,null,{"$f":"\"\"","v":""},null,{"$f":"\"\"","v":""},null,null,{"$f":"\"\"","v":""},{"$f":"\"\"","v":""}]
["[TS3L7-BOSS480] BOSS controller card, full height, with 2 480G M.2 Drives",null,null,{"$f":"VLOOKUP(L338,Tabella_prezzi!$A$1:$L$189,8,FALSE)","v":"BOSS controller card, full height, with 2 480G M.2 Drives"},null,null,1,null,{"$f":"VLOOKUP(L338,Tabella_prezzi!$A$1:$L$189,3,FALSE)","v":0},null,{"$f":"VLOOKUP(L338,Tabella_prezzi!$A$1:$L$189,4,FALSE)","v":748},"L7N33",{"$f":"VLOOKUP(L338,Tabella_prezzi!$A$1:$L$189,6,FALSE)","v":"TS4L7-BOSS480"}]
["[TS3L7-SAS12] SAS 12Gbps HBA External Controller, Full Height",null,null,{"$f":"VLOOKUP(L339,Tabella_prezzi!$A$1:$L$189,8,FALSE)","v":"SAS 12Gbps HBA External Controller, Full Height"},null,null,1,{"$f":"VLOOKUP(L339,Tabella_prezzi!$A$1:$L$189,9,FALSE)","v":"SAS 12Gbps HBA External Controller, Full Height"},{"$f":"VLOOKUP(L339,Tabella_prezzi!$A$1:$L$189,3,FALSE)","v":0},null,{"$f":"VLOOKUP(L339,Tabella_prezzi!$A$1:$L$189,4,FALSE)","v":92},"L7N101",{"$f":"VLOOKUP(L339,Tabella_prezzi!$A$1:$L$189,6,FALSE)","v":"TS4L7-SAS12"}]
["[TS3L7-H840] PERC H840 RAID Adapter for External MD14XX Only, 8GB NV Cache",null,null,{"$f":"VLOOKUP(L340,Tabella_prezzi!$A$1:$L$189,8,FALSE)","v":"PERC H840 RAID Adapter for External MD14XX Only, 8GB NV Cache, Full Height"},null,null,1,null,{"$f":"VLOOKUP(L340,Tabella_prezzi!$A$1:$L$189,3,FALSE)","v":"OpzH840"},null,{"$f":"VLOOKUP(L340,Tabella_prezzi!$A$1:$L$189,4,FALSE)","v":479},"L7N71",{"$f":"VLOOKUP(L340,Tabella_prezzi!$A$1:$L$189,6,FALSE)","v":"TS4L7-H840"}]
["[TS3L7-57416] Broadcom 57416 Dual Port 10Gb, Base-T, PCIe Adapter",null,null,{"$f":"VLOOKUP(L341,Tabella_prezzi!$A$1:$L$189,8,FALSE)","v":"Broadcom 57416 Dual Port 10Gb, Base-T, PCIe Adapter, Full Height"},null,null,1,null,{"$f":"VLOOKUP(L341,Tabella_prezzi!$A$1:$L$189,3,FALSE)","v":0},null,{"$f":"VLOOKUP(L341,Tabella_prezzi!$A$1:$L$189,4,FALSE)","v":334},"L7N46",{"$f":"VLOOKUP(L341,Tabella_prezzi!$A$1:$L$189,6,FALSE)","v":"TS4L7-57416"}]
["[TS3L7-GPUA2] NVIDIA Ampere A2, PCIe, 60W, 16GB Passive, Single Wide, Full Height GPU",null,null,{"$f":"VLOOKUP(L342,Tabella_prezzi!$A$1:$L$189,8,FALSE)","v":"NVIDIA Ampere A2, PCIe, 60W, 16GB Passive, Single Wide, Full Height GPU"},null,null,1,null,{"$f":"VLOOKUP(L342,Tabella_prezzi!$A$1:$L$189,3,FALSE)","v":0},null,{"$f":"VLOOKUP(L342,Tabella_prezzi!$A$1:$L$189,4,FALSE)","v":1269},"L7N132",{"$f":"VLOOKUP(L342,Tabella_prezzi!$A$1:$L$189,6,FALSE)","v":"TS4L7-GPUA2"}]
["[TS3L7-X710DP] Intel X710 Dual Port 10Gb Direct Attach, SFP+,PCIe",null,null,{"$f":"VLOOKUP(L343,Tabella_prezzi!$A$1:$L$189,8,FALSE)","v":"Intel X710 Dual Port 10Gb SFP+ FULL"},null,null,1,null,{"$f":"VLOOKUP(L343,Tabella_prezzi!$A$1:$L$189,3,FALSE)","v":0},null,{"$f":"VLOOKUP(L343,Tabella_prezzi!$A$1:$L$189,4,FALSE)","v":342},"L7N42",{"$f":"VLOOKUP(L343,Tabella_prezzi!$A$1:$L$189,6,FALSE)","v":"TS4L7-X710DP"}]
["[TS3L7-X710QP] Intel X710 Quad Port 10Gb Direct Attach, SFP+, PCIe",null,null,{"$f":"VLOOKUP(L344,Tabella_prezzi!$A$1:$L$189,8,FALSE)","v":"Intel X710 Quad Port 10Gb SFP+ FULL"},null,null,1,null,{"$f":"VLOOKUP(L344,Tabella_prezzi!$A$1:$L$189,3,FALSE)","v":0},null,{"$f":"VLOOKUP(L344,Tabella_prezzi!$A$1:$L$189,4,FALSE)","v":518},"L7N43",{"$f":"VLOOKUP(L344,Tabella_prezzi!$A$1:$L$189,6,FALSE)","v":"TS4L7-X710QP"}]
["[TS3L7-MCX4DP] Mellanox ConnectX-4 Lx Dual Port 25GbE SFP28 FL 2 x SFP28 SR Optic, 25GbE",null,"TS3L7-MCX4DP","Mellanox ConnectX-4 Lx Dual Port 25GbE SFP28 Network Adapter, PCIe Full Height, 2 x SFP28 SR Optic, 25GbE",null,null,1,{"$f":"VLOOKUP(L345,Tabella_prezzi!$A$1:$L$189,9,FALSE)","v":"Mellanox ConnectX-4 Lx Dual Port 25GbE SFP28 Network Adapter, PCIe Full Height, 2 x SFP28 SR Optic, 25GbE"},{"$f":"VLOOKUP(L345,Tabella_prezzi!$A$1:$L$189,3,FALSE)","v":0},null,{"$f":"VLOOKUP(L345,Tabella_prezzi!$A$1:$L$189,4,FALSE)","v":419},"L7N94",{"$f":"VLOOKUP(L345,Tabella_prezzi!$A$1:$L$189,6,FALSE)","v":"TS4L7-MCX4DP"}]
["[TS3L7-CONX6DP] Mellanox ConnectX-6 DX Dual Port 100GbE QFSFP56 Network Adapter",null,null,{"$f":"VLOOKUP(L346,Tabella_prezzi!$A$1:$L$189,8,FALSE)","v":"Mellanox ConnectX-6 DX Dual Port 100GbE QFSFP56 FULL"},null,null,1,{"$f":"VLOOKUP(L346,Tabella_prezzi!$A$1:$L$189,9,FALSE)","v":"Mellanox ConnectX-6 DX Dual Port 100GbE QFSFP56 FULL"},{"$f":"VLOOKUP(L346,Tabella_prezzi!$A$1:$L$189,3,FALSE)","v":0},null,{"$f":"VLOOKUP(L346,Tabella_prezzi!$A$1:$L$189,4,FALSE)","v":812},"L7N40",{"$f":"VLOOKUP(L346,Tabella_prezzi!$A$1:$L$189,6,FALSE)","v":"TS4L7-CONX6DP"}]
["[TS3L7-CONX6SP] Mellanox ConnectX-6 Single Port HDR100 QSFP56 Infiniband Adapter",null,null,{"$f":"VLOOKUP(L347,Tabella_prezzi!$A$1:$L$189,8,FALSE)","v":"Mellanox ConnectX-6 Single Port HDR100 QSFP56 Infiniband FULL"},null,null,1,{"$f":"VLOOKUP(L347,Tabella_prezzi!$A$1:$L$189,9,FALSE)","v":"Mellanox ConnectX-6 Single Port HDR100 QSFP56 Infiniband FULL"},{"$f":"VLOOKUP(L347,Tabella_prezzi!$A$1:$L$189,3,FALSE)","v":0},null,{"$f":"VLOOKUP(L347,Tabella_prezzi!$A$1:$L$189,4,FALSE)","v":720},"L7N39",{"$f":"VLOOKUP(L347,Tabella_prezzi!$A$1:$L$189,6,FALSE)","v":"TS4L7-CONX6SP"}]
["[TS3L7-TESLAT4] NVIDIA TeslaT4 16GB GPU",null,null,{"$f":"VLOOKUP(L348,Tabella_prezzi!$A$1:$L$189,8,FALSE)","v":"NVIDIA TeslaT4 16GB GPU"},null,null,1,{"$f":"VLOOKUP(L348,Tabella_prezzi!$A$1:$L$189,9,FALSE)","v":"NVIDIA TeslaT4 16GB GPU"},{"$f":"VLOOKUP(L348,Tabella_prezzi!$A$1:$L$189,3,FALSE)","v":"OpzGPUT4"},null,{"$f":"VLOOKUP(L348,Tabella_prezzi!$A$1:$L$189,4,FALSE)","v":2450},"L7N55",{"$f":"VLOOKUP(L348,Tabella_prezzi!$A$1:$L$189,6,FALSE)","v":"TS4L7-TESLAT4"}]
[]
["TS3L2_PCI_H"]
[{"$f":"\"\"","v":""},null,null,null,null,null,{"$f":"\"\"","v":""},null,{"$f":"\"\"","v":""},null,null,{"$f":"\"\"","v":""},{"$f":"\"\"","v":""}]
["[TS3L7-LAN1] Broadcom 5719 Quad Port 1Gb Network Interface Card,",null,null,{"$f":"VLOOKUP(L352,Tabella_prezzi!$A$1:$L$189,8,FALSE)","v":"Broadcom 5719 Quad Port 1Gb Network Interface Card, Low Profile "},null,"540-BBCX",1,{"$f":"VLOOKUP(L352,Tabella_prezzi!$A$1:$L$189,9,FALSE)","v":"Broadcom 5719 Quad Port 1Gb Network Interface Card, Low Profile "},{"$f":"VLOOKUP(L352,Tabella_prezzi!$A$1:$L$189,3,FALSE)","v":"OpzGigabit"},{"$f":"VLOOKUP(L352,Tabella_prezzi!$A$1:$L$189,4,FALSE)","v":29.18},null,"L7N05",{"$f":"VLOOKUP(L352,Tabella_prezzi!$A$1:$L$189,6,FALSE)","v":"TS4L7-LAN1"}]
["[TS3L7-LAN10] Broadcom 57412 Dual Port 10Gb, SFP+, PCIe Adapter",null,null,{"$f":"VLOOKUP(L353,Tabella_prezzi!$A$1:$L$189,8,FALSE)","v":"Broadcom 57412 Dual Port 10Gb, SFP+, PCIe Adapter, Low Profile + Optics"},null,"540-BBCX",1,{"$f":"VLOOKUP(L353,Tabella_prezzi!$A$1:$L$189,9,FALSE)","v":"Broadcom 57412 Dual Port 10Gb, SFP+, PCIe Adapter, Low Profile + Optics"},{"$f":"VLOOKUP(L353,Tabella_prezzi!$A$1:$L$189,3,FALSE)","v":"OpzGigabit10Gbps"},{"$f":"VLOOKUP(L353,Tabella_prezzi!$A$1:$L$189,4,FALSE)","v":160.47999999999999},null,"L7N06",{"$f":"VLOOKUP(L353,Tabella_prezzi!$A$1:$L$189,6,FALSE)","v":"TS4L7-LAN10"}]
["[TS3L7-LAN25] QLogic 41262 Dual Port 25Gb SFP28 Adapter",null,null,{"$f":"VLOOKUP(L354,Tabella_prezzi!$A$1:$L$189,8,FALSE)","v":"Intel Ethernet XXV710 Dual Port 10/25GbE SFP28 Adapter, PCIe Low Profile + Optics"},null,"540-BBCX",1,{"$f":"VLOOKUP(L354,Tabella_prezzi!$A$1:$L$189,9,FALSE)","v":"Intel Ethernet XXV710 Dual Port 10/25GbE SFP28 Adapter, PCIe Low Profile + Optics"},{"$f":"VLOOKUP(L354,Tabella_prezzi!$A$1:$L$189,3,FALSE)","v":"OpzGigabit25Gbps"},{"$f":"VLOOKUP(L354,Tabella_prezzi!$A$1:$L$189,4,FALSE)","v":249.64},null,"L7N07",{"$f":"VLOOKUP(L354,Tabella_prezzi!$A$1:$L$189,6,FALSE)","v":"TS4L7-LAN25"}]
["[TS3L7CNA10] QLogic 41112 Dual Port 10Gb SFP+ Adapter",null,null,{"$f":"VLOOKUP(L355,Tabella_prezzi!$A$1:$L$189,8,FALSE)","v":"QLogic FastLinQ 41262 Dual Port 25Gb SFP28 Adapter, Low Profile + Optics"},null,"540-BBCX",1,{"$f":"VLOOKUP(L355,Tabella_prezzi!$A$1:$L$189,9,FALSE)","v":"QLogic FastLinQ 41262 Dual Port 25Gb SFP28 Adapter, Low Profile + Optics"},{"$f":"VLOOKUP(L355,Tabella_prezzi!$A$1:$L$189,3,FALSE)","v":"OpzGigabit10Gbps CNA"},{"$f":"VLOOKUP(L355,Tabella_prezzi!$A$1:$L$189,4,FALSE)","v":153.19},null,"L7N08",{"$f":"VLOOKUP(L355,Tabella_prezzi!$A$1:$L$189,6,FALSE)","v":"TS4L7-CNA10"}]
["[TS3L7-FC16] Qlogic 2692 Dual Port 16Gb Fibre Channel HBA",null,null,{"$f":"VLOOKUP(L356,Tabella_prezzi!$A$1:$L$189,8,FALSE)","v":"Intel X710-T2L Dual Port 10GbE BASE-T Adapter, PCIe LP"},null,"540-BBCX",1,{"$f":"VLOOKUP(L356,Tabella_prezzi!$A$1:$L$189,9,FALSE)","v":"Intel X710-T2L Dual Port 10GbE BASE-T Adapter, PCIe LP"},{"$f":"VLOOKUP(L356,Tabella_prezzi!$A$1:$L$189,3,FALSE)","v":"Opz10Gigabit BaseT"},{"$f":"VLOOKUP(L356,Tabella_prezzi!$A$1:$L$189,4,FALSE)","v":147.52000000000001},null,"L7N09",{"$f":"VLOOKUP(L356,Tabella_prezzi!$A$1:$L$189,6,FALSE)","v":"TS4L7-BaseT-LP"}]
["[TS3L7-NVME1600] Dell 1.6TB, NVMe, Mixed Use Express Flash, HHHL",null,null,{"$f":"VLOOKUP(L357,Tabella_prezzi!$A$1:$L$189,8,FALSE)","v":"1.6TB SSD SAS ISE MU 12Gbp"},null,"540-BBCX",1,{"$f":"VLOOKUP(L357,Tabella_prezzi!$A$1:$L$189,9,FALSE)","v":"1.6TB SSD SAS ISE MU 12Gbps 512e 2.5in Hot-Plug PM6 3 DWPD"},{"$f":"VLOOKUP(L357,Tabella_prezzi!$A$1:$L$189,3,FALSE)","v":"OpzSSD-MU1,6TB"},{"$f":"VLOOKUP(L357,Tabella_prezzi!$A$1:$L$189,4,FALSE)","v":473.08},null,"L7N17",{"$f":"VLOOKUP(L357,Tabella_prezzi!$A$1:$L$189,6,FALSE)","v":"TS4L7-SSD-MU1,6TB"}]
["[TS3L7-NVME800] Dell 1.6TB, NVMe, Mixed Use Express Flash, HHHL",null,null,{"$f":"VLOOKUP(L358,Tabella_prezzi!$A$1:$L$189,8,FALSE)","v":"960GB SSD SAS ISE RI 12Gbps"},null,"540-BBCX",1,{"$f":"VLOOKUP(L358,Tabella_prezzi!$A$1:$L$189,9,FALSE)","v":"960GB SSD SAS ISE RI 12Gbps 512e 2.5in Hot-Plug 1 DWPD"},{"$f":"VLOOKUP(L358,Tabella_prezzi!$A$1:$L$189,3,FALSE)","v":"OpzSSD-RI800GB"},{"$f":"VLOOKUP(L358,Tabella_prezzi!$A$1:$L$189,4,FALSE)","v":283.68},null,"L7N18",{"$f":"VLOOKUP(L358,Tabella_prezzi!$A$1:$L$189,6,FALSE)","v":"TS4L7-SSD-RI800GB"}]
["-=-=-=-=-=-=-=-=-=-=-=-=-=-=-=-=-20%-=-=-=-=-=-=-=-=-=-=-=-=-=-=-=-=-",null,null,null,null,null,{"$f":"\"\"","v":""},null,{"$f":"\"\"","v":""},null,null,{"$f":"\"\"","v":""},{"$f":"\"\"","v":""}]
["[TS3L7-BOSS480] BOSS controller card, full height, with 2 480G M.2 Drives",null,null,{"$f":"VLOOKUP(L360,Tabella_prezzi!$A$1:$L$189,8,FALSE)","v":"BOSS controller card, full height, with 2 480G M.2 Drives"},null,null,1,null,{"$f":"VLOOKUP(L360,Tabella_prezzi!$A$1:$L$189,3,FALSE)","v":0},null,{"$f":"VLOOKUP(L360,Tabella_prezzi!$A$1:$L$189,4,FALSE)","v":748},"L7N33",{"$f":"VLOOKUP(L360,Tabella_prezzi!$A$1:$L$189,6,FALSE)","v":"TS4L7-BOSS480"}]
["[TS3L7-SAS12] SAS 12Gbps HBA External Controller, Full Height",null,null,{"$f":"VLOOKUP(L361,Tabella_prezzi!$A$1:$L$189,8,FALSE)","v":"SAS 12Gbps HBA External Controller, Full Height"},null,null,1,{"$f":"VLOOKUP(L361,Tabella_prezzi!$A$1:$L$189,9,FALSE)","v":"SAS 12Gbps HBA External Controller, Full Height"},{"$f":"VLOOKUP(L361,Tabella_prezzi!$A$1:$L$189,3,FALSE)","v":0},null,{"$f":"VLOOKUP(L361,Tabella_prezzi!$A$1:$L$189,4,FALSE)","v":92},"L7N101",{"$f":"VLOOKUP(L361,Tabella_prezzi!$A$1:$L$189,6,FALSE)","v":"TS4L7-SAS12"}]
["[TS3L7-H840] PERC H840 RAID Adapter for External MD14XX Only, 8GB NV Cache",null,null,{"$f":"VLOOKUP(L362,Tabella_prezzi!$A$1:$L$189,8,FALSE)","v":"PERC H840 RAID Adapter for External MD14XX Only, 8GB NV Cache, Full Height"},null,null,1,null,{"$f":"VLOOKUP(L362,Tabella_prezzi!$A$1:$L$189,3,FALSE)","v":"OpzH840"},null,{"$f":"VLOOKUP(L362,Tabella_prezzi!$A$1:$L$189,4,FALSE)","v":479},"L7N71",{"$f":"VLOOKUP(L362,Tabella_prezzi!$A$1:$L$189,6,FALSE)","v":"TS4L7-H840"}]
["[TS3L7-57416] Broadcom 57416 Dual Port 10Gb, Base-T, PCIe Adapter",null,null,{"$f":"VLOOKUP(L363,Tabella_prezzi!$A$1:$L$189,8,FALSE)","v":"Broadcom 57416 Dual Port 10Gb, Base-T, PCIe Adapter, Full Height"},null,null,1,null,{"$f":"VLOOKUP(L363,Tabella_prezzi!$A$1:$L$189,3,FALSE)","v":0},null,{"$f":"VLOOKUP(L363,Tabella_prezzi!$A$1:$L$189,4,FALSE)","v":334},"L7N46",{"$f":"VLOOKUP(L363,Tabella_prezzi!$A$1:$L$189,6,FALSE)","v":"TS4L7-57416"}]
["[TS3L7-GPUA2] NVIDIA Ampere A2, PCIe, 60W, 16GB Passive, Single Wide, Full Height GPU",null,null,{"$f":"VLOOKUP(L364,Tabella_prezzi!$A$1:$L$189,8,FALSE)","v":"NVIDIA Ampere A2, PCIe, 60W, 16GB Passive, Single Wide, Full Height GPU"},null,null,1,null,{"$f":"VLOOKUP(L364,Tabella_prezzi!$A$1:$L$189,3,FALSE)","v":0},null,{"$f":"VLOOKUP(L364,Tabella_prezzi!$A$1:$L$189,4,FALSE)","v":1269},"L7N132",{"$f":"VLOOKUP(L364,Tabella_prezzi!$A$1:$L$189,6,FALSE)","v":"TS4L7-GPUA2"}]
["[TS3L7-X710DP] Intel X710 Dual Port 10Gb Direct Attach, SFP+,PCIe",null,null,{"$f":"VLOOKUP(L365,Tabella_prezzi!$A$1:$L$189,8,FALSE)","v":"Intel X710 Dual Port 10Gb SFP+ FULL"},null,null,1,null,{"$f":"VLOOKUP(L365,Tabella_prezzi!$A$1:$L$189,3,FALSE)","v":0},null,{"$f":"VLOOKUP(L365,Tabella_prezzi!$A$1:$L$189,4,FALSE)","v":342},"L7N42",{"$f":"VLOOKUP(L365,Tabella_prezzi!$A$1:$L$189,6,FALSE)","v":"TS4L7-X710DP"}]
["[TS3L7-X710QP] Intel X710 Quad Port 10Gb Direct Attach, SFP+, PCIe",null,null,{"$f":"VLOOKUP(L366,Tabella_prezzi!$A$1:$L$189,8,FALSE)","v":"Intel X710 Quad Port 10Gb SFP+ FULL"},null,null,1,null,{"$f":"VLOOKUP(L366,Tabella_prezzi!$A$1:$L$189,3,FALSE)","v":0},null,{"$f":"VLOOKUP(L366,Tabella_prezzi!$A$1:$L$189,4,FALSE)","v":518},"L7N43",{"$f":"VLOOKUP(L366,Tabella_prezzi!$A$1:$L$189,6,FALSE)","v":"TS4L7-X710QP"}]
["[TS3L7-CONX6DP] Mellanox ConnectX-6 DX Dual Port 100GbE QFSFP56 Network Adapter",null,null,{"$f":"VLOOKUP(L367,Tabella_prezzi!$A$1:$L$189,8,FALSE)","v":"Mellanox ConnectX-6 DX Dual Port 100GbE QFSFP56 FULL"},null,null,1,{"$f":"VLOOKUP(L367,Tabella_prezzi!$A$1:$L$189,9,FALSE)","v":"Mellanox ConnectX-6 DX Dual Port 100GbE QFSFP56 FULL"},{"$f":"VLOOKUP(L367,Tabella_prezzi!$A$1:$L$189,3,FALSE)","v":0},null,{"$f":"VLOOKUP(L367,Tabella_prezzi!$A$1:$L$189,4,FALSE)","v":812},"L7N40",{"$f":"VLOOKUP(L367,Tabella_prezzi!$A$1:$L$189,6,FALSE)","v":"TS4L7-CONX6DP"}]
["[TS3L7-MCX4DP] Mellanox ConnectX-4 Lx Dual Port 25GbE SFP28 FL 2 x SFP28 SR Optic, 25GbE",null,"TS3L7-MCX4DP","Mellanox ConnectX-4 Lx Dual Port 25GbE SFP28 Network Adapter, PCIe Full Height, 2 x SFP28 SR Optic, 25GbE",null,null,1,{"$f":"VLOOKUP(L368,Tabella_prezzi!$A$1:$L$189,9,FALSE)","v":"Mellanox ConnectX-4 Lx Dual Port 25GbE SFP28 Network Adapter, PCIe Full Height, 2 x SFP28 SR Optic, 25GbE"},{"$f":"VLOOKUP(L368,Tabella_prezzi!$A$1:$L$189,3,FALSE)","v":0},null,{"$f":"VLOOKUP(L368,Tabella_prezzi!$A$1:$L$189,4,FALSE)","v":419},"L7N94",{"$f":"VLOOKUP(L368,Tabella_prezzi!$A$1:$L$189,6,FALSE)","v":"TS4L7-MCX4DP"}]
["[TS3L7-TESLAT4] NVIDIA TeslaT4 16GB GPU",null,null,{"$f":"VLOOKUP(L369,Tabella_prezzi!$A$1:$L$189,8,FALSE)","v":"NVIDIA TeslaT4 16GB GPU"},null,null,1,{"$f":"VLOOKUP(L369,Tabella_prezzi!$A$1:$L$189,9,FALSE)","v":"NVIDIA TeslaT4 16GB GPU"},{"$f":"VLOOKUP(L369,Tabella_prezzi!$A$1:$L$189,3,FALSE)","v":"OpzGPUT4"},null,{"$f":"VLOOKUP(L369,Tabella_prezzi!$A$1:$L$189,4,FALSE)","v":2450},"L7N55",{"$f":"VLOOKUP(L369,Tabella_prezzi!$A$1:$L$189,6,FALSE)","v":"TS4L7-TESLAT4"}]
[]
["TS3L2_PCI_I"]
[{"$f":"\"\"","v":""},null,null,null,null,null,{"$f":"\"\"","v":""},null,{"$f":"\"\"","v":""},null,null,{"$f":"\"\"","v":""},{"$f":"\"\"","v":""}]
[]
["TS3L2_PCI_L"]
[{"$f":"\"\"","v":""},null,null,null,null,null,{"$f":"\"\"","v":""},null,{"$f":"\"\"","v":""},null,null,{"$f":"\"\"","v":""},{"$f":"\"\"","v":""}]
["[TS3L7-LAN1] Broadcom 5719 Quad Port 1Gb Network Interface Card,",null,null,{"$f":"VLOOKUP(L376,Tabella_prezzi!$A$1:$L$189,8,FALSE)","v":"Broadcom 5719 Quad Port 1Gb Network Interface Card, Low Profile "},null,"540-BBCX",1,{"$f":"VLOOKUP(L376,Tabella_prezzi!$A$1:$L$189,9,FALSE)","v":"Broadcom 5719 Quad Port 1Gb Network Interface Card, Low Profile "},{"$f":"VLOOKUP(L376,Tabella_prezzi!$A$1:$L$189,3,FALSE)","v":"OpzGigabit"},{"$f":"VLOOKUP(L376,Tabella_prezzi!$A$1:$L$189,4,FALSE)","v":29.18},null,"L7N05",{"$f":"VLOOKUP(L376,Tabella_prezzi!$A$1:$L$189,6,FALSE)","v":"TS4L7-LAN1"}]
["[TS3L7-LAN10] Broadcom 57412 Dual Port 10Gb, SFP+, PCIe Adapter",null,null,{"$f":"VLOOKUP(L377,Tabella_prezzi!$A$1:$L$189,8,FALSE)","v":"Broadcom 57412 Dual Port 10Gb, SFP+, PCIe Adapter, Low Profile + Optics"},null,"540-BBCX",1,{"$f":"VLOOKUP(L377,Tabella_prezzi!$A$1:$L$189,9,FALSE)","v":"Broadcom 57412 Dual Port 10Gb, SFP+, PCIe Adapter, Low Profile + Optics"},{"$f":"VLOOKUP(L377,Tabella_prezzi!$A$1:$L$189,3,FALSE)","v":"OpzGigabit10Gbps"},{"$f":"VLOOKUP(L377,Tabella_prezzi!$A$1:$L$189,4,FALSE)","v":160.47999999999999},null,"L7N06",{"$f":"VLOOKUP(L377,Tabella_prezzi!$A$1:$L$189,6,FALSE)","v":"TS4L7-LAN10"}]
["[TS3L7-LAN25] QLogic 41262 Dual Port 25Gb SFP28 Adapter",null,null,{"$f":"VLOOKUP(L378,Tabella_prezzi!$A$1:$L$189,8,FALSE)","v":"Intel Ethernet XXV710 Dual Port 10/25GbE SFP28 Adapter, PCIe Low Profile + Optics"},null,"540-BBCX",1,{"$f":"VLOOKUP(L378,Tabella_prezzi!$A$1:$L$189,9,FALSE)","v":"Intel Ethernet XXV710 Dual Port 10/25GbE SFP28 Adapter, PCIe Low Profile + Optics"},{"$f":"VLOOKUP(L378,Tabella_prezzi!$A$1:$L$189,3,FALSE)","v":"OpzGigabit25Gbps"},{"$f":"VLOOKUP(L378,Tabella_prezzi!$A$1:$L$189,4,FALSE)","v":249.64},null,"L7N07",{"$f":"VLOOKUP(L378,Tabella_prezzi!$A$1:$L$189,6,FALSE)","v":"TS4L7-LAN25"}]
["[TS3L7CNA10] QLogic 41112 Dual Port 10Gb SFP+ Adapter",null,null,{"$f":"VLOOKUP(L379,Tabella_prezzi!$A$1:$L$189,8,FALSE)","v":"QLogic FastLinQ 41262 Dual Port 25Gb SFP28 Adapter, Low Profile + Optics"},null,"540-BBCX",1,{"$f":"VLOOKUP(L379,Tabella_prezzi!$A$1:$L$189,9,FALSE)","v":"QLogic FastLinQ 41262 Dual Port 25Gb SFP28 Adapter, Low Profile + Optics"},{"$f":"VLOOKUP(L379,Tabella_prezzi!$A$1:$L$189,3,FALSE)","v":"OpzGigabit10Gbps CNA"},{"$f":"VLOOKUP(L379,Tabella_prezzi!$A$1:$L$189,4,FALSE)","v":153.19},null,"L7N08",{"$f":"VLOOKUP(L379,Tabella_prezzi!$A$1:$L$189,6,FALSE)","v":"TS4L7-CNA10"}]
["[TS3L7-FC16] Qlogic 2692 Dual Port 16Gb Fibre Channel HBA",null,null,{"$f":"VLOOKUP(L380,Tabella_prezzi!$A$1:$L$189,8,FALSE)","v":"Intel X710-T2L Dual Port 10GbE BASE-T Adapter, PCIe LP"},null,"540-BBCX",1,{"$f":"VLOOKUP(L380,Tabella_prezzi!$A$1:$L$189,9,FALSE)","v":"Intel X710-T2L Dual Port 10GbE BASE-T Adapter, PCIe LP"},{"$f":"VLOOKUP(L380,Tabella_prezzi!$A$1:$L$189,3,FALSE)","v":"Opz10Gigabit BaseT"},{"$f":"VLOOKUP(L380,Tabella_prezzi!$A$1:$L$189,4,FALSE)","v":147.52000000000001},null,"L7N09",{"$f":"VLOOKUP(L380,Tabella_prezzi!$A$1:$L$189,6,FALSE)","v":"TS4L7-BaseT-LP"}]
["[TS3L7-NVME1600] Dell 1.6TB, NVMe, Mixed Use Express Flash, HHHL",null,null,{"$f":"VLOOKUP(L381,Tabella_prezzi!$A$1:$L$189,8,FALSE)","v":"1.6TB SSD SAS ISE MU 12Gbp"},null,"540-BBCX",1,{"$f":"VLOOKUP(L381,Tabella_prezzi!$A$1:$L$189,9,FALSE)","v":"1.6TB SSD SAS ISE MU 12Gbps 512e 2.5in Hot-Plug PM6 3 DWPD"},{"$f":"VLOOKUP(L381,Tabella_prezzi!$A$1:$L$189,3,FALSE)","v":"OpzSSD-MU1,6TB"},{"$f":"VLOOKUP(L381,Tabella_prezzi!$A$1:$L$189,4,FALSE)","v":473.08},null,"L7N17",{"$f":"VLOOKUP(L381,Tabella_prezzi!$A$1:$L$189,6,FALSE)","v":"TS4L7-SSD-MU1,6TB"}]
["[TS3L7-NVME800] Dell 1.6TB, NVMe, Mixed Use Express Flash, HHHL",null,null,{"$f":"VLOOKUP(L382,Tabella_prezzi!$A$1:$L$189,8,FALSE)","v":"960GB SSD SAS ISE RI 12Gbps"},null,"540-BBCX",1,{"$f":"VLOOKUP(L382,Tabella_prezzi!$A$1:$L$189,9,FALSE)","v":"960GB SSD SAS ISE RI 12Gbps 512e 2.5in Hot-Plug 1 DWPD"},{"$f":"VLOOKUP(L382,Tabella_prezzi!$A$1:$L$189,3,FALSE)","v":"OpzSSD-RI800GB"},{"$f":"VLOOKUP(L382,Tabella_prezzi!$A$1:$L$189,4,FALSE)","v":283.68},null,"L7N18",{"$f":"VLOOKUP(L382,Tabella_prezzi!$A$1:$L$189,6,FALSE)","v":"TS4L7-SSD-RI800GB"}]
["-=-=-=-=-=-=-=-=-=-=-=-=-=-=-=-=-20%-=-=-=-=-=-=-=-=-=-=-=-=-=-=-=-=-",null,null,null,null,null,{"$f":"\"\"","v":""},null,{"$f":"\"\"","v":""},null,null,{"$f":"\"\"","v":""},{"$f":"\"\"","v":""}]
["[TS3L7-BOSS480] BOSS controller card, full height, with 2 480G M.2 Drives",null,null,{"$f":"VLOOKUP(L384,Tabella_prezzi!$A$1:$L$189,8,FALSE)","v":"BOSS controller card, full height, with 2 480G M.2 Drives"},null,null,1,null,{"$f":"VLOOKUP(L384,Tabella_prezzi!$A$1:$L$189,3,FALSE)","v":0},null,{"$f":"VLOOKUP(L384,Tabella_prezzi!$A$1:$L$189,4,FALSE)","v":748},"L7N33",{"$f":"VLOOKUP(L384,Tabella_prezzi!$A$1:$L$189,6,FALSE)","v":"TS4L7-BOSS480"}]
["[TS3L7-SAS12] SAS 12Gbps HBA External Controller, Full Height",null,null,{"$f":"VLOOKUP(L385,Tabella_prezzi!$A$1:$L$189,8,FALSE)","v":"SAS 12Gbps HBA External Controller, Full Height"},null,null,1,{"$f":"VLOOKUP(L385,Tabella_prezzi!$A$1:$L$189,9,FALSE)","v":"SAS 12Gbps HBA External Controller, Full Height"},{"$f":"VLOOKUP(L385,Tabella_prezzi!$A$1:$L$189,3,FALSE)","v":0},null,{"$f":"VLOOKUP(L385,Tabella_prezzi!$A$1:$L$189,4,FALSE)","v":92},"L7N101",{"$f":"VLOOKUP(L385,Tabella_prezzi!$A$1:$L$189,6,FALSE)","v":"TS4L7-SAS12"}]
["[TS3L7-H840] PERC H840 RAID Adapter for External MD14XX Only, 8GB NV Cache",null,null,{"$f":"VLOOKUP(L386,Tabella_prezzi!$A$1:$L$189,8,FALSE)","v":"PERC H840 RAID Adapter for External MD14XX Only, 8GB NV Cache, Full Height"},null,null,1,null,{"$f":"VLOOKUP(L386,Tabella_prezzi!$A$1:$L$189,3,FALSE)","v":"OpzH840"},null,{"$f":"VLOOKUP(L386,Tabella_prezzi!$A$1:$L$189,4,FALSE)","v":479},"L7N71",{"$f":"VLOOKUP(L386,Tabella_prezzi!$A$1:$L$189,6,FALSE)","v":"TS4L7-H840"}]
["[TS3L7-57416] Broadcom 57416 Dual Port 10Gb, Base-T, PCIe Adapter",null,null,{"$f":"VLOOKUP(L387,Tabella_prezzi!$A$1:$L$189,8,FALSE)","v":"Broadcom 57416 Dual Port 10Gb, Base-T, PCIe Adapter, Full Height"},null,null,1,null,{"$f":"VLOOKUP(L387,Tabella_prezzi!$A$1:$L$189,3,FALSE)","v":0},null,{"$f":"VLOOKUP(L387,Tabella_prezzi!$A$1:$L$189,4,FALSE)","v":334},"L7N46",{"$f":"VLOOKUP(L387,Tabella_prezzi!$A$1:$L$189,6,FALSE)","v":"TS4L7-57416"}]
["[TS3L7-GPUA2] NVIDIA Ampere A2, PCIe, 60W, 16GB Passive, Single Wide, Full Height GPU",null,null,{"$f":"VLOOKUP(L388,Tabella_prezzi!$A$1:$L$189,8,FALSE)","v":"NVIDIA Ampere A2, PCIe, 60W, 16GB Passive, Single Wide, Full Height GPU"},null,null,1,null,{"$f":"VLOOKUP(L388,Tabella_prezzi!$A$1:$L$189,3,FALSE)","v":0},null,{"$f":"VLOOKUP(L388,Tabella_prezzi!$A$1:$L$189,4,FALSE)","v":1269},"L7N132",{"$f":"VLOOKUP(L388,Tabella_prezzi!$A$1:$L$189,6,FALSE)","v":"TS4L7-GPUA2"}]
["[TS3L7-X710DP] Intel X710 Dual Port 10Gb Direct Attach, SFP+,PCIe",null,null,{"$f":"VLOOKUP(L389,Tabella_prezzi!$A$1:$L$189,8,FALSE)","v":"Intel X710 Dual Port 10Gb SFP+ FULL"},null,null,1,null,{"$f":"VLOOKUP(L389,Tabella_prezzi!$A$1:$L$189,3,FALSE)","v":0},null,{"$f":"VLOOKUP(L389,Tabella_prezzi!$A$1:$L$189,4,FALSE)","v":342},"L7N42",{"$f":"VLOOKUP(L389,Tabella_prezzi!$A$1:$L$189,6,FALSE)","v":"TS4L7-X710DP"}]
["[TS3L7-X710QP] Intel X710 Quad Port 10Gb Direct Attach, SFP+, PCIe",null,null,{"$f":"VLOOKUP(L390,Tabella_prezzi!$A$1:$L$189,8,FALSE)","v":"Intel X710 Quad Port 10Gb SFP+ FULL"},null,null,1,null,{"$f":"VLOOKUP(L390,Tabella_prezzi!$A$1:$L$189,3,FALSE)","v":0},null,{"$f":"VLOOKUP(L390,Tabella_prezzi!$A$1:$L$189,4,FALSE)","v":518},"L7N43",{"$f":"VLOOKUP(L390,Tabella_prezzi!$A$1:$L$189,6,FALSE)","v":"TS4L7-X710QP"}]
["[TS3L7-MCX4DP] Mellanox ConnectX-4 Lx Dual Port 25GbE SFP28 FL 2 x SFP28 SR Optic, 25GbE",null,"TS3L7-MCX4DP","Mellanox ConnectX-4 Lx Dual Port 25GbE SFP28 Network Adapter, PCIe Full Height, 2 x SFP28 SR Optic, 25GbE",null,null,1,{"$f":"VLOOKUP(L391,Tabella_prezzi!$A$1:$L$189,9,FALSE)","v":"Mellanox ConnectX-4 Lx Dual Port 25GbE SFP28 Network Adapter, PCIe Full Height, 2 x SFP28 SR Optic, 25GbE"},{"$f":"VLOOKUP(L391,Tabella_prezzi!$A$1:$L$189,3,FALSE)","v":0},null,{"$f":"VLOOKUP(L391,Tabella_prezzi!$A$1:$L$189,4,FALSE)","v":419},"L7N94",{"$f":"VLOOKUP(L391,Tabella_prezzi!$A$1:$L$189,6,FALSE)","v":"TS4L7-MCX4DP"}]
["[TS3L7-TESLAT4] NVIDIA TeslaT4 16GB GPU",null,null,{"$f":"VLOOKUP(L392,Tabella_prezzi!$A$1:$L$189,8,FALSE)","v":"NVIDIA TeslaT4 16GB GPU"},null,null,1,{"$f":"VLOOKUP(L392,Tabella_prezzi!$A$1:$L$189,9,FALSE)","v":"NVIDIA TeslaT4 16GB GPU"},{"$f":"VLOOKUP(L392,Tabella_prezzi!$A$1:$L$189,3,FALSE)","v":"OpzGPUT4"},null,{"$f":"VLOOKUP(L392,Tabella_prezzi!$A$1:$L$189,4,FALSE)","v":2450},"L7N55",{"$f":"VLOOKUP(L392,Tabella_prezzi!$A$1:$L$189,6,FALSE)","v":"TS4L7-TESLAT4"}]
[]
[]
["BUNDLE PMEUPS3RTSER Comprensivo di UPS e scheda SNMP + Kit Rack incluso",null,null,{"$f":"VLOOKUP(L395,Tabella_prezzi!$A$1:$L$189,9,FALSE)","v":"800GB SSD SAS ISE Mix Use 12Gbps 512e 2.5in Hot-plug, 3 DWPD"},null,null,1,{"$f":"VLOOKUP(L395,Tabella_prezzi!$A$1:$L$189,9,FALSE)","v":"800GB SSD SAS ISE Mix Use 12Gbps 512e 2.5in Hot-plug, 3 DWPD"},{"$f":"VLOOKUP(L395,Tabella_prezzi!$A$1:$L$189,3,FALSE)","v":"OpzSSD-MU800GB"},{"$f":"VLOOKUP(L395,Tabella_prezzi!$A$1:$L$189,4,FALSE)","v":295.02999999999997},null,"L7N19",{"$f":"VLOOKUP(L395,Tabella_prezzi!$A$1:$L$189,6,FALSE)","v":"TS4L7-SSD-MU800GB"}]
["Unità KVM - monitor 17\", cavo combi PS2 e USB da 1,8mt, tastiera ita, touch pad",null,null,{"$f":"VLOOKUP(L396,Tabella_prezzi!$A$1:$L$189,9,FALSE)","v":"Dispositivo UPS di tipo On-line doppia conversione, strutturato per il montaggio a rack da 19”"},null,null,1,{"$f":"VLOOKUP(L396,Tabella_prezzi!$A$1:$L$189,9,FALSE)","v":"Dispositivo UPS di tipo On-line doppia conversione, strutturato per il montaggio a rack da 19”"},{"$f":"VLOOKUP(L396,Tabella_prezzi!$A$1:$L$189,3,FALSE)","v":"OpzUps (3000VA)"},{"$f":"VLOOKUP(L396,Tabella_prezzi!$A$1:$L$189,4,FALSE)","v":386.02},null,"L7N20",{"$f":"VLOOKUP(L396,Tabella_prezzi!$A$1:$L$189,6,FALSE)","v":"TS4L7-UPS"}]
["Switch 16 porte IP con relativi cavi combi PS/2 e USB inclusi",null,null,{"$f":"VLOOKUP(L397,Tabella_prezzi!$A$1:$L$189,9,FALSE)","v":"Unità KVM - monitor 17\", cavo combi PS/2&USB da 1,8mt, tastiera italiana, touch pad"},null,null,1,{"$f":"VLOOKUP(L397,Tabella_prezzi!$A$1:$L$189,9,FALSE)","v":"Unità KVM - monitor 17\", cavo combi PS/2&USB da 1,8mt, tastiera italiana, touch pad"},{"$f":"VLOOKUP(L397,Tabella_prezzi!$A$1:$L$189,3,FALSE)","v":"OpzGUI"},{"$f":"VLOOKUP(L397,Tabella_prezzi!$A$1:$L$189,4,FALSE)","v":491.62},null,"L7N21",{"$f":"VLOOKUP(L397,Tabella_prezzi!$A$1:$L$189,6,FALSE)","v":"TS4L7-GUI"}]
["1-pack of Windows Server 2019/2016 Device CALs (STD or DC)",null,null,{"$f":"VLOOKUP(L398,Tabella_prezzi!$A$1:$L$189,9,FALSE)","v":"Windows Server 2022,Standard,ROK,16CORE"},null,null,1,{"$f":"VLOOKUP(L398,Tabella_prezzi!$A$1:$L$189,9,FALSE)","v":"Windows Server 2022,Standard,ROK,16CORE"},{"$f":"VLOOKUP(L398,Tabella_prezzi!$A$1:$L$189,3,FALSE)","v":"OpzWinServSTD"},{"$f":"VLOOKUP(L398,Tabella_prezzi!$A$1:$L$189,4,FALSE)","v":816.77},null,"L7N23",{"$f":"VLOOKUP(L398,Tabella_prezzi!$A$1:$L$189,6,FALSE)","v":"TS4L7-WINSRVSTD"}]
["1-pack of Windows Server 2019/2016 User CALs (STD or DC)",null,null,{"$f":"VLOOKUP(L399,Tabella_prezzi!$A$1:$L$189,9,FALSE)","v":"1-pack of Windows Server 2022/2019 Device CALs (STD or DC)"},null,null,1,{"$f":"VLOOKUP(L399,Tabella_prezzi!$A$1:$L$189,9,FALSE)","v":"1-pack of Windows Server 2022/2019 Device CALs (STD or DC)"},{"$f":"VLOOKUP(L399,Tabella_prezzi!$A$1:$L$189,3,FALSE)","v":"OpzDeviceCal"},{"$f":"VLOOKUP(L399,Tabella_prezzi!$A$1:$L$189,4,FALSE)","v":27.23},null,"L7N24",{"$f":"VLOOKUP(L399,Tabella_prezzi!$A$1:$L$189,6,FALSE)","v":"TS4L7-WINDEVCAL"}]
["Armadio Rack 42U",null,null,{"$f":"VLOOKUP(L400,Tabella_prezzi!$A$1:$L$189,9,FALSE)","v":"Estensione della manutenzione GPU in garanzia per ulteriori 24 mesi"},null,null,1,{"$f":"VLOOKUP(L400,Tabella_prezzi!$A$1:$L$189,9,FALSE)","v":"Estensione della manutenzione GPU in garanzia per ulteriori 24 mesi"},{"$f":"VLOOKUP(L400,Tabella_prezzi!$A$1:$L$189,3,FALSE)","v":"OpzEstensione24-GPU"},{"$f":"VLOOKUP(L400,Tabella_prezzi!$A$1:$L$189,4,FALSE)","v":115.54},null,"L7N31",{"$f":"VLOOKUP(L400,Tabella_prezzi!$A$1:$L$189,6,FALSE)","v":"TS4L7-OpzEst24GPU"}]
["VMware vSphere 7 Standard Acceleration Kit OEM for 6 CPU, 3YR License and Maintenance",null,null,{"$f":"VLOOKUP(L401,Tabella_prezzi!$A$1:$L$189,9,FALSE)","v":"VMware vSphere 7 Standard Acceleration Kit OEM for 6 CPU, 3YR License and Maintenance"},null,null,2,{"$f":"VLOOKUP(L401,Tabella_prezzi!$A$1:$L$189,9,FALSE)","v":"VMware vSphere 7 Standard Acceleration Kit OEM for 6 CPU, 3YR License and Maintenance"},{"$f":"VLOOKUP(L401,Tabella_prezzi!$A$1:$L$189,3,FALSE)","v":0},null,{"$f":"VLOOKUP(L401,Tabella_prezzi!$A$1:$L$189,4,FALSE)","v":16549},"L7N72",{"$f":"VLOOKUP(L401,Tabella_prezzi!$A$1:$L$189,6,FALSE)","v":"TS4L7-VS7STD6AK"}]
["VMware vSphere 7 Standard OEM, 1 CPU (max 32 cores/CPU socket), 3YR License and Maintenance",null,null,{"$f":"VLOOKUP(L402,Tabella_prezzi!$A$1:$L$189,9,FALSE)","v":"VMware vSphere 7 Standard OEM, 1 CPU (max 32 cores/CPU socket), 3YR License and Maintenance"},null,null,3,{"$f":"VLOOKUP(L402,Tabella_prezzi!$A$1:$L$189,9,FALSE)","v":"VMware vSphere 7 Standard OEM, 1 CPU (max 32 cores/CPU socket), 3YR License and Maintenance"},{"$f":"VLOOKUP(L402,Tabella_prezzi!$A$1:$L$189,3,FALSE)","v":0},null,{"$f":"VLOOKUP(L402,Tabella_prezzi!$A$1:$L$189,4,FALSE)","v":1557},"L7N73",{"$f":"VLOOKUP(L402,Tabella_prezzi!$A$1:$L$189,6,FALSE)","v":"TS4L7-VS7STD"}]
["VMware vSphere 7 Enterprise Plus Acceleration Kit OEM for 6 CPU, 3YR License and Maintenance",null,null,{"$f":"VLOOKUP(L403,Tabella_prezzi!$A$1:$L$189,9,FALSE)","v":"VMware vSphere 7 Enterprise Plus Acceleration Kit OEM for 6 CPU, 3YR License and Maintenance"},null,null,4,{"$f":"VLOOKUP(L403,Tabella_prezzi!$A$1:$L$189,9,FALSE)","v":"VMware vSphere 7 Enterprise Plus Acceleration Kit OEM for 6 CPU, 3YR License and Maintenance"},{"$f":"VLOOKUP(L403,Tabella_prezzi!$A$1:$L$189,3,FALSE)","v":0},null,{"$f":"VLOOKUP(L403,Tabella_prezzi!$A$1:$L$189,4,FALSE)","v":34860},"L7N74",{"$f":"VLOOKUP(L403,Tabella_prezzi!$A$1:$L$189,6,FALSE)","v":"TS4L7-VS7EPL6AK"}]
["VMware vSphere 7 Enterprise Plus OEM, 1 CPU (max 32 cores/CPU socket), 3YR License and Maintenance",null,null,{"$f":"VLOOKUP(L404,Tabella_prezzi!$A$1:$L$189,9,FALSE)","v":"VMware vSphere 7 Enterprise Plus OEM, 1 CPU (max 32 cores/CPU socket), 3YR License and Maintenance"},null,null,5,{"$f":"VLOOKUP(L404,Tabella_prezzi!$A$1:$L$189,9,FALSE)","v":"VMware vSphere 7 Enterprise Plus OEM, 1 CPU (max 32 cores/CPU socket), 3YR License and Maintenance"},{"$f":"VLOOKUP(L404,Tabella_prezzi!$A$1:$L$189,3,FALSE)","v":0},null,{"$f":"VLOOKUP(L404,Tabella_prezzi!$A$1:$L$189,4,FALSE)","v":4576},"L7N80",{"$f":"VLOOKUP(L404,Tabella_prezzi!$A$1:$L$189,6,FALSE)","v":"TS4L7-VS7EPL"}]
["VMware vCenter 7 Standard OEM ,Per Instance,3YR License and Maintenance",null,null,{"$f":"VLOOKUP(L405,Tabella_prezzi!$A$1:$L$189,9,FALSE)","v":"VMware vCenter 7 Standard OEM ,Per Instance,3YR License and Maintenance"},null,null,6,{"$f":"VLOOKUP(L405,Tabella_prezzi!$A$1:$L$189,9,FALSE)","v":"VMware vCenter 7 Standard OEM ,Per Instance,3YR License and Maintenance"},{"$f":"VLOOKUP(L405,Tabella_prezzi!$A$1:$L$189,3,FALSE)","v":0},null,{"$f":"VLOOKUP(L405,Tabella_prezzi!$A$1:$L$189,4,FALSE)","v":7860},"L7N81",{"$f":"VLOOKUP(L405,Tabella_prezzi!$A$1:$L$189,6,FALSE)","v":"TS4L7-VCS7STD"}]
["VMware vSAN 7 Enterprise OEM, 1 CPU (max 32 cores/CPU socket), 3YR License and Maintenance",null,null,{"$f":"VLOOKUP(L406,Tabella_prezzi!$A$1:$L$189,9,FALSE)","v":"VMware vSAN 7 Enterprise OEM, 1 CPU (max 32 cores/CPU socket), 3YR License and Maintenance"},null,null,7,{"$f":"VLOOKUP(L406,Tabella_prezzi!$A$1:$L$189,9,FALSE)","v":"VMware vSAN 7 Enterprise OEM, 1 CPU (max 32 cores/CPU socket), 3YR License and Maintenance"},{"$f":"VLOOKUP(L406,Tabella_prezzi!$A$1:$L$189,3,FALSE)","v":0},null,{"$f":"VLOOKUP(L406,Tabella_prezzi!$A$1:$L$189,4,FALSE)","v":7196},"L7N82",{"$f":"VLOOKUP(L406,Tabella_prezzi!$A$1:$L$189,6,FALSE)","v":"TS4L7-ST7ENT"}]
["VMware Horizon 8 Advanced OEM,10 Pack,CCU, 3YR License and Maintenance",null,null,{"$f":"VLOOKUP(L407,Tabella_prezzi!$A$1:$L$189,9,FALSE)","v":"VMware Horizon 8 Advanced OEM,10 Pack,CCU, 3YR License and Maintenance"},null,null,8,{"$f":"VLOOKUP(L407,Tabella_prezzi!$A$1:$L$189,9,FALSE)","v":"VMware Horizon 8 Advanced OEM,10 Pack,CCU, 3YR License and Maintenance"},{"$f":"VLOOKUP(L407,Tabella_prezzi!$A$1:$L$189,3,FALSE)","v":0},null,{"$f":"VLOOKUP(L407,Tabella_prezzi!$A$1:$L$189,4,FALSE)","v":5028},"L7N83",{"$f":"VLOOKUP(L407,Tabella_prezzi!$A$1:$L$189,6,FALSE)","v":"TS4L7-HZ8ADC10"}]
["VMware Horizon 8 Enterprise OEM,10 Pack,CCU, 3YR License and Maintenance",null,null,{"$f":"VLOOKUP(L408,Tabella_prezzi!$A$1:$L$189,9,FALSE)","v":"VMware Horizon 8 Enterprise OEM,10 Pack,CCU, 3YR License and Maintenance"},null,null,9,{"$f":"VLOOKUP(L408,Tabella_prezzi!$A$1:$L$189,9,FALSE)","v":"VMware Horizon 8 Enterprise OEM,10 Pack,CCU, 3YR License and Maintenance"},{"$f":"VLOOKUP(L408,Tabella_prezzi!$A$1:$L$189,3,FALSE)","v":0},null,{"$f":"VLOOKUP(L408,Tabella_prezzi!$A$1:$L$189,4,FALSE)","v":7116},"L7N84",{"$f":"VLOOKUP(L408,Tabella_prezzi!$A$1:$L$189,6,FALSE)","v":"TS4L7-HZ8ENC10"}]
["VMware Horizon Advanced OEM, 10 Pack, Named User, 3YR License and Maintenance",null,null,{"$f":"VLOOKUP(L409,Tabella_prezzi!$A$1:$L$189,9,FALSE)","v":"VMware Horizon Advanced OEM, 10 Pack, Named User, 3YR License and Maintenance"},null,null,10,{"$f":"VLOOKUP(L409,Tabella_prezzi!$A$1:$L$189,9,FALSE)","v":"VMware Horizon Advanced OEM, 10 Pack, Named User, 3YR License and Maintenance"},{"$f":"VLOOKUP(L409,Tabella_prezzi!$A$1:$L$189,3,FALSE)","v":0},null,{"$f":"VLOOKUP(L409,Tabella_prezzi!$A$1:$L$189,4,FALSE)","v":3089},"L7N85",{"$f":"VLOOKUP(L409,Tabella_prezzi!$A$1:$L$189,6,FALSE)","v":"TS4L7-HZ8ADN10"}]
["VMware Horizon 8 Enterprise OEM,10 Pack, Named User, 3YR License and Maintenance",null,null,{"$f":"VLOOKUP(L410,Tabella_prezzi!$A$1:$L$189,9,FALSE)","v":"VMware Horizon 8 Enterprise OEM,10 Pack, Named User, 3YR License and Maintenance"},null,null,11,{"$f":"VLOOKUP(L410,Tabella_prezzi!$A$1:$L$189,9,FALSE)","v":"VMware Horizon 8 Enterprise OEM,10 Pack, Named User, 3YR License and Maintenance"},{"$f":"VLOOKUP(L410,Tabella_prezzi!$A$1:$L$189,3,FALSE)","v":0},null,{"$f":"VLOOKUP(L410,Tabella_prezzi!$A$1:$L$189,4,FALSE)","v":4398},"L7N86",{"$f":"VLOOKUP(L410,Tabella_prezzi!$A$1:$L$189,6,FALSE)","v":"TS4L7-HZ8ENN10"}]
["Enclosure SAS 12 Slot 3.5\", 3YR ProSupport and 4hr Mission Critical",null,null,{"$f":"VLOOKUP(L411,Tabella_prezzi!$A$1:$L$189,9,FALSE)","v":"Enclosure SAS 12 Slot 3.5\", 3YR ProSupport and 4hr Mission Critical"},null,null,12,{"$f":"VLOOKUP(L411,Tabella_prezzi!$A$1:$L$189,9,FALSE)","v":"Enclosure SAS 12 Slot 3.5\", 3YR ProSupport and 4hr Mission Critical"},{"$f":"VLOOKUP(L411,Tabella_prezzi!$A$1:$L$189,3,FALSE)","v":0},null,{"$f":"VLOOKUP(L411,Tabella_prezzi!$A$1:$L$189,4,FALSE)","v":2727},"L7N87",{"$f":"VLOOKUP(L411,Tabella_prezzi!$A$1:$L$189,6,FALSE)","v":"TS4L7-Encl13Y4H"}]
["Enclosure SAS 12 Slot 3.5\", 5YR ProSupport and 4hr Mission Critical",null,null,{"$f":"VLOOKUP(L412,Tabella_prezzi!$A$1:$L$189,9,FALSE)","v":"Enclosure SAS 12 Slot 3.5\", 5YR ProSupport and 4hr Mission Critical"},null,null,13,{"$f":"VLOOKUP(L412,Tabella_prezzi!$A$1:$L$189,9,FALSE)","v":"Enclosure SAS 12 Slot 3.5\", 5YR ProSupport and 4hr Mission Critical"},{"$f":"VLOOKUP(L412,Tabella_prezzi!$A$1:$L$189,3,FALSE)","v":0},null,{"$f":"VLOOKUP(L412,Tabella_prezzi!$A$1:$L$189,4,FALSE)","v":2827},"L7N88",{"$f":"VLOOKUP(L412,Tabella_prezzi!$A$1:$L$189,6,FALSE)","v":"TS4L7-Encl25Y4H"}]
["Enclosure SAS 12 Slot 2.5\", 3YR ProSupport and 4hr Mission Critical",null,null,{"$f":"VLOOKUP(L413,Tabella_prezzi!$A$1:$L$189,9,FALSE)","v":"Enclosure SAS 24 Slot 2.5\", 3YR ProSupport and 4hr Mission Critical"},null,null,12,{"$f":"VLOOKUP(L413,Tabella_prezzi!$A$1:$L$189,9,FALSE)","v":"Enclosure SAS 24 Slot 2.5\", 3YR ProSupport and 4hr Mission Critical"},{"$f":"VLOOKUP(L413,Tabella_prezzi!$A$1:$L$189,3,FALSE)","v":0},null,{"$f":"VLOOKUP(L413,Tabella_prezzi!$A$1:$L$189,4,FALSE)","v":3027},"L7N98",{"$f":"VLOOKUP(L413,Tabella_prezzi!$A$1:$L$189,6,FALSE)","v":"TS4L7-Encl33Y4H"}]
["Enclosure SAS 12 Slot 2.5\", 5YR ProSupport and 4hr Mission Critical",null,null,{"$f":"VLOOKUP(L414,Tabella_prezzi!$A$1:$L$189,9,FALSE)","v":"Enclosure SAS 24 Slot 2.5\", 5YR ProSupport and 4hr Mission Critical"},null,null,13,{"$f":"VLOOKUP(L414,Tabella_prezzi!$A$1:$L$189,9,FALSE)","v":"Enclosure SAS 24 Slot 2.5\", 5YR ProSupport and 4hr Mission Critical"},{"$f":"VLOOKUP(L414,Tabella_prezzi!$A$1:$L$189,3,FALSE)","v":0},null,{"$f":"VLOOKUP(L414,Tabella_prezzi!$A$1:$L$189,4,FALSE)","v":3327},"L7N99",{"$f":"VLOOKUP(L414,Tabella_prezzi!$A$1:$L$189,6,FALSE)","v":"TS4L7-EncL75Y4H"}]
["HDD 16TB SAS 12Gbps 7k 3.5in Hot-Plug per Enclosure 3.5\"",null,null,{"$f":"VLOOKUP(L415,Tabella_prezzi!$A$1:$L$189,9,FALSE)","v":"HDD 16TB SAS 12Gbps 7k 3.5in Hot-Plug per Enclosure 3.5\""},null,null,13,{"$f":"VLOOKUP(L415,Tabella_prezzi!$A$1:$L$189,9,FALSE)","v":"HDD 16TB SAS 12Gbps 7k 3.5in Hot-Plug per Enclosure 3.5\""},{"$f":"VLOOKUP(L415,Tabella_prezzi!$A$1:$L$189,3,FALSE)","v":0},null,{"$f":"VLOOKUP(L415,Tabella_prezzi!$A$1:$L$189,4,FALSE)","v":494},"L7N103",{"$f":"VLOOKUP(L415,Tabella_prezzi!$A$1:$L$189,6,FALSE)","v":"TS4L7-ED16TB"}]
["HDD 12TB SAS 12Gbps 7k 3.5in Hot-Plug per Enclosure 3.5\"",null,null,{"$f":"VLOOKUP(L416,Tabella_prezzi!$A$1:$L$189,9,FALSE)","v":"HDD 12TB SAS 12Gbps 7k 3.5in Hot-Plug per Enclosure 3.5\""},null,null,13,{"$f":"VLOOKUP(L416,Tabella_prezzi!$A$1:$L$189,9,FALSE)","v":"HDD 12TB SAS 12Gbps 7k 3.5in Hot-Plug per Enclosure 3.5\""},{"$f":"VLOOKUP(L416,Tabella_prezzi!$A$1:$L$189,3,FALSE)","v":0},null,{"$f":"VLOOKUP(L416,Tabella_prezzi!$A$1:$L$189,4,FALSE)","v":443},"L7N104",{"$f":"VLOOKUP(L416,Tabella_prezzi!$A$1:$L$189,6,FALSE)","v":"TS4L7-ED12TB"}]
["HDD 8TB SAS 12Gbps 7k 3.5in Hot-Plug per Enclosure 3.5\"",null,null,{"$f":"VLOOKUP(L417,Tabella_prezzi!$A$1:$L$189,8,FALSE)","v":"Kit upgrade chassies for 2 CPU"},null,null,13,{"$f":"VLOOKUP(L417,Tabella_prezzi!$A$1:$L$189,9,FALSE)","v":"Kit upgrade chassies for 2 CPU"},{"$f":"VLOOKUP(L417,Tabella_prezzi!$A$1:$L$189,3,FALSE)","v":0},null,{"$f":"VLOOKUP(L417,Tabella_prezzi!$A$1:$L$189,4,FALSE)","v":0},"L7N105",{"$f":"VLOOKUP(L417,Tabella_prezzi!$A$1:$L$189,6,FALSE)","v":"TS4L7_2cpuChassis"}]
["HDD 2400GB 10K SAS 12Gbps 2.5in Hot-plug per Enclosure 2.5\"",null,null,{"$f":"VLOOKUP(L418,Tabella_prezzi!$A$1:$L$189,8,FALSE)","v":"HDD 2400GB 10K SAS 12Gbps 2.5in Hot-plug per Enclosure 2.5\""},null,null,13,{"$f":"VLOOKUP(L418,Tabella_prezzi!$A$1:$L$189,9,FALSE)","v":"HDD 2400GB 10K SAS 12Gbps 2.5in Hot-plug per Enclosure 2.5\""},{"$f":"VLOOKUP(L418,Tabella_prezzi!$A$1:$L$189,3,FALSE)","v":0},null,{"$f":"VLOOKUP(L418,Tabella_prezzi!$A$1:$L$189,4,FALSE)","v":226},"L7N106",{"$f":"VLOOKUP(L418,Tabella_prezzi!$A$1:$L$189,6,FALSE)","v":"TS4L7-ED2TB"}]
["SSD 960GB SAS RI 12Gbps 2.5in Hot-plug, 1 DWPD per Enclosure 2.5\"",null,null,{"$f":"VLOOKUP(L419,Tabella_prezzi!$A$1:$L$189,8,FALSE)","v":"SSD 960GB SAS RI 12Gbps 2.5in Hot-plug, 1 DWPD per Enclosure 2.5\""},null,null,13,{"$f":"VLOOKUP(L419,Tabella_prezzi!$A$1:$L$189,9,FALSE)","v":"SSD 960GB SAS RI 12Gbps 2.5in Hot-plug, 1 DWPD per Enclosure 2.5\""},{"$f":"VLOOKUP(L419,Tabella_prezzi!$A$1:$L$189,3,FALSE)","v":0},null,{"$f":"VLOOKUP(L419,Tabella_prezzi!$A$1:$L$189,4,FALSE)","v":727},"L7N107",{"$f":"VLOOKUP(L419,Tabella_prezzi!$A$1:$L$189,6,FALSE)","v":"TS4L2-EDRI800"}]
["NVIDIA"]
["NVIDIA vApps Subscription License 1 Year, 1 CCU",null,null,{"$f":"VLOOKUP(L721,Tabella_prezzi!$A$1:$L$189,8,FALSE)","v":{"$error":"#N/A"}},null,null,13,{"$f":"VLOOKUP(L721,Tabella_prezzi!$A$1:$L$189,9,FALSE)","v":{"$error":"#N/A"}},{"$f":"VLOOKUP(L721,Tabella_prezzi!$A$1:$L$189,3,FALSE)","v":{"$error":"#N/A"}},null,{"$f":"VLOOKUP(L721,Tabella_prezzi!$A$1:$L$189,4,FALSE)","v":{"$error":"#N/A"}},"L7N110",{"$f":"VLOOKUP(L721,Tabella_prezzi!$A$1:$L$189,6,FALSE)","v":{"$error":"#N/A"}}]
["NVIDIA vApps Subscription License 3 Years, 1 CCU",null,null,{"$f":"VLOOKUP(L722,Tabella_prezzi!$A$1:$L$189,8,FALSE)","v":{"$error":"#N/A"}},null,null,13,{"$f":"VLOOKUP(L722,Tabella_prezzi!$A$1:$L$189,9,FALSE)","v":{"$error":"#N/A"}},{"$f":"VLOOKUP(L722,Tabella_prezzi!$A$1:$L$189,3,FALSE)","v":{"$error":"#N/A"}},null,{"$f":"VLOOKUP(L722,Tabella_prezzi!$A$1:$L$189,4,FALSE)","v":{"$error":"#N/A"}},"L7N111",{"$f":"VLOOKUP(L722,Tabella_prezzi!$A$1:$L$189,6,FALSE)","v":{"$error":"#N/A"}}]
["NVIDIA vApps Subscription License 5 Years, 1 CCU",null,null,{"$f":"VLOOKUP(L723,Tabella_prezzi!$A$1:$L$189,8,FALSE)","v":{"$error":"#N/A"}},null,null,13,{"$f":"VLOOKUP(L723,Tabella_prezzi!$A$1:$L$189,9,FALSE)","v":{"$error":"#N/A"}},{"$f":"VLOOKUP(L723,Tabella_prezzi!$A$1:$L$189,3,FALSE)","v":{"$error":"#N/A"}},null,{"$f":"VLOOKUP(L723,Tabella_prezzi!$A$1:$L$189,4,FALSE)","v":{"$error":"#N/A"}},"L7N112",{"$f":"VLOOKUP(L723,Tabella_prezzi!$A$1:$L$189,6,FALSE)","v":{"$error":"#N/A"}}]
["NVIDIA vPC Subscription License 1 Year, 1 CCU",null,null,{"$f":"VLOOKUP(L724,Tabella_prezzi!$A$1:$L$189,8,FALSE)","v":{"$error":"#N/A"}},null,null,13,{"$f":"VLOOKUP(L724,Tabella_prezzi!$A$1:$L$189,9,FALSE)","v":{"$error":"#N/A"}},{"$f":"VLOOKUP(L724,Tabella_prezzi!$A$1:$L$189,3,FALSE)","v":{"$error":"#N/A"}},null,{"$f":"VLOOKUP(L724,Tabella_prezzi!$A$1:$L$189,4,FALSE)","v":{"$error":"#N/A"}},"L7N113",{"$f":"VLOOKUP(L724,Tabella_prezzi!$A$1:$L$189,6,FALSE)","v":{"$error":"#N/A"}}]
["NVIDIA vPC Subscription License 3 Years, 1 CCU",null,null,{"$f":"VLOOKUP(L725,Tabella_prezzi!$A$1:$L$189,8,FALSE)","v":{"$error":"#N/A"}},null,null,13,{"$f":"VLOOKUP(L725,Tabella_prezzi!$A$1:$L$189,9,FALSE)","v":{"$error":"#N/A"}},{"$f":"VLOOKUP(L725,Tabella_prezzi!$A$1:$L$189,3,FALSE)","v":{"$error":"#N/A"}},null,{"$f":"VLOOKUP(L725,Tabella_prezzi!$A$1:$L$189,4,FALSE)","v":{"$error":"#N/A"}},"L7N114",{"$f":"VLOOKUP(L725,Tabella_prezzi!$A$1:$L$189,6,FALSE)","v":{"$error":"#N/A"}}]
["NVIDIA vPC Subscription License 5 Years, 1 CCU",null,null,{"$f":"VLOOKUP(L726,Tabella_prezzi!$A$1:$L$189,8,FALSE)","v":{"$error":"#N/A"}},null,null,13,{"$f":"VLOOKUP(L726,Tabella_prezzi!$A$1:$L$189,9,FALSE)","v":{"$error":"#N/A"}},{"$f":"VLOOKUP(L726,Tabella_prezzi!$A$1:$L$189,3,FALSE)","v":{"$error":"#N/A"}},null,{"$f":"VLOOKUP(L726,Tabella_prezzi!$A$1:$L$189,4,FALSE)","v":{"$error":"#N/A"}},"L7N115",{"$f":"VLOOKUP(L726,Tabella_prezzi!$A$1:$L$189,6,FALSE)","v":{"$error":"#N/A"}}]
["NVIDIA RTX vWS Subscription License 1 Year, 1 CCU",null,null,{"$f":"VLOOKUP(L727,Tabella_prezzi!$A$1:$L$189,8,FALSE)","v":{"$error":"#N/A"}},null,null,13,{"$f":"VLOOKUP(L727,Tabella_prezzi!$A$1:$L$189,9,FALSE)","v":{"$error":"#N/A"}},{"$f":"VLOOKUP(L727,Tabella_prezzi!$A$1:$L$189,3,FALSE)","v":{"$error":"#N/A"}},null,{"$f":"VLOOKUP(L727,Tabella_prezzi!$A$1:$L$189,4,FALSE)","v":{"$error":"#N/A"}},"L7N116",{"$f":"VLOOKUP(L727,Tabella_prezzi!$A$1:$L$189,6,FALSE)","v":{"$error":"#N/A"}}]
["NVIDIA RTX vWS Subscription License 3 Years, 1 CCU",null,null,{"$f":"VLOOKUP(L728,Tabella_prezzi!$A$1:$L$189,8,FALSE)","v":{"$error":"#N/A"}},null,null,13,{"$f":"VLOOKUP(L728,Tabella_prezzi!$A$1:$L$189,9,FALSE)","v":{"$error":"#N/A"}},{"$f":"VLOOKUP(L728,Tabella_prezzi!$A$1:$L$189,3,FALSE)","v":{"$error":"#N/A"}},null,{"$f":"VLOOKUP(L728,Tabella_prezzi!$A$1:$L$189,4,FALSE)","v":{"$error":"#N/A"}},"L7N117",{"$f":"VLOOKUP(L728,Tabella_prezzi!$A$1:$L$189,6,FALSE)","v":{"$error":"#N/A"}}]
["NVIDIA RTX vWS Subscription License 5 Years, 1 CCU",null,null,{"$f":"VLOOKUP(L729,Tabella_prezzi!$A$1:$L$189,8,FALSE)","v":{"$error":"#N/A"}},null,null,13,{"$f":"VLOOKUP(L729,Tabella_prezzi!$A$1:$L$189,9,FALSE)","v":{"$error":"#N/A"}},{"$f":"VLOOKUP(L729,Tabella_prezzi!$A$1:$L$189,3,FALSE)","v":{"$error":"#N/A"}},null,{"$f":"VLOOKUP(L729,Tabella_prezzi!$A$1:$L$189,4,FALSE)","v":{"$error":"#N/A"}},"L7N118",{"$f":"VLOOKUP(L729,Tabella_prezzi!$A$1:$L$189,6,FALSE)","v":{"$error":"#N/A"}}]
["NVIDIA Virtual Compute Server Subscription, 1 GPU (Max 8 CC VMs), 1 Year",null,null,{"$f":"VLOOKUP(L730,Tabella_prezzi!$A$1:$L$189,8,FALSE)","v":{"$error":"#N/A"}},null,null,13,{"$f":"VLOOKUP(L730,Tabella_prezzi!$A$1:$L$189,9,FALSE)","v":{"$error":"#N/A"}},{"$f":"VLOOKUP(L730,Tabella_prezzi!$A$1:$L$189,3,FALSE)","v":{"$error":"#N/A"}},null,{"$f":"VLOOKUP(L730,Tabella_prezzi!$A$1:$L$189,4,FALSE)","v":{"$error":"#N/A"}},"L7N119",{"$f":"VLOOKUP(L730,Tabella_prezzi!$A$1:$L$189,6,FALSE)","v":{"$error":"#N/A"}}]
["NVIDIA Virtual Compute Server Subscription, 1 GPU (Max 8 CC VMs), 3 Years",null,null,{"$f":"VLOOKUP(L731,Tabella_prezzi!$A$1:$L$189,8,FALSE)","v":{"$error":"#N/A"}},null,null,13,{"$f":"VLOOKUP(L731,Tabella_prezzi!$A$1:$L$189,9,FALSE)","v":{"$error":"#N/A"}},{"$f":"VLOOKUP(L731,Tabella_prezzi!$A$1:$L$189,3,FALSE)","v":{"$error":"#N/A"}},null,{"$f":"VLOOKUP(L731,Tabella_prezzi!$A$1:$L$189,4,FALSE)","v":{"$error":"#N/A"}},"L7N120",{"$f":"VLOOKUP(L731,Tabella_prezzi!$A$1:$L$189,6,FALSE)","v":{"$error":"#N/A"}}]
["NVIDIA Virtual Compute Server Subscription, 1 GPU (Max 8 CC VMs), 5 Years",null,null,{"$f":"VLOOKUP(L732,Tabella_prezzi!$A$1:$L$189,8,FALSE)","v":{"$error":"#N/A"}},null,null,13,{"$f":"VLOOKUP(L732,Tabella_prezzi!$A$1:$L$189,9,FALSE)","v":{"$error":"#N/A"}},{"$f":"VLOOKUP(L732,Tabella_prezzi!$A$1:$L$189,3,FALSE)","v":{"$error":"#N/A"}},null,{"$f":"VLOOKUP(L732,Tabella_prezzi!$A$1:$L$189,4,FALSE)","v":{"$error":"#N/A"}},"L7N121",{"$f":"VLOOKUP(L732,Tabella_prezzi!$A$1:$L$189,6,FALSE)","v":{"$error":"#N/A"}}]
["NVIDIA vApps Bundle Perpetual License Plus 4yr vApps SUMS, 1CCU",null,null,{"$f":"VLOOKUP(L733,Tabella_prezzi!$A$1:$L$189,8,FALSE)","v":{"$error":"#N/A"}},null,null,13,{"$f":"VLOOKUP(L733,Tabella_prezzi!$A$1:$L$189,9,FALSE)","v":{"$error":"#N/A"}},{"$f":"VLOOKUP(L733,Tabella_prezzi!$A$1:$L$189,3,FALSE)","v":{"$error":"#N/A"}},null,{"$f":"VLOOKUP(L733,Tabella_prezzi!$A$1:$L$189,4,FALSE)","v":{"$error":"#N/A"}},"L7N122",{"$f":"VLOOKUP(L733,Tabella_prezzi!$A$1:$L$189,6,FALSE)","v":{"$error":"#N/A"}}]
["NVIDIA vApps Bundle Perpetual License Plus 5yr vApps SUMS, 1CCU",null,null,{"$f":"VLOOKUP(L734,Tabella_prezzi!$A$1:$L$189,8,FALSE)","v":{"$error":"#N/A"}},null,null,13,{"$f":"VLOOKUP(L734,Tabella_prezzi!$A$1:$L$189,9,FALSE)","v":{"$error":"#N/A"}},{"$f":"VLOOKUP(L734,Tabella_prezzi!$A$1:$L$189,3,FALSE)","v":{"$error":"#N/A"}},null,{"$f":"VLOOKUP(L734,Tabella_prezzi!$A$1:$L$189,4,FALSE)","v":{"$error":"#N/A"}},"L7N123",{"$f":"VLOOKUP(L734,Tabella_prezzi!$A$1:$L$189,6,FALSE)","v":{"$error":"#N/A"}}]
["NVIDIA vPC Bundle Perpetual License Plus 4yr vPC SUMS, 1CCU",null,null,{"$f":"VLOOKUP(L735,Tabella_prezzi!$A$1:$L$189,8,FALSE)","v":{"$error":"#N/A"}},null,null,13,{"$f":"VLOOKUP(L735,Tabella_prezzi!$A$1:$L$189,9,FALSE)","v":{"$error":"#N/A"}},{"$f":"VLOOKUP(L735,Tabella_prezzi!$A$1:$L$189,3,FALSE)","v":{"$error":"#N/A"}},null,{"$f":"VLOOKUP(L735,Tabella_prezzi!$A$1:$L$189,4,FALSE)","v":{"$error":"#N/A"}},"L7N124",{"$f":"VLOOKUP(L735,Tabella_prezzi!$A$1:$L$189,6,FALSE)","v":{"$error":"#N/A"}}]
["NVIDIA vPC Bundle Perpetual License Plus 5yr vPC SUMS, 1CCU",null,null,{"$f":"VLOOKUP(L736,Tabella_prezzi!$A$1:$L$189,8,FALSE)","v":{"$error":"#N/A"}},null,null,13,{"$f":"VLOOKUP(L736,Tabella_prezzi!$A$1:$L$189,9,FALSE)","v":{"$error":"#N/A"}},{"$f":"VLOOKUP(L736,Tabella_prezzi!$A$1:$L$189,3,FALSE)","v":{"$error":"#N/A"}},null,{"$f":"VLOOKUP(L736,Tabella_prezzi!$A$1:$L$189,4,FALSE)","v":{"$error":"#N/A"}},"L7N125",{"$f":"VLOOKUP(L736,Tabella_prezzi!$A$1:$L$189,6,FALSE)","v":{"$error":"#N/A"}}]
["NVIDIA RTX vWS Bundle Perpetual License Plus 4yr RTX vWS SUMS, 1CCU",null,null,{"$f":"VLOOKUP(L737,Tabella_prezzi!$A$1:$L$189,8,FALSE)","v":{"$error":"#N/A"}},null,null,13,{"$f":"VLOOKUP(L737,Tabella_prezzi!$A$1:$L$189,9,FALSE)","v":{"$error":"#N/A"}},{"$f":"VLOOKUP(L737,Tabella_prezzi!$A$1:$L$189,3,FALSE)","v":{"$error":"#N/A"}},null,{"$f":"VLOOKUP(L737,Tabella_prezzi!$A$1:$L$189,4,FALSE)","v":{"$error":"#N/A"}},"L7N126",{"$f":"VLOOKUP(L737,Tabella_prezzi!$A$1:$L$189,6,FALSE)","v":{"$error":"#N/A"}}]
["NVIDIA RTX vWS Bundle Perpetual License Plus 5yr RTX vWS SUMS, 1CCU",null,null,{"$f":"VLOOKUP(L738,Tabella_prezzi!$A$1:$L$189,8,FALSE)","v":{"$error":"#N/A"}},null,null,13,{"$f":"VLOOKUP(L738,Tabella_prezzi!$A$1:$L$189,9,FALSE)","v":{"$error":"#N/A"}},{"$f":"VLOOKUP(L738,Tabella_prezzi!$A$1:$L$189,3,FALSE)","v":{"$error":"#N/A"}},null,{"$f":"VLOOKUP(L738,Tabella_prezzi!$A$1:$L$189,4,FALSE)","v":{"$error":"#N/A"}},"L7N127",{"$f":"VLOOKUP(L738,Tabella_prezzi!$A$1:$L$189,6,FALSE)","v":{"$error":"#N/A"}}]
["NVIDIA vPC to NVIDIA RTX vWS Upgrade 4 year SUMS Bundle",null,null,{"$f":"VLOOKUP(L739,Tabella_prezzi!$A$1:$L$189,8,FALSE)","v":{"$error":"#N/A"}},null,null,13,{"$f":"VLOOKUP(L739,Tabella_prezzi!$A$1:$L$189,9,FALSE)","v":{"$error":"#N/A"}},{"$f":"VLOOKUP(L739,Tabella_prezzi!$A$1:$L$189,3,FALSE)","v":{"$error":"#N/A"}},null,{"$f":"VLOOKUP(L739,Tabella_prezzi!$A$1:$L$189,4,FALSE)","v":{"$error":"#N/A"}},"L7N128",{"$f":"VLOOKUP(L739,Tabella_prezzi!$A$1:$L$189,6,FALSE)","v":{"$error":"#N/A"}}]
["NVIDIA vPC to NVIDIA RTX vWS Upgrade 5 year SUMS Bundle",null,null,{"$f":"VLOOKUP(L740,Tabella_prezzi!$A$1:$L$189,8,FALSE)","v":{"$error":"#N/A"}},null,null,13,{"$f":"VLOOKUP(L740,Tabella_prezzi!$A$1:$L$189,9,FALSE)","v":{"$error":"#N/A"}},{"$f":"VLOOKUP(L740,Tabella_prezzi!$A$1:$L$189,3,FALSE)","v":{"$error":"#N/A"}},null,{"$f":"VLOOKUP(L740,Tabella_prezzi!$A$1:$L$189,4,FALSE)","v":{"$error":"#N/A"}},"L7N129",{"$f":"VLOOKUP(L740,Tabella_prezzi!$A$1:$L$189,6,FALSE)","v":{"$error":"#N/A"}}]
[]
[]
[]
[]
[]
[]
[]
["Armadio Rack 42U 600x1200, 2 x PDU Monofase 2G, ZeroU, 32A, 230V, (36) C13 & (6) C19",null,null,{"$f":"VLOOKUP(L748,Tabella_prezzi!$A$1:$L$189,8,FALSE)","v":{"$error":"#N/A"}},null,null,14,{"$f":"VLOOKUP(L748,Tabella_prezzi!$A$1:$L$189,9,FALSE)","v":{"$error":"#N/A"}},{"$f":"VLOOKUP(L748,Tabella_prezzi!$A$1:$L$189,3,FALSE)","v":{"$error":"#N/A"}},null,{"$f":"VLOOKUP(L748,Tabella_prezzi!$A$1:$L$189,4,FALSE)","v":{"$error":"#N/A"}},"L7N89",{"$f":"VLOOKUP(L748,Tabella_prezzi!$A$1:$L$189,6,FALSE)","v":{"$error":"#N/A"}}]
["Armadio Rack 42U 600x1200, 2 x PDU Trifase 2G, ZeroU, 22.0kW(32A) 17.3kW(24A), 230V, (30) C13 & (12) C19",null,null,{"$f":"VLOOKUP(L749,Tabella_prezzi!$A$1:$L$189,8,FALSE)","v":{"$error":"#N/A"}},null,null,15,{"$f":"VLOOKUP(L749,Tabella_prezzi!$A$1:$L$189,9,FALSE)","v":{"$error":"#N/A"}},{"$f":"VLOOKUP(L749,Tabella_prezzi!$A$1:$L$189,3,FALSE)","v":{"$error":"#N/A"}},null,{"$f":"VLOOKUP(L749,Tabella_prezzi!$A$1:$L$189,4,FALSE)","v":{"$error":"#N/A"}},"L7N90",{"$f":"VLOOKUP(L749,Tabella_prezzi!$A$1:$L$189,6,FALSE)","v":{"$error":"#N/A"}}]
[]
["[TS3L7-HBA330-L] PERC HBA330 Adapter, 12Gbps Adapter","PERC HBA330 Adapter, 12Gbps Adapter, Low Profile,CK","TS3L7-HBA330-L",{"$f":"VLOOKUP(L751,Tabella_prezzi!$A$1:$L$189,8,FALSE)","v":{"$error":"#N/A"}},null,null,1,null,{"$f":"VLOOKUP(L751,Tabella_prezzi!$A$1:$L$189,3,FALSE)","v":{"$error":"#N/A"}},null,{"$f":"VLOOKUP(L751,Tabella_prezzi!$A$1:$L$189,4,FALSE)","v":{"$error":"#N/A"}},"L7N34",{"$f":"VLOOKUP(L751,Tabella_prezzi!$A$1:$L$189,6,FALSE)","v":{"$error":"#N/A"}}]
[]
[]
["Slot PCI",1,2,3,4,5,6,7,8,null,"Slot PCI",1,2,3,4,5,6,7,8,null,"Slot PCI",1,2,3,4,5,6,7,8]
["Conf.1",{"$f":"#REF!","v":{"$error":"#REF!"}},{"$f":"#REF!","v":{"$error":"#REF!"}},{"$f":"#REF!","v":{"$error":"#REF!"}},{"$f":"#REF!","v":{"$error":"#REF!"}},{"$f":"#REF!","v":{"$error":"#REF!"}},{"$f":"#REF!","v":{"$error":"#REF!"}},{"$f":"#REF!","v":{"$error":"#REF!"}},{"$f":"#REF!","v":{"$error":"#REF!"}},null,"Conf.2",{"$f":"#REF!","v":{"$error":"#REF!"}},{"$f":"#REF!","v":{"$error":"#REF!"}},{"$f":"#REF!","v":{"$error":"#REF!"}},{"$f":"#REF!","v":{"$error":"#REF!"}},{"$f":"#REF!","v":{"$error":"#REF!"}},{"$f":"#REF!","v":{"$error":"#REF!"}},{"$f":"#REF!","v":{"$error":"#REF!"}},{"$f":"#REF!","v":{"$error":"#REF!"}},null,"Conf.3",{"$f":"#REF!","v":{"$error":"#REF!"}},{"$f":"#REF!","v":{"$error":"#REF!"}},{"$f":"#REF!","v":{"$error":"#REF!"}},{"$f":"#REF!","v":{"$error":"#REF!"}},{"$f":"#REF!","v":{"$error":"#REF!"}},{"$f":"#REF!","v":{"$error":"#REF!"}},{"$f":"#REF!","v":{"$error":"#REF!"}},{"$f":"#REF!","v":{"$error":"#REF!"}}]
[]
[]
[]
["TS3L7-SRV",{"$f":"IF(A459=B455,1,\"\")","v":{"$error":"#REF!"}},{"$f":"IF(A459=C455,2,\"\")","v":{"$error":"#REF!"}},{"$f":"IF(A459=D455,3,\"\")","v":{"$error":"#REF!"}},{"$f":"IF(A459=E455,4,\"\")","v":{"$error":"#REF!"}},{"$f":"IF(A459=F455,5,\"\")","v":{"$error":"#REF!"}},{"$f":"IF(A459=G455,6,\"\")","v":{"$error":"#REF!"}},{"$f":"IF(A459=H455,7,\"\")","v":{"$error":"#REF!"}},{"$f":"IF(A459=I455,8,\"\")","v":{"$error":"#REF!"}},{"$f":"IF(SUM(B459:I459)=0,\"\",CONCATENATE(\" (Slot PCI \",B459,\".\",C459,\".\",D459,\".\",E459,\".\",F459,\".\",G459,\".\",H459,\".\",I459,\")\"))","v":{"$error":"#REF!"}},"TS3L7-SRV",{"$f":"IF(K459=$L$455,1,\"\")","v":{"$error":"#REF!"}},{"$f":"IF(K459=$M$455,2,\"\")","v":{"$error":"#REF!"}},{"$f":"IF(K459=$N$455,3,\"\")","v":{"$error":"#REF!"}},{"$f":"IF(K459=$O$455,4,\"\")","v":{"$error":"#REF!"}},{"$f":"IF(K459=$P$455,5,\"\")","v":{"$error":"#REF!"}},{"$f":"IF(K459=$Q$455,6,\"\")","v":{"$error":"#REF!"}},{"$f":"IF(K459=$R$455,7,\"\")","v":{"$error":"#REF!"}},{"$f":"IF(K459=$S$455,8,\"\")","v":{"$error":"#REF!"}},{"$f":"IF(SUM(L459:S759)=0,\"\",CONCATENATE(\" (Slot PCI \",L759,\".\",M459,\".\",N459,\".\",O459,\".\",P459,\".\",Q459,\".\",R459,\".\",S459,\")\"))","v":{"$error":"#REF!"}},"TS3L7-SRV",{"$f":"IF(U459=$V$455,1,\"\")","v":{"$error":"#REF!"}},{"$f":"IF(U459=$W$455,2,\"\")","v":{"$error":"#REF!"}},{"$f":"IF(U459=$X$455,3,\"\")","v":{"$error":"#REF!"}},{"$f":"IF(U459=$Y$455,4,\"\")","v":{"$error":"#REF!"}},{"$f":"IF(U459=$Z$455,5,\"\")","v":{"$error":"#REF!"}},{"$f":"IF(U459=$AA$455,6,\"\")","v":{"$error":"#REF!"}},{"$f":"IF(U459=$AB$455,7,\"\")","v":{"$error":"#REF!"}},{"$f":"IF(U459=$AC$455,8,\"\")","v":{"$error":"#REF!"}},{"$f":"IF(SUM(V459:AC459)=0,\"\",CONCATENATE(\" (Slot PCI \",V459,\".\",W459,\".\",X459,\".\",Y459,\".\",Z459,\".\",AA459,\".\",AB459,\".\",AC459,\")\"))","v":{"$error":"#REF!"}}]
["TS3L7-CPU",{"$f":"IF(A460=B455,1,\"\")","v":{"$error":"#REF!"}},{"$f":"IF(A460=C455,2,\"\")","v":{"$error":"#REF!"}},{"$f":"IF(A460=D455,3,\"\")","v":{"$error":"#REF!"}},{"$f":"IF(A460=E455,4,\"\")","v":{"$error":"#REF!"}},{"$f":"IF(A460=F455,5,\"\")","v":{"$error":"#REF!"}},{"$f":"IF(A460=G455,6,\"\")","v":{"$error":"#REF!"}},{"$f":"IF(A460=H455,7,\"\")","v":{"$error":"#REF!"}},{"$f":"IF(A460=I455,8,\"\")","v":{"$error":"#REF!"}},{"$f":"IF(SUM(B460:I460)=0,\"\",CONCATENATE(\" (Slot PCI \",B460,\".\",C460,\".\",D460,\".\",E460,\".\",F460,\".\",G460,\".\",H460,\".\",I460,\")\"))","v":{"$error":"#REF!"}},"TS3L7-CPU",{"$f":"IF(K460=$L$455,1,\"\")","v":{"$error":"#REF!"}},{"$f":"IF(K460=$M$455,2,\"\")","v":{"$error":"#REF!"}},{"$f":"IF(K460=$N$455,3,\"\")","v":{"$error":"#REF!"}},{"$f":"IF(K460=$O$455,4,\"\")","v":{"$error":"#REF!"}},{"$f":"IF(K460=$P$455,5,\"\")","v":{"$error":"#REF!"}},{"$f":"IF(K460=$Q$455,6,\"\")","v":{"$error":"#REF!"}},{"$f":"IF(K460=$R$455,7,\"\")","v":{"$error":"#REF!"}},{"$f":"IF(K460=$S$455,8,\"\")","v":{"$error":"#REF!"}},{"$error":"#REF!"},"TS3L7-CPU",{"$f":"IF(U460=$V$455,1,\"\")","v":{"$error":"#REF!"}},{"$f":"IF(U460=$W$455,2,\"\")","v":{"$error":"#REF!"}},{"$f":"IF(U460=$X$455,3,\"\")","v":{"$error":"#REF!"}},{"$f":"IF(U460=$Y$455,4,\"\")","v":{"$error":"#REF!"}},{"$f":"IF(U460=$Z$455,5,\"\")","v":{"$error":"#REF!"}},{"$f":"IF(U460=$AA$455,6,\"\")","v":{"$error":"#REF!"}},{"$f":"IF(U460=$AB$455,7,\"\")","v":{"$error":"#REF!"}},{"$f":"IF(U460=$AC$455,8,\"\")","v":{"$error":"#REF!"}},{"$f":"IF(SUM(V460:AC460)=0,\"\",CONCATENATE(\" (Slot PCI \",V460,\".\",W460,\".\",X460,\".\",Y460,\".\",Z460,\".\",AA460,\".\",AB460,\".\",AC460,\")\"))","v":{"$error":"#REF!"}}]
["TS3L7-RAM32",{"$f":"IF(A461=B455,1,\"\")","v":{"$error":"#REF!"}},{"$f":"IF(A461=C455,2,\"\")","v":{"$error":"#REF!"}},{"$f":"IF(A461=D455,3,\"\")","v":{"$error":"#REF!"}},{"$f":"IF(A461=E455,4,\"\")","v":{"$error":"#REF!"}},{"$f":"IF(A461=F455,5,\"\")","v":{"$error":"#REF!"}},{"$f":"IF(A461=G455,6,\"\")","v":{"$error":"#REF!"}},{"$f":"IF(A461=H455,7,\"\")","v":{"$error":"#REF!"}},{"$f":"IF(A461=I455,8,\"\")","v":{"$error":"#REF!"}},{"$error":"#REF!"},"TS3L7-RAM32",{"$error":"#REF!"},{"$error":"#REF!"},{"$error":"#REF!"},{"$error":"#REF!"},{"$error":"#REF!"},{"$error":"#REF!"},{"$error":"#REF!"},{"$error":"#REF!"},{"$error":"#REF!"},"TS3L7-RAM32",{"$error":"#REF!"},{"$error":"#REF!"},{"$error":"#REF!"},{"$error":"#REF!"},{"$error":"#REF!"},{"$error":"#REF!"},{"$error":"#REF!"},{"$error":"#REF!"},{"$error":"#REF!"}]
["TS3L7-RAM64",{"$f":"IF(A462=B455,1,\"\")","v":{"$error":"#REF!"}},{"$f":"IF(A462=C455,2,\"\")","v":{"$error":"#REF!"}},{"$f":"IF(A462=D455,3,\"\")","v":{"$error":"#REF!"}},{"$f":"IF(A462=E455,4,\"\")","v":{"$error":"#REF!"}},{"$f":"IF(A462=F455,5,\"\")","v":{"$error":"#REF!"}},{"$f":"IF(A462=G455,6,\"\")","v":{"$error":"#REF!"}},{"$f":"IF(A462=H455,7,\"\")","v":{"$error":"#REF!"}},{"$f":"IF(A462=I455,8,\"\")","v":{"$error":"#REF!"}},{"$error":"#REF!"},"TS3L7-RAM64",{"$error":"#REF!"},{"$error":"#REF!"},{"$error":"#REF!"},{"$error":"#REF!"},{"$error":"#REF!"},{"$error":"#REF!"},{"$error":"#REF!"},{"$error":"#REF!"},{"$error":"#REF!"},"TS3L7-RAM64",{"$error":"#REF!"},{"$error":"#REF!"},{"$error":"#REF!"},{"$error":"#REF!"},{"$error":"#REF!"},{"$error":"#REF!"},{"$error":"#REF!"},{"$error":"#REF!"},{"$error":"#REF!"}]
["TS3L7-LAN1",{"$f":"IF(A463=B455,1,\"\")","v":{"$error":"#REF!"}},{"$f":"IF(A463=C455,2,\"\")","v":{"$error":"#REF!"}},{"$f":"IF(A463=D455,3,\"\")","v":{"$error":"#REF!"}},{"$f":"IF(A463=E455,4,\"\")","v":{"$error":"#REF!"}},{"$f":"IF(A463=F455,5,\"\")","v":{"$error":"#REF!"}},{"$f":"IF(A463=G455,6,\"\")","v":{"$error":"#REF!"}},{"$f":"IF(A463=H455,7,\"\")","v":{"$error":"#REF!"}},{"$f":"IF(A463=I455,8,\"\")","v":{"$error":"#REF!"}},{"$error":"#REF!"},"TS3L7-LAN1",{"$error":"#REF!"},{"$error":"#REF!"},{"$error":"#REF!"},{"$error":"#REF!"},{"$error":"#REF!"},{"$error":"#REF!"},{"$error":"#REF!"},{"$error":"#REF!"},{"$error":"#REF!"},"TS3L7-LAN1",{"$error":"#REF!"},{"$error":"#REF!"},{"$error":"#REF!"},{"$error":"#REF!"},{"$error":"#REF!"},{"$error":"#REF!"},{"$error":"#REF!"},{"$error":"#REF!"},{"$error":"#REF!"}]
["TS3L7-LAN1-L",{"$f":"IF(A464=B455,1,\"\")","v":{"$error":"#REF!"}},{"$f":"IF(A464=C455,2,\"\")","v":{"$error":"#REF!"}},{"$f":"IF(A464=D455,3,\"\")","v":{"$error":"#REF!"}},{"$f":"IF(A464=E455,4,\"\")","v":{"$error":"#REF!"}},{"$f":"IF(A464=F455,5,\"\")","v":{"$error":"#REF!"}},{"$f":"IF(A464=G455,6,\"\")","v":{"$error":"#REF!"}},{"$f":"IF(A464=H455,7,\"\")","v":{"$error":"#REF!"}},{"$f":"IF(A464=I455,8,\"\")","v":{"$error":"#REF!"}},{"$error":"#REF!"},"TS3L7-LAN1-L",{"$error":"#REF!"},{"$error":"#REF!"},{"$error":"#REF!"},{"$error":"#REF!"},{"$error":"#REF!"},{"$error":"#REF!"},{"$error":"#REF!"},{"$error":"#REF!"},{"$error":"#REF!"},"TS3L7-LAN1-L",{"$error":"#REF!"},{"$error":"#REF!"},{"$error":"#REF!"},{"$error":"#REF!"},{"$error":"#REF!"},{"$error":"#REF!"},{"$error":"#REF!"},{"$error":"#REF!"},{"$error":"#REF!"}]
["TS3L7-LAN10",{"$f":"IF(A465=B455,1,\"\")","v":{"$error":"#REF!"}},{"$f":"IF(A465=C455,2,\"\")","v":{"$error":"#REF!"}},{"$f":"IF(A465=D455,3,\"\")","v":{"$error":"#REF!"}},{"$f":"IF(A465=E455,4,\"\")","v":{"$error":"#REF!"}},{"$f":"IF(A465=F455,5,\"\")","v":{"$error":"#REF!"}},{"$f":"IF(A465=G455,6,\"\")","v":{"$error":"#REF!"}},{"$f":"IF(A465=H455,7,\"\")","v":{"$error":"#REF!"}},{"$f":"IF(A465=I455,8,\"\")","v":{"$error":"#REF!"}},{"$error":"#REF!"},"TS3L7-LAN10",{"$error":"#REF!"},{"$error":"#REF!"},{"$error":"#REF!"},{"$error":"#REF!"},{"$error":"#REF!"},{"$error":"#REF!"},{"$error":"#REF!"},{"$error":"#REF!"},{"$error":"#REF!"},"TS3L7-LAN10",{"$error":"#REF!"},{"$error":"#REF!"},{"$error":"#REF!"},{"$error":"#REF!"},{"$error":"#REF!"},{"$error":"#REF!"},{"$error":"#REF!"},{"$error":"#REF!"},{"$error":"#REF!"}]
["TS3L7-LAN10-L",{"$f":"IF(A466=B455,1,\"\")","v":{"$error":"#REF!"}},{"$f":"IF(A466=C455,2,\"\")","v":{"$error":"#REF!"}},{"$f":"IF(A466=D455,3,\"\")","v":{"$error":"#REF!"}},{"$f":"IF(A466=E455,4,\"\")","v":{"$error":"#REF!"}},{"$f":"IF(A466=F455,5,\"\")","v":{"$error":"#REF!"}},{"$f":"IF(A466=G455,6,\"\")","v":{"$error":"#REF!"}},{"$f":"IF(A466=H455,7,\"\")","v":{"$error":"#REF!"}},{"$f":"IF(A466=I455,8,\"\")","v":{"$error":"#REF!"}},{"$error":"#REF!"},"TS3L7-LAN10-L",{"$error":"#REF!"},{"$error":"#REF!"},{"$error":"#REF!"},{"$error":"#REF!"},{"$error":"#REF!"},{"$error":"#REF!"},{"$error":"#REF!"},{"$error":"#REF!"},{"$error":"#REF!"},"TS3L7-LAN10-L",{"$error":"#REF!"},{"$error":"#REF!"},{"$error":"#REF!"},{"$error":"#REF!"},{"$error":"#REF!"},{"$error":"#REF!"},{"$error":"#REF!"},{"$error":"#REF!"},{"$error":"#REF!"}]
["TS3L7-LAN25",{"$f":"IF(A467=B455,1,\"\")","v":{"$error":"#REF!"}},{"$f":"IF(A467=C455,2,\"\")","v":{"$error":"#REF!"}},{"$f":"IF(A467=D455,3,\"\")","v":{"$error":"#REF!"}},{"$f":"IF(A467=E455,4,\"\")","v":{"$error":"#REF!"}},{"$f":"IF(A467=F455,5,\"\")","v":{"$error":"#REF!"}},{"$f":"IF(A467=G455,6,\"\")","v":{"$error":"#REF!"}},{"$f":"IF(A467=H455,7,\"\")","v":{"$error":"#REF!"}},{"$f":"IF(A467=I455,8,\"\")","v":{"$error":"#REF!"}},{"$error":"#REF!"},"TS3L7-LAN25",{"$error":"#REF!"},{"$error":"#REF!"},{"$error":"#REF!"},{"$error":"#REF!"},{"$error":"#REF!"},{"$error":"#REF!"},{"$error":"#REF!"},{"$error":"#REF!"},{"$error":"#REF!"},"TS3L7-LAN25",{"$error":"#REF!"},{"$error":"#REF!"},{"$error":"#REF!"},{"$error":"#REF!"},{"$error":"#REF!"},{"$error":"#REF!"},{"$error":"#REF!"},{"$error":"#REF!"},{"$error":"#REF!"}]
["TS3L7-LAN25-L",{"$f":"IF(A468=B455,1,\"\")","v":{"$error":"#REF!"}},{"$f":"IF(A468=C455,2,\"\")","v":{"$error":"#REF!"}},{"$f":"IF(A468=D455,3,\"\")","v":{"$error":"#REF!"}},{"$f":"IF(A468=E455,4,\"\")","v":{"$error":"#REF!"}},{"$f":"IF(A468=F455,5,\"\")","v":{"$error":"#REF!"}},{"$f":"IF(A468=G455,6,\"\")","v":{"$error":"#REF!"}},{"$f":"IF(A468=H455,7,\"\")","v":{"$error":"#REF!"}},{"$f":"IF(A468=I455,8,\"\")","v":{"$error":"#REF!"}},{"$error":"#REF!"},"TS3L7-LAN25-L",{"$error":"#REF!"},{"$error":"#REF!"},{"$error":"#REF!"},{"$error":"#REF!"},{"$error":"#REF!"},{"$error":"#REF!"},{"$error":"#REF!"},{"$error":"#REF!"},{"$error":"#REF!"},"TS3L7-LAN25-L",{"$error":"#REF!"},{"$error":"#REF!"},{"$error":"#REF!"},{"$error":"#REF!"},{"$error":"#REF!"},{"$error":"#REF!"},{"$error":"#REF!"},{"$error":"#REF!"},{"$error":"#REF!"}]
["TS3L7-CNA10",{"$f":"IF(A469=B455,1,\"\")","v":{"$error":"#REF!"}},{"$f":"IF(A469=C455,2,\"\")","v":{"$error":"#REF!"}},{"$f":"IF(A469=D455,3,\"\")","v":{"$error":"#REF!"}},{"$f":"IF(A469=E455,4,\"\")","v":{"$error":"#REF!"}},{"$f":"IF(A469=F455,5,\"\")","v":{"$error":"#REF!"}},{"$f":"IF(A469=G455,6,\"\")","v":{"$error":"#REF!"}},{"$f":"IF(A469=H455,7,\"\")","v":{"$error":"#REF!"}},{"$f":"IF(A469=I455,8,\"\")","v":{"$error":"#REF!"}},{"$error":"#REF!"},"TS3L7-CNA10",{"$error":"#REF!"},{"$error":"#REF!"},{"$error":"#REF!"},{"$error":"#REF!"},{"$error":"#REF!"},{"$error":"#REF!"},{"$error":"#REF!"},{"$error":"#REF!"},{"$error":"#REF!"},"TS3L7-CNA10",{"$error":"#REF!"},{"$error":"#REF!"},{"$error":"#REF!"},{"$error":"#REF!"},{"$error":"#REF!"},{"$error":"#REF!"},{"$error":"#REF!"},{"$error":"#REF!"},{"$error":"#REF!"}]
["TS3L7-CNA10-L",{"$f":"IF(A470=B455,1,\"\")","v":{"$error":"#REF!"}},{"$f":"IF(A470=C455,2,\"\")","v":{"$error":"#REF!"}},{"$f":"IF(A470=D455,3,\"\")","v":{"$error":"#REF!"}},{"$f":"IF(A470=E455,4,\"\")","v":{"$error":"#REF!"}},{"$f":"IF(A470=F455,5,\"\")","v":{"$error":"#REF!"}},{"$f":"IF(A470=G455,6,\"\")","v":{"$error":"#REF!"}},{"$f":"IF(A470=H455,7,\"\")","v":{"$error":"#REF!"}},{"$f":"IF(A470=I455,8,\"\")","v":{"$error":"#REF!"}},{"$error":"#REF!"},"TS3L7-CNA10-L",{"$error":"#REF!"},{"$error":"#REF!"},{"$error":"#REF!"},{"$error":"#REF!"},{"$error":"#REF!"},{"$error":"#REF!"},{"$error":"#REF!"},{"$error":"#REF!"},{"$error":"#REF!"},"TS3L7-CNA10-L",{"$error":"#REF!"},{"$error":"#REF!"},{"$error":"#REF!"},{"$error":"#REF!"},{"$error":"#REF!"},{"$error":"#REF!"},{"$error":"#REF!"},{"$error":"#REF!"},{"$error":"#REF!"}]
["TS3L7-FC16",{"$f":"IF(A471=B455,1,\"\")","v":{"$error":"#REF!"}},{"$f":"IF(A471=C455,2,\"\")","v":{"$error":"#REF!"}},{"$f":"IF(A471=D455,3,\"\")","v":{"$error":"#REF!"}},{"$f":"IF(A471=E455,4,\"\")","v":{"$error":"#REF!"}},{"$f":"IF(A471=F455,5,\"\")","v":{"$error":"#REF!"}},{"$f":"IF(A471=G455,6,\"\")","v":{"$error":"#REF!"}},{"$f":"IF(A471=H455,7,\"\")","v":{"$error":"#REF!"}},{"$f":"IF(A471=I455,8,\"\")","v":{"$error":"#REF!"}},{"$error":"#REF!"},"TS3L7-FC16",{"$error":"#REF!"},{"$error":"#REF!"},{"$error":"#REF!"},{"$error":"#REF!"},{"$error":"#REF!"},{"$error":"#REF!"},{"$error":"#REF!"},{"$error":"#REF!"},{"$error":"#REF!"},"TS3L7-FC16",{"$error":"#REF!"},{"$error":"#REF!"},{"$error":"#REF!"},{"$error":"#REF!"},{"$error":"#REF!"},{"$error":"#REF!"},{"$error":"#REF!"},{"$error":"#REF!"},{"$error":"#REF!"}]
["TS3L7-FC16-L",{"$f":"IF(A472=B455,1,\"\")","v":{"$error":"#REF!"}},{"$f":"IF(A472=C455,2,\"\")","v":{"$error":"#REF!"}},{"$f":"IF(A472=D455,3,\"\")","v":{"$error":"#REF!"}},{"$f":"IF(A472=E455,4,\"\")","v":{"$error":"#REF!"}},{"$f":"IF(A472=F455,5,\"\")","v":{"$error":"#REF!"}},{"$f":"IF(A472=G455,6,\"\")","v":{"$error":"#REF!"}},{"$f":"IF(A472=H455,7,\"\")","v":{"$error":"#REF!"}},{"$f":"IF(A472=I455,8,\"\")","v":{"$error":"#REF!"}},{"$error":"#REF!"},"TS3L7-FC16-L",{"$error":"#REF!"},{"$error":"#REF!"},{"$error":"#REF!"},{"$error":"#REF!"},{"$error":"#REF!"},{"$error":"#REF!"},{"$error":"#REF!"},{"$error":"#REF!"},{"$error":"#REF!"},"TS3L7-FC16-L",{"$error":"#REF!"},{"$error":"#REF!"},{"$error":"#REF!"},{"$error":"#REF!"},{"$error":"#REF!"},{"$error":"#REF!"},{"$error":"#REF!"},{"$error":"#REF!"},{"$error":"#REF!"}]
["TS3L7-HDD2TB",{"$f":"IF(A473=B455,1,\"\")","v":{"$error":"#REF!"}},{"$f":"IF(A473=C455,2,\"\")","v":{"$error":"#REF!"}},{"$f":"IF(A473=D455,3,\"\")","v":{"$error":"#REF!"}},{"$f":"IF(A473=E455,4,\"\")","v":{"$error":"#REF!"}},{"$f":"IF(A473=F455,5,\"\")","v":{"$error":"#REF!"}},{"$f":"IF(A473=G455,6,\"\")","v":{"$error":"#REF!"}},{"$f":"IF(A473=H455,7,\"\")","v":{"$error":"#REF!"}},{"$f":"IF(A473=I455,8,\"\")","v":{"$error":"#REF!"}},{"$error":"#REF!"},"TS3L7-HDD2TB",{"$error":"#REF!"},{"$error":"#REF!"},{"$error":"#REF!"},{"$error":"#REF!"},{"$error":"#REF!"},{"$error":"#REF!"},{"$error":"#REF!"},{"$error":"#REF!"},{"$error":"#REF!"},"TS3L7-HDD2TB",{"$error":"#REF!"},{"$error":"#REF!"},{"$error":"#REF!"},{"$error":"#REF!"},{"$error":"#REF!"},{"$error":"#REF!"},{"$error":"#REF!"},{"$error":"#REF!"},{"$error":"#REF!"}]
["TS3L7-HDD1TB",{"$f":"IF(A474=B455,1,\"\")","v":{"$error":"#REF!"}},{"$f":"IF(A474=C455,2,\"\")","v":{"$error":"#REF!"}},{"$f":"IF(A474=D455,3,\"\")","v":{"$error":"#REF!"}},{"$f":"IF(A474=E455,4,\"\")","v":{"$error":"#REF!"}},{"$f":"IF(A474=F455,5,\"\")","v":{"$error":"#REF!"}},{"$f":"IF(A474=G455,6,\"\")","v":{"$error":"#REF!"}},{"$f":"IF(A474=H455,7,\"\")","v":{"$error":"#REF!"}},{"$f":"IF(A474=I455,8,\"\")","v":{"$error":"#REF!"}},{"$error":"#REF!"},"TS3L7-HDD1TB",{"$error":"#REF!"},{"$error":"#REF!"},{"$error":"#REF!"},{"$error":"#REF!"},{"$error":"#REF!"},{"$error":"#REF!"},{"$error":"#REF!"},{"$error":"#REF!"},{"$error":"#REF!"},"TS3L7-HDD1TB",{"$error":"#REF!"},{"$error":"#REF!"},{"$error":"#REF!"},{"$error":"#REF!"},{"$error":"#REF!"},{"$error":"#REF!"},{"$error":"#REF!"},{"$error":"#REF!"},{"$error":"#REF!"}]
["TS3L7-HDD300GB",{"$f":"IF(A475=B455,1,\"\")","v":{"$error":"#REF!"}},{"$f":"IF(A475=C455,2,\"\")","v":{"$error":"#REF!"}},{"$f":"IF(A475=D455,3,\"\")","v":{"$error":"#REF!"}},{"$f":"IF(A475=E455,4,\"\")","v":{"$error":"#REF!"}},{"$f":"IF(A475=F455,5,\"\")","v":{"$error":"#REF!"}},{"$f":"IF(A475=G455,6,\"\")","v":{"$error":"#REF!"}},{"$f":"IF(A475=H455,7,\"\")","v":{"$error":"#REF!"}},{"$f":"IF(A475=I455,8,\"\")","v":{"$error":"#REF!"}},{"$error":"#REF!"},"TS3L7-HDD300GB",{"$error":"#REF!"},{"$error":"#REF!"},{"$error":"#REF!"},{"$error":"#REF!"},{"$error":"#REF!"},{"$error":"#REF!"},{"$error":"#REF!"},{"$error":"#REF!"},{"$error":"#REF!"},"TS3L7-HDD300GB",{"$error":"#REF!"},{"$error":"#REF!"},{"$error":"#REF!"},{"$error":"#REF!"},{"$error":"#REF!"},{"$error":"#REF!"},{"$error":"#REF!"},{"$error":"#REF!"},{"$error":"#REF!"}]
["TS3L7-RI1600GB",{"$f":"IF(A476=B455,1,\"\")","v":{"$error":"#REF!"}},{"$f":"IF(A476=C455,2,\"\")","v":{"$error":"#REF!"}},{"$f":"IF(A476=D455,3,\"\")","v":{"$error":"#REF!"}},{"$f":"IF(A476=E455,4,\"\")","v":{"$error":"#REF!"}},{"$f":"IF(A476=F455,5,\"\")","v":{"$error":"#REF!"}},{"$f":"IF(A476=G455,6,\"\")","v":{"$error":"#REF!"}},{"$f":"IF(A476=H455,7,\"\")","v":{"$error":"#REF!"}},{"$f":"IF(A476=I455,8,\"\")","v":{"$error":"#REF!"}},{"$error":"#REF!"},"TS3L7-RI1600GB",{"$error":"#REF!"},{"$error":"#REF!"},{"$error":"#REF!"},{"$error":"#REF!"},{"$error":"#REF!"},{"$error":"#REF!"},{"$error":"#REF!"},{"$error":"#REF!"},{"$error":"#REF!"},"TS3L7-RI1600GB",{"$error":"#REF!"},{"$error":"#REF!"},{"$error":"#REF!"},{"$error":"#REF!"},{"$error":"#REF!"},{"$error":"#REF!"},{"$error":"#REF!"},{"$error":"#REF!"},{"$error":"#REF!"}]
["TS3L7-MU1600GB",{"$f":"IF(A477=B455,1,\"\")","v":{"$error":"#REF!"}},{"$f":"IF(A477=C455,2,\"\")","v":{"$error":"#REF!"}},{"$f":"IF(A477=D455,3,\"\")","v":{"$error":"#REF!"}},{"$f":"IF(A477=E455,4,\"\")","v":{"$error":"#REF!"}},{"$f":"IF(A477=F455,5,\"\")","v":{"$error":"#REF!"}},{"$f":"IF(A477=G455,6,\"\")","v":{"$error":"#REF!"}},{"$f":"IF(A477=H455,7,\"\")","v":{"$error":"#REF!"}},{"$f":"IF(A477=I455,8,\"\")","v":{"$error":"#REF!"}},{"$error":"#REF!"},"TS3L7-MU1600GB",{"$error":"#REF!"},{"$error":"#REF!"},{"$error":"#REF!"},{"$error":"#REF!"},{"$error":"#REF!"},{"$error":"#REF!"},{"$error":"#REF!"},{"$error":"#REF!"},{"$error":"#REF!"},"TS3L7-MU1600GB",{"$error":"#REF!"},{"$error":"#REF!"},{"$error":"#REF!"},{"$error":"#REF!"},{"$error":"#REF!"},{"$error":"#REF!"},{"$error":"#REF!"},{"$error":"#REF!"},{"$error":"#REF!"}]
["TS3L7-RI800GB",{"$f":"IF(A478=B455,1,\"\")","v":{"$error":"#REF!"}},{"$f":"IF(A478=C455,2,\"\")","v":{"$error":"#REF!"}},{"$f":"IF(A478=D455,3,\"\")","v":{"$error":"#REF!"}},{"$f":"IF(A478=E455,4,\"\")","v":{"$error":"#REF!"}},{"$f":"IF(A478=F455,5,\"\")","v":{"$error":"#REF!"}},{"$f":"IF(A478=G455,6,\"\")","v":{"$error":"#REF!"}},{"$f":"IF(A478=H455,7,\"\")","v":{"$error":"#REF!"}},{"$f":"IF(A478=I455,8,\"\")","v":{"$error":"#REF!"}},{"$error":"#REF!"},"TS3L7-RI800GB",{"$error":"#REF!"},{"$error":"#REF!"},{"$error":"#REF!"},{"$error":"#REF!"},{"$error":"#REF!"},{"$error":"#REF!"},{"$error":"#REF!"},{"$error":"#REF!"},{"$error":"#REF!"},"TS3L7-RI800GB",{"$error":"#REF!"},{"$error":"#REF!"},{"$error":"#REF!"},{"$error":"#REF!"},{"$error":"#REF!"},{"$error":"#REF!"},{"$error":"#REF!"},{"$error":"#REF!"},{"$error":"#REF!"}]
["TS3L7-MU800GB",{"$f":"IF(A479=B455,1,\"\")","v":{"$error":"#REF!"}},{"$f":"IF(A479=C455,2,\"\")","v":{"$error":"#REF!"}},{"$f":"IF(A479=D455,3,\"\")","v":{"$error":"#REF!"}},{"$f":"IF(A479=E455,4,\"\")","v":{"$error":"#REF!"}},{"$f":"IF(A479=F455,5,\"\")","v":{"$error":"#REF!"}},{"$f":"IF(A479=G455,6,\"\")","v":{"$error":"#REF!"}},{"$f":"IF(A479=H455,7,\"\")","v":{"$error":"#REF!"}},{"$f":"IF(A479=I455,8,\"\")","v":{"$error":"#REF!"}},{"$error":"#REF!"},"TS3L7-MU800GB",{"$error":"#REF!"},{"$error":"#REF!"},{"$error":"#REF!"},{"$error":"#REF!"},{"$error":"#REF!"},{"$error":"#REF!"},{"$error":"#REF!"},{"$error":"#REF!"},{"$error":"#REF!"},"TS3L7-MU800GB",{"$error":"#REF!"},{"$error":"#REF!"},{"$error":"#REF!"},{"$error":"#REF!"},{"$error":"#REF!"},{"$error":"#REF!"},{"$error":"#REF!"},{"$error":"#REF!"},{"$error":"#REF!"}]
["TS3L7-NVME1600",{"$f":"IF(A480=B455,1,\"\")","v":{"$error":"#REF!"}},{"$f":"IF(A480=C455,2,\"\")","v":{"$error":"#REF!"}},{"$f":"IF(A480=D455,3,\"\")","v":{"$error":"#REF!"}},{"$f":"IF(A480=E455,4,\"\")","v":{"$error":"#REF!"}},{"$f":"IF(A480=F455,5,\"\")","v":{"$error":"#REF!"}},{"$f":"IF(A480=G455,6,\"\")","v":{"$error":"#REF!"}},{"$f":"IF(A480=H455,7,\"\")","v":{"$error":"#REF!"}},{"$f":"IF(A480=I455,8,\"\")","v":{"$error":"#REF!"}},{"$error":"#REF!"},"TS3L7-NVME1600",{"$error":"#REF!"},{"$error":"#REF!"},{"$error":"#REF!"},{"$error":"#REF!"},{"$error":"#REF!"},{"$error":"#REF!"},{"$error":"#REF!"},{"$error":"#REF!"},{"$error":"#REF!"},"TS3L7-NVME1600",{"$error":"#REF!"},{"$error":"#REF!"},{"$error":"#REF!"},{"$error":"#REF!"},{"$error":"#REF!"},{"$error":"#REF!"},{"$error":"#REF!"},{"$error":"#REF!"},{"$error":"#REF!"}]
["TS3L7-NVME800",{"$f":"IF(A481=B455,1,\"\")","v":{"$error":"#REF!"}},{"$f":"IF(A481=C455,2,\"\")","v":{"$error":"#REF!"}},{"$f":"IF(A481=D455,3,\"\")","v":{"$error":"#REF!"}},{"$f":"IF(A481=E455,4,\"\")","v":{"$error":"#REF!"}},{"$f":"IF(A481=F455,5,\"\")","v":{"$error":"#REF!"}},{"$f":"IF(A481=G455,6,\"\")","v":{"$error":"#REF!"}},{"$f":"IF(A481=H455,7,\"\")","v":{"$error":"#REF!"}},{"$f":"IF(A481=I455,8,\"\")","v":{"$error":"#REF!"}},{"$error":"#REF!"},"TS3L7-NVME800",{"$error":"#REF!"},{"$error":"#REF!"},{"$error":"#REF!"},{"$error":"#REF!"},{"$error":"#REF!"},{"$error":"#REF!"},{"$error":"#REF!"},{"$error":"#REF!"},{"$error":"#REF!"},"TS3L7-NVME800",{"$error":"#REF!"},{"$error":"#REF!"},{"$error":"#REF!"},{"$error":"#REF!"},{"$error":"#REF!"},{"$error":"#REF!"},{"$error":"#REF!"},{"$error":"#REF!"},{"$error":"#REF!"}]
["TS3L7-UPS",{"$f":"IF(A482=B455,1,\"\")","v":{"$error":"#REF!"}},{"$f":"IF(A482=C455,2,\"\")","v":{"$error":"#REF!"}},{"$f":"IF(A482=D455,3,\"\")","v":{"$error":"#REF!"}},{"$f":"IF(A482=E455,4,\"\")","v":{"$error":"#REF!"}},{"$f":"IF(A482=F455,5,\"\")","v":{"$error":"#REF!"}},{"$f":"IF(A482=G455,6,\"\")","v":{"$error":"#REF!"}},{"$f":"IF(A482=H455,7,\"\")","v":{"$error":"#REF!"}},{"$f":"IF(A482=I455,8,\"\")","v":{"$error":"#REF!"}},{"$error":"#REF!"},"TS3L7-UPS",{"$error":"#REF!"},{"$error":"#REF!"},{"$error":"#REF!"},{"$error":"#REF!"},{"$error":"#REF!"},{"$error":"#REF!"},{"$error":"#REF!"},{"$error":"#REF!"},{"$error":"#REF!"},"TS3L7-UPS",{"$error":"#REF!"},{"$error":"#REF!"},{"$error":"#REF!"},{"$error":"#REF!"},{"$error":"#REF!"},{"$error":"#REF!"},{"$error":"#REF!"},{"$error":"#REF!"},{"$error":"#REF!"}]
["TS3L7-GUI",{"$f":"IF(A483=B455,1,\"\")","v":{"$error":"#REF!"}},{"$f":"IF(A483=C455,2,\"\")","v":{"$error":"#REF!"}},{"$f":"IF(A483=D455,3,\"\")","v":{"$error":"#REF!"}},{"$f":"IF(A483=E455,4,\"\")","v":{"$error":"#REF!"}},{"$f":"IF(A483=F455,5,\"\")","v":{"$error":"#REF!"}},{"$f":"IF(A483=G455,6,\"\")","v":{"$error":"#REF!"}},{"$f":"IF(A483=H455,7,\"\")","v":{"$error":"#REF!"}},{"$f":"IF(A483=I455,8,\"\")","v":{"$error":"#REF!"}},{"$error":"#REF!"},"TS3L7-GUI",{"$error":"#REF!"},{"$error":"#REF!"},{"$error":"#REF!"},{"$error":"#REF!"},{"$error":"#REF!"},{"$error":"#REF!"},{"$error":"#REF!"},{"$error":"#REF!"},{"$error":"#REF!"},"TS3L7-GUI",{"$error":"#REF!"},{"$error":"#REF!"},{"$error":"#REF!"},{"$error":"#REF!"},{"$error":"#REF!"},{"$error":"#REF!"},{"$error":"#REF!"},{"$error":"#REF!"},{"$error":"#REF!"}]
["TS3L7-SWKVM",{"$f":"IF(A484=B455,1,\"\")","v":{"$error":"#REF!"}},{"$f":"IF(A484=C455,2,\"\")","v":{"$error":"#REF!"}},{"$f":"IF(A484=D455,3,\"\")","v":{"$error":"#REF!"}},{"$f":"IF(A484=E455,4,\"\")","v":{"$error":"#REF!"}},{"$f":"IF(A484=F455,5,\"\")","v":{"$error":"#REF!"}},{"$f":"IF(A484=G455,6,\"\")","v":{"$error":"#REF!"}},{"$f":"IF(A484=H455,7,\"\")","v":{"$error":"#REF!"}},{"$f":"IF(A484=I455,8,\"\")","v":{"$error":"#REF!"}},{"$error":"#REF!"},"TS3L7-SWKVM",{"$error":"#REF!"},{"$error":"#REF!"},{"$error":"#REF!"},{"$error":"#REF!"},{"$error":"#REF!"},{"$error":"#REF!"},{"$error":"#REF!"},{"$error":"#REF!"},{"$error":"#REF!"},"TS3L7-SWKVM",{"$error":"#REF!"},{"$error":"#REF!"},{"$error":"#REF!"},{"$error":"#REF!"},{"$error":"#REF!"},{"$error":"#REF!"},{"$error":"#REF!"},{"$error":"#REF!"},{"$error":"#REF!"}]
["TS3L7-WINSRVSTD",{"$f":"IF(A485=B455,1,\"\")","v":{"$error":"#REF!"}},{"$f":"IF(A485=C455,2,\"\")","v":{"$error":"#REF!"}},{"$f":"IF(A485=D455,3,\"\")","v":{"$error":"#REF!"}},{"$f":"IF(A485=E455,4,\"\")","v":{"$error":"#REF!"}},{"$f":"IF(A485=F455,5,\"\")","v":{"$error":"#REF!"}},{"$f":"IF(A485=G455,6,\"\")","v":{"$error":"#REF!"}},{"$f":"IF(A485=H455,7,\"\")","v":{"$error":"#REF!"}},{"$f":"IF(A485=I455,8,\"\")","v":{"$error":"#REF!"}},{"$error":"#REF!"},"TS3L7-WINSRVSTD",{"$error":"#REF!"},{"$error":"#REF!"},{"$error":"#REF!"},{"$error":"#REF!"},{"$error":"#REF!"},{"$error":"#REF!"},{"$error":"#REF!"},{"$error":"#REF!"},{"$error":"#REF!"},"TS3L7-WINSRVSTD",{"$error":"#REF!"},{"$error":"#REF!"},{"$error":"#REF!"},{"$error":"#REF!"},{"$error":"#REF!"},{"$error":"#REF!"},{"$error":"#REF!"},{"$error":"#REF!"},{"$error":"#REF!"}]
["TS3L7-WINDEVCAL",{"$f":"IF(A486=B455,1,\"\")","v":{"$error":"#REF!"}},{"$f":"IF(A486=C455,2,\"\")","v":{"$error":"#REF!"}},{"$f":"IF(A486=D455,3,\"\")","v":{"$error":"#REF!"}},{"$f":"IF(A486=E455,4,\"\")","v":{"$error":"#REF!"}},{"$f":"IF(A486=F455,5,\"\")","v":{"$error":"#REF!"}},{"$f":"IF(A486=G455,6,\"\")","v":{"$error":"#REF!"}},{"$f":"IF(A486=H455,7,\"\")","v":{"$error":"#REF!"}},{"$f":"IF(A486=I455,8,\"\")","v":{"$error":"#REF!"}},{"$error":"#REF!"},"TS3L7-WINDEVCAL",{"$error":"#REF!"},{"$error":"#REF!"},{"$error":"#REF!"},{"$error":"#REF!"},{"$error":"#REF!"},{"$error":"#REF!"},{"$error":"#REF!"},{"$error":"#REF!"},{"$error":"#REF!"},"TS3L7-WINDEVCAL",{"$error":"#REF!"},{"$error":"#REF!"},{"$error":"#REF!"},{"$error":"#REF!"},{"$error":"#REF!"},{"$error":"#REF!"},{"$error":"#REF!"},{"$error":"#REF!"},{"$error":"#REF!"}]
["TS3L7-WINUSRCAL",{"$f":"IF(A487=B455,1,\"\")","v":{"$error":"#REF!"}},{"$f":"IF(A487=C455,2,\"\")","v":{"$error":"#REF!"}},{"$f":"IF(A487=D455,3,\"\")","v":{"$error":"#REF!"}},{"$f":"IF(A487=E455,4,\"\")","v":{"$error":"#REF!"}},{"$f":"IF(A487=F455,5,\"\")","v":{"$error":"#REF!"}},{"$f":"IF(A487=G455,6,\"\")","v":{"$error":"#REF!"}},{"$f":"IF(A487=H455,7,\"\")","v":{"$error":"#REF!"}},{"$f":"IF(A487=I455,8,\"\")","v":{"$error":"#REF!"}},{"$error":"#REF!"},"TS3L7-WINUSRCAL",{"$error":"#REF!"},{"$error":"#REF!"},{"$error":"#REF!"},{"$error":"#REF!"},{"$error":"#REF!"},{"$error":"#REF!"},{"$error":"#REF!"},{"$error":"#REF!"},{"$error":"#REF!"},"TS3L7-WINUSRCAL",{"$error":"#REF!"},{"$error":"#REF!"},{"$error":"#REF!"},{"$error":"#REF!"},{"$error":"#REF!"},{"$error":"#REF!"},{"$error":"#REF!"},{"$error":"#REF!"},{"$error":"#REF!"}]
["TS3L7-WINSRV2C",{"$f":"IF(A488=B455,1,\"\")","v":{"$error":"#REF!"}},{"$f":"IF(A488=C455,2,\"\")","v":{"$error":"#REF!"}},{"$f":"IF(A488=D455,3,\"\")","v":{"$error":"#REF!"}},{"$f":"IF(A488=E455,4,\"\")","v":{"$error":"#REF!"}},{"$f":"IF(A488=F455,5,\"\")","v":{"$error":"#REF!"}},{"$f":"IF(A488=G455,6,\"\")","v":{"$error":"#REF!"}},{"$f":"IF(A488=H455,7,\"\")","v":{"$error":"#REF!"}},{"$f":"IF(A488=I455,8,\"\")","v":{"$error":"#REF!"}},{"$error":"#REF!"},"TS3L7-WINSRV2C",{"$error":"#REF!"},{"$error":"#REF!"},{"$error":"#REF!"},{"$error":"#REF!"},{"$error":"#REF!"},{"$error":"#REF!"},{"$error":"#REF!"},{"$error":"#REF!"},{"$error":"#REF!"},"TS3L7-WINSRV2C",{"$error":"#REF!"},{"$error":"#REF!"},{"$error":"#REF!"},{"$error":"#REF!"},{"$error":"#REF!"},{"$error":"#REF!"},{"$error":"#REF!"},{"$error":"#REF!"},{"$error":"#REF!"}]
["TS3L7-LINUX",{"$f":"IF(A489=B455,1,\"\")","v":{"$error":"#REF!"}},{"$f":"IF(A489=C455,2,\"\")","v":{"$error":"#REF!"}},{"$f":"IF(A489=D455,3,\"\")","v":{"$error":"#REF!"}},{"$f":"IF(A489=E455,4,\"\")","v":{"$error":"#REF!"}},{"$f":"IF(A489=F455,5,\"\")","v":{"$error":"#REF!"}},{"$f":"IF(A489=G455,6,\"\")","v":{"$error":"#REF!"}},{"$f":"IF(A489=H455,7,\"\")","v":{"$error":"#REF!"}},{"$f":"IF(A489=I455,8,\"\")","v":{"$error":"#REF!"}},{"$error":"#REF!"},"TS3L7-LINUX",{"$error":"#REF!"},{"$error":"#REF!"},{"$error":"#REF!"},{"$error":"#REF!"},{"$error":"#REF!"},{"$error":"#REF!"},{"$error":"#REF!"},{"$error":"#REF!"},{"$error":"#REF!"},"TS3L7-LINUX",{"$error":"#REF!"},{"$error":"#REF!"},{"$error":"#REF!"},{"$error":"#REF!"},{"$error":"#REF!"},{"$error":"#REF!"},{"$error":"#REF!"},{"$error":"#REF!"},{"$error":"#REF!"}]
["TS3L7-HDRTNTN",{"$f":"IF(A490=B455,1,\"\")","v":{"$error":"#REF!"}},{"$f":"IF(A490=C455,2,\"\")","v":{"$error":"#REF!"}},{"$f":"IF(A490=D455,3,\"\")","v":{"$error":"#REF!"}},{"$f":"IF(A490=E455,4,\"\")","v":{"$error":"#REF!"}},{"$f":"IF(A490=F455,5,\"\")","v":{"$error":"#REF!"}},{"$f":"IF(A490=G455,6,\"\")","v":{"$error":"#REF!"}},{"$f":"IF(A490=H455,7,\"\")","v":{"$error":"#REF!"}},{"$f":"IF(A490=I455,8,\"\")","v":{"$error":"#REF!"}},{"$error":"#REF!"},"TS3L7-HDRTNTN",{"$error":"#REF!"},{"$error":"#REF!"},{"$error":"#REF!"},{"$error":"#REF!"},{"$error":"#REF!"},{"$error":"#REF!"},{"$error":"#REF!"},{"$error":"#REF!"},{"$error":"#REF!"},"TS3L7-HDRTNTN",{"$error":"#REF!"},{"$error":"#REF!"},{"$error":"#REF!"},{"$error":"#REF!"},{"$error":"#REF!"},{"$error":"#REF!"},{"$error":"#REF!"},{"$error":"#REF!"},{"$error":"#REF!"}]
["TS3L7-5Y",{"$f":"IF(A491=B455,1,\"\")","v":{"$error":"#REF!"}},{"$f":"IF(A491=C455,2,\"\")","v":{"$error":"#REF!"}},{"$f":"IF(A491=D455,3,\"\")","v":{"$error":"#REF!"}},{"$f":"IF(A491=E455,4,\"\")","v":{"$error":"#REF!"}},{"$f":"IF(A491=F455,5,\"\")","v":{"$error":"#REF!"}},{"$f":"IF(A491=G455,6,\"\")","v":{"$error":"#REF!"}},{"$f":"IF(A491=H455,7,\"\")","v":{"$error":"#REF!"}},{"$f":"IF(A491=I455,8,\"\")","v":{"$error":"#REF!"}},{"$error":"#REF!"},"TS3L7-5Y",{"$error":"#REF!"},{"$error":"#REF!"},{"$error":"#REF!"},{"$error":"#REF!"},{"$error":"#REF!"},{"$error":"#REF!"},{"$error":"#REF!"},{"$error":"#REF!"},{"$f":"IF(SUM(L491:S791)=0,\"\",CONCATENATE(\" (Slot PCI \",L791,\".\",M491,\".\",N491,\".\",O491,\".\",P491,\".\",Q491,\".\",R491,\".\",S491,\")\"))","v":{"$error":"#REF!"}},"TS3L7-5Y",{"$error":"#REF!"},{"$error":"#REF!"},{"$error":"#REF!"},{"$error":"#REF!"},{"$error":"#REF!"},{"$error":"#REF!"},{"$error":"#REF!"},{"$error":"#REF!"},{"$error":"#REF!"}]
["TS3L7-RACK",{"$f":"IF(A492=B455,1,\"\")","v":{"$error":"#REF!"}},{"$f":"IF(A492=C455,2,\"\")","v":{"$error":"#REF!"}},{"$f":"IF(A492=D455,3,\"\")","v":{"$error":"#REF!"}},{"$f":"IF(A492=E455,4,\"\")","v":{"$error":"#REF!"}},{"$f":"IF(A492=F455,5,\"\")","v":{"$error":"#REF!"}},{"$f":"IF(A492=G455,6,\"\")","v":{"$error":"#REF!"}},{"$f":"IF(A492=H455,7,\"\")","v":{"$error":"#REF!"}},{"$f":"IF(A492=I455,8,\"\")","v":{"$error":"#REF!"}},{"$error":"#REF!"},"TS3L7-RACK",{"$error":"#REF!"},{"$error":"#REF!"},{"$error":"#REF!"},{"$error":"#REF!"},{"$error":"#REF!"},{"$error":"#REF!"},{"$error":"#REF!"},{"$error":"#REF!"},{"$error":"#REF!"},"TS3L7-RACK",{"$error":"#REF!"},{"$error":"#REF!"},{"$error":"#REF!"},{"$error":"#REF!"},{"$error":"#REF!"},{"$error":"#REF!"},{"$error":"#REF!"},{"$error":"#REF!"},{"$error":"#REF!"}]
["TS3L7-HDRTNTN60",{"$f":"IF(A493=B455,1,\"\")","v":{"$error":"#REF!"}},{"$f":"IF(A493=C455,2,\"\")","v":{"$error":"#REF!"}},{"$f":"IF(A493=D455,3,\"\")","v":{"$error":"#REF!"}},{"$f":"IF(A493=E455,4,\"\")","v":{"$error":"#REF!"}},{"$f":"IF(A493=F455,5,\"\")","v":{"$error":"#REF!"}},{"$f":"IF(A493=G455,6,\"\")","v":{"$error":"#REF!"}},{"$f":"IF(A493=H455,7,\"\")","v":{"$error":"#REF!"}},{"$f":"IF(A493=I455,8,\"\")","v":{"$error":"#REF!"}},{"$error":"#REF!"},"TS3L7-HDRTNTN60",{"$error":"#REF!"},{"$error":"#REF!"},{"$error":"#REF!"},{"$error":"#REF!"},{"$error":"#REF!"},{"$error":"#REF!"},{"$error":"#REF!"},{"$error":"#REF!"},{"$error":"#REF!"},"TS3L7-HDRTNTN60",{"$error":"#REF!"},{"$error":"#REF!"},{"$error":"#REF!"},{"$error":"#REF!"},{"$error":"#REF!"},{"$error":"#REF!"},{"$error":"#REF!"},{"$error":"#REF!"},{"$error":"#REF!"}]
[0,{"$f":"IF(A494=B455,1,\"\")","v":{"$error":"#REF!"}},{"$f":"IF(A494=C455,2,\"\")","v":{"$error":"#REF!"}},{"$f":"IF(A494=D455,3,\"\")","v":{"$error":"#REF!"}},{"$f":"IF(A494=E455,4,\"\")","v":{"$error":"#REF!"}},{"$f":"IF(A494=F455,5,\"\")","v":{"$error":"#REF!"}},{"$f":"IF(A494=G455,6,\"\")","v":{"$error":"#REF!"}},{"$f":"IF(A494=H455,7,\"\")","v":{"$error":"#REF!"}},{"$f":"IF(A494=I455,8,\"\")","v":{"$error":"#REF!"}},{"$error":"#REF!"},0,{"$error":"#REF!"},{"$error":"#REF!"},{"$error":"#REF!"},{"$error":"#REF!"},{"$error":"#REF!"},{"$error":"#REF!"},{"$error":"#REF!"},{"$error":"#REF!"},{"$error":"#REF!"},0,{"$error":"#REF!"},{"$error":"#REF!"},{"$error":"#REF!"},{"$error":"#REF!"},{"$error":"#REF!"},{"$error":"#REF!"},{"$error":"#REF!"},{"$error":"#REF!"},{"$error":"#REF!"}]
[0,{"$f":"IF(A495=B455,1,\"\")","v":{"$error":"#REF!"}},{"$f":"IF(A495=C455,2,\"\")","v":{"$error":"#REF!"}},{"$f":"IF(A495=D455,3,\"\")","v":{"$error":"#REF!"}},{"$f":"IF(A495=E455,4,\"\")","v":{"$error":"#REF!"}},{"$f":"IF(A495=F455,5,\"\")","v":{"$error":"#REF!"}},{"$f":"IF(A495=G455,6,\"\")","v":{"$error":"#REF!"}},{"$f":"IF(A495=H455,7,\"\")","v":{"$error":"#REF!"}},{"$f":"IF(A495=I455,8,\"\")","v":{"$error":"#REF!"}},{"$error":"#REF!"},0,{"$error":"#REF!"},{"$error":"#REF!"},{"$error":"#REF!"},{"$error":"#REF!"},{"$error":"#REF!"},{"$error":"#REF!"},{"$error":"#REF!"},{"$error":"#REF!"},{"$error":"#REF!"},0,{"$error":"#REF!"},{"$error":"#REF!"},{"$error":"#REF!"},{"$error":"#REF!"},{"$error":"#REF!"},{"$error":"#REF!"},{"$error":"#REF!"},{"$error":"#REF!"},{"$error":"#REF!"}]
[0,{"$f":"IF(A496=B455,1,\"\")","v":{"$error":"#REF!"}},{"$f":"IF(A496=C455,2,\"\")","v":{"$error":"#REF!"}},{"$f":"IF(A496=D455,3,\"\")","v":{"$error":"#REF!"}},{"$f":"IF(A496=E455,4,\"\")","v":{"$error":"#REF!"}},{"$f":"IF(A496=F455,5,\"\")","v":{"$error":"#REF!"}},{"$f":"IF(A496=G455,6,\"\")","v":{"$error":"#REF!"}},{"$f":"IF(A496=H455,7,\"\")","v":{"$error":"#REF!"}},{"$f":"IF(A496=I455,8,\"\")","v":{"$error":"#REF!"}},{"$error":"#REF!"},0,{"$error":"#REF!"},{"$error":"#REF!"},{"$error":"#REF!"},{"$error":"#REF!"},{"$error":"#REF!"},{"$error":"#REF!"},{"$error":"#REF!"},{"$error":"#REF!"},{"$error":"#REF!"},0,{"$error":"#REF!"},{"$error":"#REF!"},{"$error":"#REF!"},{"$error":"#REF!"},{"$error":"#REF!"},{"$error":"#REF!"},{"$error":"#REF!"},{"$error":"#REF!"},{"$error":"#REF!"}]
["TS3L7-57416-L",{"$f":"IF(A497=B455,1,\"\")","v":{"$error":"#REF!"}},{"$f":"IF(A497=C455,2,\"\")","v":{"$error":"#REF!"}},{"$f":"IF(A497=D455,3,\"\")","v":{"$error":"#REF!"}},{"$f":"IF(A497=E455,4,\"\")","v":{"$error":"#REF!"}},{"$f":"IF(A497=F455,5,\"\")","v":{"$error":"#REF!"}},{"$f":"IF(A497=G455,6,\"\")","v":{"$error":"#REF!"}},{"$f":"IF(A497=H455,7,\"\")","v":{"$error":"#REF!"}},{"$f":"IF(A497=I455,8,\"\")","v":{"$error":"#REF!"}},{"$error":"#REF!"},"TS3L7-57416-L",{"$error":"#REF!"},{"$error":"#REF!"},{"$error":"#REF!"},{"$error":"#REF!"},{"$error":"#REF!"},{"$error":"#REF!"},{"$error":"#REF!"},{"$error":"#REF!"},{"$error":"#REF!"},"TS3L7-57416-L",{"$error":"#REF!"},{"$error":"#REF!"},{"$error":"#REF!"},{"$error":"#REF!"},{"$error":"#REF!"},{"$error":"#REF!"},{"$error":"#REF!"},{"$error":"#REF!"},{"$error":"#REF!"}]
["TS3L7-BOSS240",{"$f":"IF(A498=B455,1,\"\")","v":{"$error":"#REF!"}},{"$f":"IF(A498=C455,2,\"\")","v":{"$error":"#REF!"}},{"$f":"IF(A498=D455,3,\"\")","v":{"$error":"#REF!"}},{"$f":"IF(A498=E455,4,\"\")","v":{"$error":"#REF!"}},{"$f":"IF(A498=F455,5,\"\")","v":{"$error":"#REF!"}},{"$f":"IF(A498=G455,6,\"\")","v":{"$error":"#REF!"}},{"$f":"IF(A498=H455,7,\"\")","v":{"$error":"#REF!"}},{"$f":"IF(A498=I455,8,\"\")","v":{"$error":"#REF!"}},{"$error":"#REF!"},"TS3L7-BOSS240",{"$error":"#REF!"},{"$error":"#REF!"},{"$error":"#REF!"},{"$error":"#REF!"},{"$error":"#REF!"},{"$error":"#REF!"},{"$error":"#REF!"},{"$error":"#REF!"},{"$error":"#REF!"},"TS3L7-BOSS240",{"$error":"#REF!"},{"$error":"#REF!"},{"$error":"#REF!"},{"$error":"#REF!"},{"$error":"#REF!"},{"$error":"#REF!"},{"$error":"#REF!"},{"$error":"#REF!"},{"$error":"#REF!"}]
["TS3L7-BOSS480",{"$f":"IF(A499=B455,1,\"\")","v":{"$error":"#REF!"}},{"$f":"IF(A499=C455,2,\"\")","v":{"$error":"#REF!"}},{"$f":"IF(A499=D455,3,\"\")","v":{"$error":"#REF!"}},{"$f":"IF(A499=E455,4,\"\")","v":{"$error":"#REF!"}},{"$f":"IF(A499=F455,5,\"\")","v":{"$error":"#REF!"}},{"$f":"IF(A499=G455,6,\"\")","v":{"$error":"#REF!"}},{"$f":"IF(A499=H455,7,\"\")","v":{"$error":"#REF!"}},{"$f":"IF(A499=I455,8,\"\")","v":{"$error":"#REF!"}},{"$error":"#REF!"},"TS3L7-BOSS480",{"$error":"#REF!"},{"$error":"#REF!"},{"$error":"#REF!"},{"$error":"#REF!"},{"$error":"#REF!"},{"$error":"#REF!"},{"$error":"#REF!"},{"$error":"#REF!"},{"$error":"#REF!"},"TS3L7-BOSS480",{"$error":"#REF!"},{"$error":"#REF!"},{"$error":"#REF!"},{"$error":"#REF!"},{"$error":"#REF!"},{"$error":"#REF!"},{"$error":"#REF!"},{"$error":"#REF!"},{"$error":"#REF!"}]
["TS3L7-HBA330-L",{"$f":"IF(A500=B455,1,\"\")","v":{"$error":"#REF!"}},{"$f":"IF(A500=C455,2,\"\")","v":{"$error":"#REF!"}},{"$f":"IF(A500=D455,3,\"\")","v":{"$error":"#REF!"}},{"$f":"IF(A500=E455,4,\"\")","v":{"$error":"#REF!"}},{"$f":"IF(A500=F455,5,\"\")","v":{"$error":"#REF!"}},{"$f":"IF(A500=G455,6,\"\")","v":{"$error":"#REF!"}},{"$f":"IF(A500=H455,7,\"\")","v":{"$error":"#REF!"}},{"$f":"IF(A500=I455,8,\"\")","v":{"$error":"#REF!"}},{"$error":"#REF!"},"TS3L7-HBA330-L",{"$error":"#REF!"},{"$error":"#REF!"},{"$error":"#REF!"},{"$error":"#REF!"},{"$error":"#REF!"},{"$error":"#REF!"},{"$error":"#REF!"},{"$error":"#REF!"},{"$error":"#REF!"},"TS3L7-HBA330-L",{"$error":"#REF!"},{"$error":"#REF!"},{"$error":"#REF!"},{"$error":"#REF!"},{"$error":"#REF!"},{"$error":"#REF!"},{"$error":"#REF!"},{"$error":"#REF!"},{"$error":"#REF!"}]
["TS3L7-HBA330M",{"$f":"IF(A501=B455,1,\"\")","v":{"$error":"#REF!"}},{"$f":"IF(A501=C455,2,\"\")","v":{"$error":"#REF!"}},{"$f":"IF(A501=D455,3,\"\")","v":{"$error":"#REF!"}},{"$f":"IF(A501=E455,4,\"\")","v":{"$error":"#REF!"}},{"$f":"IF(A501=F455,5,\"\")","v":{"$error":"#REF!"}},{"$f":"IF(A501=G455,6,\"\")","v":{"$error":"#REF!"}},{"$f":"IF(A501=H455,7,\"\")","v":{"$error":"#REF!"}},{"$f":"IF(A501=I455,8,\"\")","v":{"$error":"#REF!"}},{"$error":"#REF!"},"TS3L7-HBA330M",{"$error":"#REF!"},{"$error":"#REF!"},{"$error":"#REF!"},{"$error":"#REF!"},{"$error":"#REF!"},{"$error":"#REF!"},{"$error":"#REF!"},{"$error":"#REF!"},{"$error":"#REF!"},"TS3L7-HBA330M",{"$error":"#REF!"},{"$error":"#REF!"},{"$error":"#REF!"},{"$error":"#REF!"},{"$error":"#REF!"},{"$error":"#REF!"},{"$error":"#REF!"},{"$error":"#REF!"},{"$error":"#REF!"}]
["TS3L7-GPUSW",{"$f":"IF(A502=B455,1,\"\")","v":{"$error":"#REF!"}},{"$f":"IF(A502=C455,2,\"\")","v":{"$error":"#REF!"}},{"$f":"IF(A502=D455,3,\"\")","v":{"$error":"#REF!"}},{"$f":"IF(A502=E455,4,\"\")","v":{"$error":"#REF!"}},{"$f":"IF(A502=F455,5,\"\")","v":{"$error":"#REF!"}},{"$f":"IF(A502=G455,6,\"\")","v":{"$error":"#REF!"}},{"$f":"IF(A502=H455,7,\"\")","v":{"$error":"#REF!"}},{"$f":"IF(A502=I455,8,\"\")","v":{"$error":"#REF!"}},{"$error":"#REF!"},"TS3L7-GPUSW",{"$error":"#REF!"},{"$error":"#REF!"},{"$error":"#REF!"},{"$error":"#REF!"},{"$error":"#REF!"},{"$error":"#REF!"},{"$error":"#REF!"},{"$error":"#REF!"},{"$error":"#REF!"},"TS3L7-GPUSW",{"$error":"#REF!"},{"$error":"#REF!"},{"$error":"#REF!"},{"$error":"#REF!"},{"$error":"#REF!"},{"$error":"#REF!"},{"$error":"#REF!"},{"$error":"#REF!"},{"$error":"#REF!"}]
["TS3L7-GPUDW",{"$f":"IF(A503=B455,1,\"\")","v":{"$error":"#REF!"}},{"$f":"IF(A503=C455,2,\"\")","v":{"$error":"#REF!"}},{"$f":"IF(A503=D455,3,\"\")","v":{"$error":"#REF!"}},{"$f":"IF(A503=E455,4,\"\")","v":{"$error":"#REF!"}},{"$f":"IF(A503=F455,5,\"\")","v":{"$error":"#REF!"}},{"$f":"IF(A503=G455,6,\"\")","v":{"$error":"#REF!"}},{"$f":"IF(A503=H455,7,\"\")","v":{"$error":"#REF!"}},{"$f":"IF(A503=I455,8,\"\")","v":{"$error":"#REF!"}},{"$error":"#REF!"},"TS3L7-GPUDW",{"$error":"#REF!"},{"$error":"#REF!"},{"$error":"#REF!"},{"$error":"#REF!"},{"$error":"#REF!"},{"$error":"#REF!"},{"$error":"#REF!"},{"$error":"#REF!"},{"$error":"#REF!"},"TS3L7-GPUDW",{"$error":"#REF!"},{"$error":"#REF!"},{"$error":"#REF!"},{"$error":"#REF!"},{"$error":"#REF!"},{"$error":"#REF!"},{"$error":"#REF!"},{"$error":"#REF!"},{"$error":"#REF!"}]
["TS3L7-VSAN",{"$f":"IF(A504=B455,1,\"\")","v":{"$error":"#REF!"}},{"$f":"IF(A504=C455,2,\"\")","v":{"$error":"#REF!"}},{"$f":"IF(A504=D455,3,\"\")","v":{"$error":"#REF!"}},{"$f":"IF(A504=E455,4,\"\")","v":{"$error":"#REF!"}},{"$f":"IF(A504=F455,5,\"\")","v":{"$error":"#REF!"}},{"$f":"IF(A504=G455,6,\"\")","v":{"$error":"#REF!"}},{"$f":"IF(A504=H455,7,\"\")","v":{"$error":"#REF!"}},{"$f":"IF(A504=I455,8,\"\")","v":{"$error":"#REF!"}},{"$error":"#REF!"},"TS3L7-VSAN",{"$error":"#REF!"},{"$error":"#REF!"},{"$error":"#REF!"},{"$error":"#REF!"},{"$error":"#REF!"},{"$error":"#REF!"},{"$error":"#REF!"},{"$error":"#REF!"},{"$error":"#REF!"},"TS3L7-VSAN",{"$error":"#REF!"},{"$error":"#REF!"},{"$error":"#REF!"},{"$error":"#REF!"},{"$error":"#REF!"},{"$error":"#REF!"},{"$error":"#REF!"},{"$error":"#REF!"},{"$error":"#REF!"}]
["TS3L7-CONX6SP",{"$f":"IF(A505=B455,1,\"\")","v":{"$error":"#REF!"}},{"$f":"IF(A505=C455,2,\"\")","v":{"$error":"#REF!"}},{"$f":"IF(A505=D455,3,\"\")","v":{"$error":"#REF!"}},{"$f":"IF(A505=E455,4,\"\")","v":{"$error":"#REF!"}},{"$f":"IF(A505=F455,5,\"\")","v":{"$error":"#REF!"}},{"$f":"IF(A505=G455,6,\"\")","v":{"$error":"#REF!"}},{"$f":"IF(A505=H455,7,\"\")","v":{"$error":"#REF!"}},{"$f":"IF(A505=I455,8,\"\")","v":{"$error":"#REF!"}},{"$error":"#REF!"},"TS3L7-CONX6SP",{"$error":"#REF!"},{"$error":"#REF!"},{"$error":"#REF!"},{"$error":"#REF!"},{"$error":"#REF!"},{"$error":"#REF!"},{"$error":"#REF!"},{"$error":"#REF!"},{"$error":"#REF!"},"TS3L7-CONX6SP",{"$error":"#REF!"},{"$error":"#REF!"},{"$error":"#REF!"},{"$error":"#REF!"},{"$error":"#REF!"},{"$error":"#REF!"},{"$error":"#REF!"},{"$error":"#REF!"},{"$error":"#REF!"}]
["TS3L7-CONX6DP",{"$f":"IF(A506=B455,1,\"\")","v":{"$error":"#REF!"}},{"$f":"IF(A506=C455,2,\"\")","v":{"$error":"#REF!"}},{"$f":"IF(A506=D455,3,\"\")","v":{"$error":"#REF!"}},{"$f":"IF(A506=E455,4,\"\")","v":{"$error":"#REF!"}},{"$f":"IF(A506=F455,5,\"\")","v":{"$error":"#REF!"}},{"$f":"IF(A506=G455,6,\"\")","v":{"$error":"#REF!"}},{"$f":"IF(A506=H455,7,\"\")","v":{"$error":"#REF!"}},{"$f":"IF(A506=I455,8,\"\")","v":{"$error":"#REF!"}},{"$error":"#REF!"},"TS3L7-CONX6DP",{"$error":"#REF!"},{"$error":"#REF!"},{"$error":"#REF!"},{"$error":"#REF!"},{"$error":"#REF!"},{"$error":"#REF!"},{"$error":"#REF!"},{"$error":"#REF!"},{"$error":"#REF!"},"TS3L7-CONX6DP",{"$error":"#REF!"},{"$error":"#REF!"},{"$error":"#REF!"},{"$error":"#REF!"},{"$error":"#REF!"},{"$error":"#REF!"},{"$error":"#REF!"},{"$error":"#REF!"},{"$error":"#REF!"}]
["TS3L7-X710DP-L",{"$f":"IF(A507=B455,1,\"\")","v":{"$error":"#REF!"}},{"$f":"IF(A507=C455,2,\"\")","v":{"$error":"#REF!"}},{"$f":"IF(A507=D455,3,\"\")","v":{"$error":"#REF!"}},{"$f":"IF(A507=E455,4,\"\")","v":{"$error":"#REF!"}},{"$f":"IF(A507=F455,5,\"\")","v":{"$error":"#REF!"}},{"$f":"IF(A507=G455,6,\"\")","v":{"$error":"#REF!"}},{"$f":"IF(A507=H455,7,\"\")","v":{"$error":"#REF!"}},{"$f":"IF(A507=I455,8,\"\")","v":{"$error":"#REF!"}},{"$error":"#REF!"},"TS3L7-X710DP-L",{"$error":"#REF!"},{"$error":"#REF!"},{"$error":"#REF!"},{"$error":"#REF!"},{"$error":"#REF!"},{"$error":"#REF!"},{"$error":"#REF!"},{"$error":"#REF!"},{"$error":"#REF!"},"TS3L7-X710DP-L",{"$error":"#REF!"},{"$error":"#REF!"},{"$error":"#REF!"},{"$error":"#REF!"},{"$error":"#REF!"},{"$error":"#REF!"},{"$error":"#REF!"},{"$error":"#REF!"},{"$error":"#REF!"}]
["TS3L7-X710DP",{"$f":"IF(A508=B455,1,\"\")","v":{"$error":"#REF!"}},{"$f":"IF(A508=C455,2,\"\")","v":{"$error":"#REF!"}},{"$f":"IF(A508=D455,3,\"\")","v":{"$error":"#REF!"}},{"$f":"IF(A508=E455,4,\"\")","v":{"$error":"#REF!"}},{"$f":"IF(A508=F455,5,\"\")","v":{"$error":"#REF!"}},{"$f":"IF(A508=G455,6,\"\")","v":{"$error":"#REF!"}},{"$f":"IF(A508=H455,7,\"\")","v":{"$error":"#REF!"}},{"$f":"IF(A508=I455,8,\"\")","v":{"$error":"#REF!"}},{"$error":"#REF!"},"TS3L7-X710DP",{"$error":"#REF!"},{"$error":"#REF!"},{"$error":"#REF!"},{"$error":"#REF!"},{"$error":"#REF!"},{"$error":"#REF!"},{"$error":"#REF!"},{"$error":"#REF!"},{"$error":"#REF!"},"TS3L7-X710DP",{"$error":"#REF!"},{"$error":"#REF!"},{"$error":"#REF!"},{"$error":"#REF!"},{"$error":"#REF!"},{"$error":"#REF!"},{"$error":"#REF!"},{"$error":"#REF!"},{"$error":"#REF!"}]
["TS3L7-X710QP",{"$f":"IF(A509=B455,1,\"\")","v":{"$error":"#REF!"}},{"$f":"IF(A509=C455,2,\"\")","v":{"$error":"#REF!"}},{"$f":"IF(A509=D455,3,\"\")","v":{"$error":"#REF!"}},{"$f":"IF(A509=E455,4,\"\")","v":{"$error":"#REF!"}},{"$f":"IF(A509=F455,5,\"\")","v":{"$error":"#REF!"}},{"$f":"IF(A509=G455,6,\"\")","v":{"$error":"#REF!"}},{"$f":"IF(A509=H455,7,\"\")","v":{"$error":"#REF!"}},{"$f":"IF(A509=I455,8,\"\")","v":{"$error":"#REF!"}},{"$error":"#REF!"},"TS3L7-X710QP",{"$error":"#REF!"},{"$error":"#REF!"},{"$error":"#REF!"},{"$error":"#REF!"},{"$error":"#REF!"},{"$error":"#REF!"},{"$error":"#REF!"},{"$error":"#REF!"},{"$error":"#REF!"},"TS3L7-X710QP",{"$error":"#REF!"},{"$error":"#REF!"},{"$error":"#REF!"},{"$error":"#REF!"},{"$error":"#REF!"},{"$error":"#REF!"},{"$error":"#REF!"},{"$error":"#REF!"},{"$error":"#REF!"}]
[0,{"$f":"IF(A510=B455,1,\"\")","v":{"$error":"#REF!"}},{"$f":"IF(A510=C455,2,\"\")","v":{"$error":"#REF!"}},{"$f":"IF(A510=D455,3,\"\")","v":{"$error":"#REF!"}},{"$f":"IF(A510=E455,4,\"\")","v":{"$error":"#REF!"}},{"$f":"IF(A510=F455,5,\"\")","v":{"$error":"#REF!"}},{"$f":"IF(A510=G455,6,\"\")","v":{"$error":"#REF!"}},{"$f":"IF(A510=H455,7,\"\")","v":{"$error":"#REF!"}},{"$f":"IF(A510=I455,8,\"\")","v":{"$error":"#REF!"}},{"$error":"#REF!"},0,{"$error":"#REF!"},{"$error":"#REF!"},{"$error":"#REF!"},{"$error":"#REF!"},{"$error":"#REF!"},{"$error":"#REF!"},{"$error":"#REF!"},{"$error":"#REF!"},{"$error":"#REF!"},0,{"$error":"#REF!"},{"$error":"#REF!"},{"$error":"#REF!"},{"$error":"#REF!"},{"$error":"#REF!"},{"$error":"#REF!"},{"$error":"#REF!"},{"$error":"#REF!"},{"$error":"#REF!"}]
[0,{"$f":"IF(A511=B455,1,\"\")","v":{"$error":"#REF!"}},{"$f":"IF(A511=C455,2,\"\")","v":{"$error":"#REF!"}},{"$f":"IF(A511=D455,3,\"\")","v":{"$error":"#REF!"}},{"$f":"IF(A511=E455,4,\"\")","v":{"$error":"#REF!"}},{"$f":"IF(A511=F455,5,\"\")","v":{"$error":"#REF!"}},{"$f":"IF(A511=G455,6,\"\")","v":{"$error":"#REF!"}},{"$f":"IF(A511=H455,7,\"\")","v":{"$error":"#REF!"}},{"$f":"IF(A511=I455,8,\"\")","v":{"$error":"#REF!"}},{"$error":"#REF!"},0,{"$error":"#REF!"},{"$error":"#REF!"},{"$error":"#REF!"},{"$error":"#REF!"},{"$error":"#REF!"},{"$error":"#REF!"},{"$error":"#REF!"},{"$error":"#REF!"},{"$error":"#REF!"},0,{"$error":"#REF!"},{"$error":"#REF!"},{"$error":"#REF!"},{"$error":"#REF!"},{"$error":"#REF!"},{"$error":"#REF!"},{"$error":"#REF!"},{"$error":"#REF!"},{"$error":"#REF!"}]
["TS3L7-57416",{"$f":"IF(A512=B455,1,\"\")","v":{"$error":"#REF!"}},{"$f":"IF(A512=C455,2,\"\")","v":{"$error":"#REF!"}},{"$f":"IF(A512=D455,3,\"\")","v":{"$error":"#REF!"}},{"$f":"IF(A512=E455,4,\"\")","v":{"$error":"#REF!"}},{"$f":"IF(A512=F455,5,\"\")","v":{"$error":"#REF!"}},{"$f":"IF(A512=G455,6,\"\")","v":{"$error":"#REF!"}},{"$f":"IF(A512=H455,7,\"\")","v":{"$error":"#REF!"}},{"$f":"IF(A512=I455,8,\"\")","v":{"$error":"#REF!"}},{"$error":"#REF!"},"TS3L7-57416",{"$error":"#REF!"},{"$error":"#REF!"},{"$error":"#REF!"},{"$error":"#REF!"},{"$error":"#REF!"},{"$error":"#REF!"},{"$error":"#REF!"},{"$error":"#REF!"},{"$error":"#REF!"},"TS3L7-57416",{"$error":"#REF!"},{"$error":"#REF!"},{"$error":"#REF!"},{"$error":"#REF!"},{"$error":"#REF!"},{"$error":"#REF!"},{"$error":"#REF!"},{"$error":"#REF!"},{"$error":"#REF!"}]
["TS3L7-SRV8CORE",{"$f":"IF(A513=B455,1,\"\")","v":{"$error":"#REF!"}},{"$f":"IF(A513=C455,2,\"\")","v":{"$error":"#REF!"}},{"$f":"IF(A513=D455,3,\"\")","v":{"$error":"#REF!"}},{"$f":"IF(A513=E455,4,\"\")","v":{"$error":"#REF!"}},{"$f":"IF(A513=F455,5,\"\")","v":{"$error":"#REF!"}},{"$f":"IF(A513=G455,6,\"\")","v":{"$error":"#REF!"}},{"$f":"IF(A513=H455,7,\"\")","v":{"$error":"#REF!"}},{"$f":"IF(A513=I455,8,\"\")","v":{"$error":"#REF!"}},{"$error":"#REF!"},"TS3L7-SRV8CORE",{"$error":"#REF!"},{"$error":"#REF!"},{"$error":"#REF!"},{"$error":"#REF!"},{"$error":"#REF!"},{"$error":"#REF!"},{"$error":"#REF!"},{"$error":"#REF!"},{"$error":"#REF!"},"TS3L7-SRV8CORE",{"$error":"#REF!"},{"$error":"#REF!"},{"$error":"#REF!"},{"$error":"#REF!"},{"$error":"#REF!"},{"$error":"#REF!"},{"$error":"#REF!"},{"$error":"#REF!"},{"$error":"#REF!"}]
["TS3L7-CPU8CORE",{"$f":"IF(A514=B455,1,\"\")","v":{"$error":"#REF!"}},{"$f":"IF(A514=C455,2,\"\")","v":{"$error":"#REF!"}},{"$f":"IF(A514=D455,3,\"\")","v":{"$error":"#REF!"}},{"$f":"IF(A514=E455,4,\"\")","v":{"$error":"#REF!"}},{"$f":"IF(A514=F455,5,\"\")","v":{"$error":"#REF!"}},{"$f":"IF(A514=G455,6,\"\")","v":{"$error":"#REF!"}},{"$f":"IF(A514=H455,7,\"\")","v":{"$error":"#REF!"}},{"$f":"IF(A514=I455,8,\"\")","v":{"$error":"#REF!"}},{"$error":"#REF!"},"TS3L7-CPU8CORE",{"$error":"#REF!"},{"$error":"#REF!"},{"$error":"#REF!"},{"$error":"#REF!"},{"$error":"#REF!"},{"$error":"#REF!"},{"$error":"#REF!"},{"$error":"#REF!"},{"$error":"#REF!"},"TS3L7-CPU8CORE",{"$error":"#REF!"},{"$error":"#REF!"},{"$error":"#REF!"},{"$error":"#REF!"},{"$error":"#REF!"},{"$error":"#REF!"},{"$error":"#REF!"},{"$error":"#REF!"},{"$error":"#REF!"}]
["TS3L7-PSU1100W",{"$f":"IF(A515=B455,1,\"\")","v":{"$error":"#REF!"}},{"$f":"IF(A515=C455,2,\"\")","v":{"$error":"#REF!"}},{"$f":"IF(A515=D455,3,\"\")","v":{"$error":"#REF!"}},{"$f":"IF(A515=E455,4,\"\")","v":{"$error":"#REF!"}},{"$f":"IF(A515=F455,5,\"\")","v":{"$error":"#REF!"}},{"$f":"IF(A515=G455,6,\"\")","v":{"$error":"#REF!"}},{"$f":"IF(A515=H455,7,\"\")","v":{"$error":"#REF!"}},{"$f":"IF(A515=I455,8,\"\")","v":{"$error":"#REF!"}},{"$error":"#REF!"},"TS3L7-PSU1100W",{"$error":"#REF!"},{"$error":"#REF!"},{"$error":"#REF!"},{"$error":"#REF!"},{"$error":"#REF!"},{"$error":"#REF!"},{"$error":"#REF!"},{"$error":"#REF!"},{"$error":"#REF!"},"TS3L7-PSU1100W",{"$error":"#REF!"},{"$error":"#REF!"},{"$error":"#REF!"},{"$error":"#REF!"},{"$error":"#REF!"},{"$error":"#REF!"},{"$error":"#REF!"},{"$error":"#REF!"},{"$error":"#REF!"}]
["TS3L7-PSU2000W",{"$f":"IF(A516=B455,1,\"\")","v":{"$error":"#REF!"}},{"$f":"IF(A516=C455,2,\"\")","v":{"$error":"#REF!"}},{"$f":"IF(A516=D455,3,\"\")","v":{"$error":"#REF!"}},{"$f":"IF(A516=E455,4,\"\")","v":{"$error":"#REF!"}},{"$f":"IF(A516=F455,5,\"\")","v":{"$error":"#REF!"}},{"$f":"IF(A516=G455,6,\"\")","v":{"$error":"#REF!"}},{"$f":"IF(A516=H455,7,\"\")","v":{"$error":"#REF!"}},{"$f":"IF(A516=I455,8,\"\")","v":{"$error":"#REF!"}},{"$error":"#REF!"},"TS3L7-PSU2000W",{"$error":"#REF!"},{"$error":"#REF!"},{"$error":"#REF!"},{"$error":"#REF!"},{"$error":"#REF!"},{"$error":"#REF!"},{"$error":"#REF!"},{"$error":"#REF!"},{"$error":"#REF!"},"TS3L7-PSU2000W",{"$error":"#REF!"},{"$error":"#REF!"},{"$error":"#REF!"},{"$error":"#REF!"},{"$error":"#REF!"},{"$error":"#REF!"},{"$error":"#REF!"},{"$error":"#REF!"},{"$error":"#REF!"}]
["TS3L7-RI3840GB",{"$f":"IF(A517=B455,1,\"\")","v":{"$error":"#REF!"}},{"$f":"IF(A517=C455,2,\"\")","v":{"$error":"#REF!"}},{"$f":"IF(A517=D455,3,\"\")","v":{"$error":"#REF!"}},{"$f":"IF(A517=E455,4,\"\")","v":{"$error":"#REF!"}},{"$f":"IF(A517=F455,5,\"\")","v":{"$error":"#REF!"}},{"$f":"IF(A517=G455,6,\"\")","v":{"$error":"#REF!"}},{"$f":"IF(A517=H455,7,\"\")","v":{"$error":"#REF!"}},{"$f":"IF(A517=I455,8,\"\")","v":{"$error":"#REF!"}},{"$error":"#REF!"},"TS3L7-RI3840GB",{"$error":"#REF!"},{"$error":"#REF!"},{"$error":"#REF!"},{"$error":"#REF!"},{"$error":"#REF!"},{"$error":"#REF!"},{"$error":"#REF!"},{"$error":"#REF!"},{"$error":"#REF!"},"TS3L7-RI3840GB",{"$error":"#REF!"},{"$error":"#REF!"},{"$error":"#REF!"},{"$error":"#REF!"},{"$error":"#REF!"},{"$error":"#REF!"},{"$error":"#REF!"},{"$error":"#REF!"},{"$error":"#REF!"}]
["TS3L7-RI7680GB",{"$f":"IF(A518=B455,1,\"\")","v":{"$error":"#REF!"}},{"$f":"IF(A518=C455,2,\"\")","v":{"$error":"#REF!"}},{"$f":"IF(A518=D455,3,\"\")","v":{"$error":"#REF!"}},{"$f":"IF(A518=E455,4,\"\")","v":{"$error":"#REF!"}},{"$f":"IF(A518=F455,5,\"\")","v":{"$error":"#REF!"}},{"$f":"IF(A518=G455,6,\"\")","v":{"$error":"#REF!"}},{"$f":"IF(A518=H455,7,\"\")","v":{"$error":"#REF!"}},{"$f":"IF(A518=I455,8,\"\")","v":{"$error":"#REF!"}},{"$error":"#REF!"},"TS3L7-RI7680GB",{"$error":"#REF!"},{"$error":"#REF!"},{"$error":"#REF!"},{"$error":"#REF!"},{"$error":"#REF!"},{"$error":"#REF!"},{"$error":"#REF!"},{"$error":"#REF!"},{"$error":"#REF!"},"TS3L7-RI7680GB",{"$error":"#REF!"},{"$error":"#REF!"},{"$error":"#REF!"},{"$error":"#REF!"},{"$error":"#REF!"},{"$error":"#REF!"},{"$error":"#REF!"},{"$error":"#REF!"},{"$error":"#REF!"}]
["TS3L7-WI800GB",{"$f":"IF(A519=B455,1,\"\")","v":{"$error":"#REF!"}},{"$f":"IF(A519=C455,2,\"\")","v":{"$error":"#REF!"}},{"$f":"IF(A519=D455,3,\"\")","v":{"$error":"#REF!"}},{"$f":"IF(A519=E455,4,\"\")","v":{"$error":"#REF!"}},{"$f":"IF(A519=F455,5,\"\")","v":{"$error":"#REF!"}},{"$f":"IF(A519=G455,6,\"\")","v":{"$error":"#REF!"}},{"$f":"IF(A519=H455,7,\"\")","v":{"$error":"#REF!"}},{"$f":"IF(A519=I455,8,\"\")","v":{"$error":"#REF!"}},{"$error":"#REF!"},"TS3L7-WI800GB",{"$error":"#REF!"},{"$error":"#REF!"},{"$error":"#REF!"},{"$error":"#REF!"},{"$error":"#REF!"},{"$error":"#REF!"},{"$error":"#REF!"},{"$error":"#REF!"},{"$error":"#REF!"},"TS3L7-WI800GB",{"$error":"#REF!"},{"$error":"#REF!"},{"$error":"#REF!"},{"$error":"#REF!"},{"$error":"#REF!"},{"$error":"#REF!"},{"$error":"#REF!"},{"$error":"#REF!"},{"$error":"#REF!"}]
["TS3L7-WI1600GB",{"$f":"IF(A520=B455,1,\"\")","v":{"$error":"#REF!"}},{"$f":"IF(A520=C455,2,\"\")","v":{"$error":"#REF!"}},{"$f":"IF(A520=D455,3,\"\")","v":{"$error":"#REF!"}},{"$f":"IF(A520=E455,4,\"\")","v":{"$error":"#REF!"}},{"$f":"IF(A520=F455,5,\"\")","v":{"$error":"#REF!"}},{"$f":"IF(A520=G455,6,\"\")","v":{"$error":"#REF!"}},{"$f":"IF(A520=H455,7,\"\")","v":{"$error":"#REF!"}},{"$f":"IF(A520=I455,8,\"\")","v":{"$error":"#REF!"}},{"$error":"#REF!"},"TS3L7-WI1600GB",{"$error":"#REF!"},{"$error":"#REF!"},{"$error":"#REF!"},{"$error":"#REF!"},{"$error":"#REF!"},{"$error":"#REF!"},{"$error":"#REF!"},{"$error":"#REF!"},{"$f":"IF(SUM(L520:S520)=0,\"\",CONCATENATE(\" (Slot PCI \",L520,\".\",M520,\".\",N520,\".\",O520,\".\",P520,\".\",Q520,\".\",R520,\".\",S520,\")\"))","v":{"$error":"#REF!"}},"TS3L7-WI1600GB",{"$error":"#REF!"},{"$error":"#REF!"},{"$error":"#REF!"},{"$error":"#REF!"},{"$error":"#REF!"},{"$error":"#REF!"},{"$error":"#REF!"},{"$error":"#REF!"},{"$error":"#REF!"}]
["TS3L7-TESLAT4",{"$f":"IF(A521=B455,1,\"\")","v":{"$error":"#REF!"}},{"$f":"IF(A521=C455,2,\"\")","v":{"$error":"#REF!"}},{"$f":"IF(A521=D455,3,\"\")","v":{"$error":"#REF!"}},{"$f":"IF(A521=E455,4,\"\")","v":{"$error":"#REF!"}},{"$f":"IF(A521=F455,5,\"\")","v":{"$error":"#REF!"}},{"$f":"IF(A521=G455,6,\"\")","v":{"$error":"#REF!"}},{"$f":"IF(A521=H455,7,\"\")","v":{"$error":"#REF!"}},{"$f":"IF(A521=I455,8,\"\")","v":{"$error":"#REF!"}},{"$error":"#REF!"},"TS3L7-TESLAT4",{"$error":"#REF!"},{"$error":"#REF!"},{"$error":"#REF!"},{"$error":"#REF!"},{"$error":"#REF!"},{"$error":"#REF!"},{"$error":"#REF!"},{"$error":"#REF!"},{"$error":"#REF!"},"TS3L7-TESLAT4",{"$error":"#REF!"},{"$error":"#REF!"},{"$error":"#REF!"},{"$error":"#REF!"},{"$error":"#REF!"},{"$error":"#REF!"},{"$error":"#REF!"},{"$error":"#REF!"},{"$error":"#REF!"}]
["TS3L7-RTX6000",{"$f":"IF(A522=B455,1,\"\")","v":{"$error":"#REF!"}},{"$f":"IF(A522=C455,2,\"\")","v":{"$error":"#REF!"}},{"$f":"IF(A522=D455,3,\"\")","v":{"$error":"#REF!"}},{"$f":"IF(A522=E455,4,\"\")","v":{"$error":"#REF!"}},{"$f":"IF(A522=F455,5,\"\")","v":{"$error":"#REF!"}},{"$f":"IF(A522=G455,6,\"\")","v":{"$error":"#REF!"}},{"$f":"IF(A522=H455,7,\"\")","v":{"$error":"#REF!"}},{"$f":"IF(A522=I455,8,\"\")","v":{"$error":"#REF!"}},{"$error":"#REF!"},"TS3L7-RTX6000",{"$error":"#REF!"},{"$error":"#REF!"},{"$error":"#REF!"},{"$error":"#REF!"},{"$error":"#REF!"},{"$error":"#REF!"},{"$error":"#REF!"},{"$error":"#REF!"},{"$error":"#REF!"},"TS3L7-RTX6000",{"$error":"#REF!"},{"$error":"#REF!"},{"$error":"#REF!"},{"$error":"#REF!"},{"$error":"#REF!"},{"$error":"#REF!"},{"$error":"#REF!"},{"$error":"#REF!"},{"$error":"#REF!"}]
["TS3L7-TESLAM10",{"$f":"IF(A523=B455,1,\"\")","v":{"$error":"#REF!"}},{"$f":"IF(A523=C455,2,\"\")","v":{"$error":"#REF!"}},{"$f":"IF(A523=D455,3,\"\")","v":{"$error":"#REF!"}},{"$f":"IF(A523=E455,4,\"\")","v":{"$error":"#REF!"}},{"$f":"IF(A523=F455,5,\"\")","v":{"$error":"#REF!"}},{"$f":"IF(A523=G455,6,\"\")","v":{"$error":"#REF!"}},{"$f":"IF(A523=H455,7,\"\")","v":{"$error":"#REF!"}},{"$f":"IF(A523=I455,8,\"\")","v":{"$error":"#REF!"}},{"$error":"#REF!"},"TS3L7-TESLAM10",{"$error":"#REF!"},{"$error":"#REF!"},{"$error":"#REF!"},{"$error":"#REF!"},{"$error":"#REF!"},{"$error":"#REF!"},{"$error":"#REF!"},{"$error":"#REF!"},{"$error":"#REF!"},"TS3L7-TESLAM10",{"$error":"#REF!"},{"$error":"#REF!"},{"$error":"#REF!"},{"$error":"#REF!"},{"$error":"#REF!"},{"$error":"#REF!"},{"$error":"#REF!"},{"$error":"#REF!"},{"$error":"#REF!"}]
["TS3L7-V100S32G",{"$f":"IF(A524=B455,1,\"\")","v":{"$error":"#REF!"}},{"$f":"IF(A524=C455,2,\"\")","v":{"$error":"#REF!"}},{"$f":"IF(A524=D455,3,\"\")","v":{"$error":"#REF!"}},{"$f":"IF(A524=E455,4,\"\")","v":{"$error":"#REF!"}},{"$f":"IF(A524=F455,5,\"\")","v":{"$error":"#REF!"}},{"$f":"IF(A524=G455,6,\"\")","v":{"$error":"#REF!"}},{"$f":"IF(A524=H455,7,\"\")","v":{"$error":"#REF!"}},{"$f":"IF(A524=I455,8,\"\")","v":{"$error":"#REF!"}},{"$f":"IF(SUM(B524:I524)=0,\"\",CONCATENATE(\" (Slot PCI \",B524,\".\",C524,\".\",D524,\".\",E524,\".\",F524,\".\",G524,\".\",H524,\".\",I524,\")\"))","v":{"$error":"#REF!"}},"TS3L7-V100S32G",{"$f":"IF(K524=$L$455,1,\"\")","v":{"$error":"#REF!"}},{"$f":"IF(K524=$M$455,2,\"\")","v":{"$error":"#REF!"}},{"$f":"IF(K524=$N$455,3,\"\")","v":{"$error":"#REF!"}},{"$f":"IF(K524=$O$455,4,\"\")","v":{"$error":"#REF!"}},{"$f":"IF(K524=$P$455,5,\"\")","v":{"$error":"#REF!"}},{"$f":"IF(K524=$Q$455,6,\"\")","v":{"$error":"#REF!"}},{"$f":"IF(K524=$R$455,7,\"\")","v":{"$error":"#REF!"}},{"$f":"IF(K524=$S$455,8,\"\")","v":{"$error":"#REF!"}},{"$f":"IF(SUM(L524:S524)=0,\"\",CONCATENATE(\" (Slot PCI \",L524,\".\",M524,\".\",N524,\".\",O524,\".\",P524,\".\",Q524,\".\",R524,\".\",S524,\")\"))","v":{"$error":"#REF!"}},"TS3L7-V100S32G",{"$f":"IF(U524=$V$455,1,\"\")","v":{"$error":"#REF!"}},{"$f":"IF(U524=$W$455,2,\"\")","v":{"$error":"#REF!"}},{"$f":"IF(U524=$X$455,3,\"\")","v":{"$error":"#REF!"}},{"$f":"IF(U524=$Y$455,4,\"\")","v":{"$error":"#REF!"}},{"$f":"IF(U524=$Z$455,5,\"\")","v":{"$error":"#REF!"}},{"$f":"IF(U524=$AA$455,6,\"\")","v":{"$error":"#REF!"}},{"$f":"IF(U524=$AB$455,7,\"\")","v":{"$error":"#REF!"}},{"$f":"IF(U524=$AC$455,8,\"\")","v":{"$error":"#REF!"}},{"$f":"IF(SUM(V524:AC524)=0,\"\",CONCATENATE(\" (Slot PCI \",V524,\".\",W524,\".\",X524,\".\",Y524,\".\",Z524,\".\",AA524,\".\",AB524,\".\",AC524,\")\"))","v":{"$error":"#REF!"}}]
["TS3L7-WINDC",{"$f":"IF(A525=B455,1,\"\")","v":{"$error":"#REF!"}},{"$f":"IF(A525=C455,2,\"\")","v":{"$error":"#REF!"}},{"$f":"IF(A525=D455,3,\"\")","v":{"$error":"#REF!"}},{"$f":"IF(A525=E455,4,\"\")","v":{"$error":"#REF!"}},{"$f":"IF(A525=F455,5,\"\")","v":{"$error":"#REF!"}},{"$f":"IF(A525=G455,6,\"\")","v":{"$error":"#REF!"}},{"$f":"IF(A525=H455,7,\"\")","v":{"$error":"#REF!"}},{"$f":"IF(A525=I455,8,\"\")","v":{"$error":"#REF!"}},{"$error":"#REF!"},"TS3L7-WINDC",{"$error":"#REF!"},{"$error":"#REF!"},{"$error":"#REF!"},{"$error":"#REF!"},{"$error":"#REF!"},{"$error":"#REF!"},{"$error":"#REF!"},{"$error":"#REF!"},{"$error":"#REF!"},"TS3L7-WINDC",{"$error":"#REF!"},{"$error":"#REF!"},{"$error":"#REF!"},{"$error":"#REF!"},{"$error":"#REF!"},{"$error":"#REF!"},{"$error":"#REF!"},{"$error":"#REF!"},{"$error":"#REF!"}]
["TS3L7-WINDC2C",{"$f":"IF(A526=B455,1,\"\")","v":{"$error":"#REF!"}},{"$f":"IF(A526=C455,2,\"\")","v":{"$error":"#REF!"}},{"$f":"IF(A526=D455,3,\"\")","v":{"$error":"#REF!"}},{"$f":"IF(A526=E455,4,\"\")","v":{"$error":"#REF!"}},{"$f":"IF(A526=F455,5,\"\")","v":{"$error":"#REF!"}},{"$f":"IF(A526=G455,6,\"\")","v":{"$error":"#REF!"}},{"$f":"IF(A526=H455,7,\"\")","v":{"$error":"#REF!"}},{"$f":"IF(A526=I455,8,\"\")","v":{"$error":"#REF!"}},{"$error":"#REF!"},"TS3L7-WINDC2C",{"$error":"#REF!"},{"$error":"#REF!"},{"$error":"#REF!"},{"$error":"#REF!"},{"$error":"#REF!"},{"$error":"#REF!"},{"$error":"#REF!"},{"$error":"#REF!"},{"$error":"#REF!"},"TS3L7-WINDC2C",{"$error":"#REF!"},{"$error":"#REF!"},{"$error":"#REF!"},{"$error":"#REF!"},{"$error":"#REF!"},{"$error":"#REF!"},{"$error":"#REF!"},{"$error":"#REF!"},{"$error":"#REF!"}]
["TS3L7-WINDC16C",{"$f":"IF(A527=B455,1,\"\")","v":{"$error":"#REF!"}},{"$f":"IF(A527=C455,2,\"\")","v":{"$error":"#REF!"}},{"$f":"IF(A527=D455,3,\"\")","v":{"$error":"#REF!"}},{"$f":"IF(A527=E455,4,\"\")","v":{"$error":"#REF!"}},{"$f":"IF(A527=F455,5,\"\")","v":{"$error":"#REF!"}},{"$f":"IF(A527=G455,6,\"\")","v":{"$error":"#REF!"}},{"$f":"IF(A527=H455,7,\"\")","v":{"$error":"#REF!"}},{"$f":"IF(A527=I455,8,\"\")","v":{"$error":"#REF!"}},{"$error":"#REF!"},"TS3L7-WINDC16C",{"$error":"#REF!"},{"$error":"#REF!"},{"$error":"#REF!"},{"$error":"#REF!"},{"$error":"#REF!"},{"$error":"#REF!"},{"$error":"#REF!"},{"$error":"#REF!"},{"$error":"#REF!"},"TS3L7-WINDC16C",{"$error":"#REF!"},{"$error":"#REF!"},{"$error":"#REF!"},{"$error":"#REF!"},{"$error":"#REF!"},{"$error":"#REF!"},{"$error":"#REF!"},{"$error":"#REF!"},{"$error":"#REF!"}]
["TS3L7-RJ453M",{"$f":"IF(A528=B455,1,\"\")","v":{"$error":"#REF!"}},{"$f":"IF(A528=C455,2,\"\")","v":{"$error":"#REF!"}},{"$f":"IF(A528=D455,3,\"\")","v":{"$error":"#REF!"}},{"$f":"IF(A528=E455,4,\"\")","v":{"$error":"#REF!"}},{"$f":"IF(A528=F455,5,\"\")","v":{"$error":"#REF!"}},{"$f":"IF(A528=G455,6,\"\")","v":{"$error":"#REF!"}},{"$f":"IF(A528=H455,7,\"\")","v":{"$error":"#REF!"}},{"$f":"IF(A528=I455,8,\"\")","v":{"$error":"#REF!"}},{"$error":"#REF!"},"TS3L7-RJ453M",{"$error":"#REF!"},{"$error":"#REF!"},{"$error":"#REF!"},{"$error":"#REF!"},{"$error":"#REF!"},{"$error":"#REF!"},{"$error":"#REF!"},{"$error":"#REF!"},{"$error":"#REF!"},"TS3L7-RJ453M",{"$error":"#REF!"},{"$error":"#REF!"},{"$error":"#REF!"},{"$error":"#REF!"},{"$error":"#REF!"},{"$error":"#REF!"},{"$error":"#REF!"},{"$error":"#REF!"},{"$error":"#REF!"}]
["TS3L7-MEL100M3",{"$f":"IF(A529=B455,1,\"\")","v":{"$error":"#REF!"}},{"$f":"IF(A529=C455,2,\"\")","v":{"$error":"#REF!"}},{"$f":"IF(A529=D455,3,\"\")","v":{"$error":"#REF!"}},{"$f":"IF(A529=E455,4,\"\")","v":{"$error":"#REF!"}},{"$f":"IF(A529=F455,5,\"\")","v":{"$error":"#REF!"}},{"$f":"IF(A529=G455,6,\"\")","v":{"$error":"#REF!"}},{"$f":"IF(A529=H455,7,\"\")","v":{"$error":"#REF!"}},{"$f":"IF(A529=I455,8,\"\")","v":{"$error":"#REF!"}},{"$error":"#REF!"},"TS3L7-MEL100M3",{"$error":"#REF!"},{"$error":"#REF!"},{"$error":"#REF!"},{"$error":"#REF!"},{"$error":"#REF!"},{"$error":"#REF!"},{"$error":"#REF!"},{"$error":"#REF!"},{"$error":"#REF!"},"TS3L7-MEL100M3",{"$error":"#REF!"},{"$error":"#REF!"},{"$error":"#REF!"},{"$error":"#REF!"},{"$error":"#REF!"},{"$error":"#REF!"},{"$error":"#REF!"},{"$error":"#REF!"},{"$error":"#REF!"}]
["TS3L7-MEL100M10",{"$f":"IF(A530=B455,1,\"\")","v":{"$error":"#REF!"}},{"$f":"IF(A530=C455,2,\"\")","v":{"$error":"#REF!"}},{"$f":"IF(A530=D455,3,\"\")","v":{"$error":"#REF!"}},{"$f":"IF(A530=E455,4,\"\")","v":{"$error":"#REF!"}},{"$f":"IF(A530=F455,5,\"\")","v":{"$error":"#REF!"}},{"$f":"IF(A530=G455,6,\"\")","v":{"$error":"#REF!"}},{"$f":"IF(A530=H455,7,\"\")","v":{"$error":"#REF!"}},{"$f":"IF(A530=I455,8,\"\")","v":{"$error":"#REF!"}},{"$error":"#REF!"},"TS3L7-MEL100M10",{"$error":"#REF!"},{"$error":"#REF!"},{"$error":"#REF!"},{"$error":"#REF!"},{"$error":"#REF!"},{"$error":"#REF!"},{"$error":"#REF!"},{"$error":"#REF!"},{"$error":"#REF!"},"TS3L7-MEL100M10",{"$error":"#REF!"},{"$error":"#REF!"},{"$error":"#REF!"},{"$error":"#REF!"},{"$error":"#REF!"},{"$error":"#REF!"},{"$error":"#REF!"},{"$error":"#REF!"},{"$error":"#REF!"}]
["TS3L7-QSFP28",{"$f":"IF(A531=B455,1,\"\")","v":{"$error":"#REF!"}},{"$f":"IF(A531=C455,2,\"\")","v":{"$error":"#REF!"}},{"$f":"IF(A531=D455,3,\"\")","v":{"$error":"#REF!"}},{"$f":"IF(A531=E455,4,\"\")","v":{"$error":"#REF!"}},{"$f":"IF(A531=F455,5,\"\")","v":{"$error":"#REF!"}},{"$f":"IF(A531=G455,6,\"\")","v":{"$error":"#REF!"}},{"$f":"IF(A531=H455,7,\"\")","v":{"$error":"#REF!"}},{"$f":"IF(A531=I455,8,\"\")","v":{"$error":"#REF!"}},{"$error":"#REF!"},"TS3L7-QSFP28",{"$error":"#REF!"},{"$error":"#REF!"},{"$error":"#REF!"},{"$error":"#REF!"},{"$error":"#REF!"},{"$error":"#REF!"},{"$error":"#REF!"},{"$error":"#REF!"},{"$error":"#REF!"},"TS3L7-QSFP28",{"$error":"#REF!"},{"$error":"#REF!"},{"$error":"#REF!"},{"$error":"#REF!"},{"$error":"#REF!"},{"$error":"#REF!"},{"$error":"#REF!"},{"$error":"#REF!"},{"$error":"#REF!"}]
["TS3L7-10GBIC",{"$f":"IF(A532=B455,1,\"\")","v":{"$error":"#REF!"}},{"$f":"IF(A532=C455,2,\"\")","v":{"$error":"#REF!"}},{"$f":"IF(A532=D455,3,\"\")","v":{"$error":"#REF!"}},{"$f":"IF(A532=E455,4,\"\")","v":{"$error":"#REF!"}},{"$f":"IF(A532=F455,5,\"\")","v":{"$error":"#REF!"}},{"$f":"IF(A532=G455,6,\"\")","v":{"$error":"#REF!"}},{"$f":"IF(A532=H455,7,\"\")","v":{"$error":"#REF!"}},{"$f":"IF(A532=I455,8,\"\")","v":{"$error":"#REF!"}},{"$error":"#REF!"},"TS3L7-10GBIC",{"$error":"#REF!"},{"$error":"#REF!"},{"$error":"#REF!"},{"$error":"#REF!"},{"$error":"#REF!"},{"$error":"#REF!"},{"$error":"#REF!"},{"$error":"#REF!"},{"$error":"#REF!"},"TS3L7-10GBIC",{"$error":"#REF!"},{"$error":"#REF!"},{"$error":"#REF!"},{"$error":"#REF!"},{"$error":"#REF!"},{"$error":"#REF!"},{"$error":"#REF!"},{"$error":"#REF!"},{"$error":"#REF!"}]
["TS3L7-DAC3M",{"$f":"IF(A533=B455,1,\"\")","v":{"$error":"#REF!"}},{"$f":"IF(A533=C455,2,\"\")","v":{"$error":"#REF!"}},{"$f":"IF(A533=D455,3,\"\")","v":{"$error":"#REF!"}},{"$f":"IF(A533=E455,4,\"\")","v":{"$error":"#REF!"}},{"$f":"IF(A533=F455,5,\"\")","v":{"$error":"#REF!"}},{"$f":"IF(A533=G455,6,\"\")","v":{"$error":"#REF!"}},{"$f":"IF(A533=H455,7,\"\")","v":{"$error":"#REF!"}},{"$f":"IF(A533=I455,8,\"\")","v":{"$error":"#REF!"}},{"$error":"#REF!"},"TS3L7-DAC3M",{"$error":"#REF!"},{"$error":"#REF!"},{"$error":"#REF!"},{"$error":"#REF!"},{"$error":"#REF!"},{"$error":"#REF!"},{"$error":"#REF!"},{"$error":"#REF!"},{"$error":"#REF!"},"TS3L7-DAC3M",{"$error":"#REF!"},{"$error":"#REF!"},{"$error":"#REF!"},{"$error":"#REF!"},{"$error":"#REF!"},{"$error":"#REF!"},{"$error":"#REF!"},{"$error":"#REF!"},{"$error":"#REF!"}]
["TS3L7-BZLLCD",{"$f":"IF(A534=B455,1,\"\")","v":{"$error":"#REF!"}},{"$f":"IF(A534=C455,2,\"\")","v":{"$error":"#REF!"}},{"$f":"IF(A534=D455,3,\"\")","v":{"$error":"#REF!"}},{"$f":"IF(A534=E455,4,\"\")","v":{"$error":"#REF!"}},{"$f":"IF(A534=F455,5,\"\")","v":{"$error":"#REF!"}},{"$f":"IF(A534=G455,6,\"\")","v":{"$error":"#REF!"}},{"$f":"IF(A534=H455,7,\"\")","v":{"$error":"#REF!"}},{"$f":"IF(A534=I455,8,\"\")","v":{"$error":"#REF!"}},{"$error":"#REF!"},"TS3L7-BZLLCD",{"$error":"#REF!"},{"$error":"#REF!"},{"$error":"#REF!"},{"$error":"#REF!"},{"$error":"#REF!"},{"$error":"#REF!"},{"$error":"#REF!"},{"$error":"#REF!"},{"$error":"#REF!"},"TS3L7-BZLLCD",{"$error":"#REF!"},{"$error":"#REF!"},{"$error":"#REF!"},{"$error":"#REF!"},{"$error":"#REF!"},{"$error":"#REF!"},{"$error":"#REF!"},{"$error":"#REF!"},{"$error":"#REF!"}]
["TS3L7-BZLSTD",{"$f":"IF(A535=B455,1,\"\")","v":{"$error":"#REF!"}},{"$f":"IF(A535=C455,2,\"\")","v":{"$error":"#REF!"}},{"$f":"IF(A535=D455,3,\"\")","v":{"$error":"#REF!"}},{"$f":"IF(A535=E455,4,\"\")","v":{"$error":"#REF!"}},{"$f":"IF(A535=F455,5,\"\")","v":{"$error":"#REF!"}},{"$f":"IF(A535=G455,6,\"\")","v":{"$error":"#REF!"}},{"$f":"IF(A535=H455,7,\"\")","v":{"$error":"#REF!"}},{"$f":"IF(A535=I455,8,\"\")","v":{"$error":"#REF!"}},{"$error":"#REF!"},"TS3L7-BZLSTD",{"$error":"#REF!"},{"$error":"#REF!"},{"$error":"#REF!"},{"$error":"#REF!"},{"$error":"#REF!"},{"$error":"#REF!"},{"$error":"#REF!"},{"$error":"#REF!"},{"$error":"#REF!"},"TS3L7-BZLSTD",{"$error":"#REF!"},{"$error":"#REF!"},{"$error":"#REF!"},{"$error":"#REF!"},{"$error":"#REF!"},{"$error":"#REF!"},{"$error":"#REF!"},{"$error":"#REF!"},{"$error":"#REF!"}]
["TS3L7-ISDM32GB",{"$f":"IF(A536=B455,1,\"\")","v":{"$error":"#REF!"}},{"$f":"IF(A536=C455,2,\"\")","v":{"$error":"#REF!"}},{"$f":"IF(A536=D455,3,\"\")","v":{"$error":"#REF!"}},{"$f":"IF(A536=E455,4,\"\")","v":{"$error":"#REF!"}},{"$f":"IF(A536=F455,5,\"\")","v":{"$error":"#REF!"}},{"$f":"IF(A536=G455,6,\"\")","v":{"$error":"#REF!"}},{"$f":"IF(A536=H455,7,\"\")","v":{"$error":"#REF!"}},{"$f":"IF(A536=I455,8,\"\")","v":{"$error":"#REF!"}},{"$error":"#REF!"},"TS3L7-ISDM32GB",{"$error":"#REF!"},{"$error":"#REF!"},{"$error":"#REF!"},{"$error":"#REF!"},{"$error":"#REF!"},{"$error":"#REF!"},{"$error":"#REF!"},{"$error":"#REF!"},{"$error":"#REF!"},"TS3L7-ISDM32GB",{"$error":"#REF!"},{"$error":"#REF!"},{"$error":"#REF!"},{"$error":"#REF!"},{"$error":"#REF!"},{"$error":"#REF!"},{"$error":"#REF!"},{"$error":"#REF!"},{"$error":"#REF!"}]
["TS3L7-H840",{"$f":"IF(A537=B455,1,\"\")","v":{"$error":"#REF!"}},{"$f":"IF(A537=C455,2,\"\")","v":{"$error":"#REF!"}},{"$f":"IF(A537=D455,3,\"\")","v":{"$error":"#REF!"}},{"$f":"IF(A537=E455,4,\"\")","v":{"$error":"#REF!"}},{"$f":"IF(A537=F455,5,\"\")","v":{"$error":"#REF!"}},{"$f":"IF(A537=G455,6,\"\")","v":{"$error":"#REF!"}},{"$f":"IF(A537=H455,7,\"\")","v":{"$error":"#REF!"}},{"$f":"IF(A537=I455,8,\"\")","v":{"$error":"#REF!"}},{"$error":"#REF!"},"TS3L7-H840",{"$error":"#REF!"},{"$error":"#REF!"},{"$error":"#REF!"},{"$error":"#REF!"},{"$error":"#REF!"},{"$error":"#REF!"},{"$error":"#REF!"},{"$error":"#REF!"},{"$error":"#REF!"},"TS3L7-H840",{"$error":"#REF!"},{"$error":"#REF!"},{"$error":"#REF!"},{"$error":"#REF!"},{"$error":"#REF!"},{"$error":"#REF!"},{"$error":"#REF!"},{"$error":"#REF!"},{"$error":"#REF!"}]
["TS3L7-VS7STD6AK",{"$f":"IF(A538=B455,1,\"\")","v":{"$error":"#REF!"}},{"$f":"IF(A538=C455,2,\"\")","v":{"$error":"#REF!"}},{"$f":"IF(A538=D455,3,\"\")","v":{"$error":"#REF!"}},{"$f":"IF(A538=E455,4,\"\")","v":{"$error":"#REF!"}},{"$f":"IF(A538=F455,5,\"\")","v":{"$error":"#REF!"}},{"$f":"IF(A538=G455,6,\"\")","v":{"$error":"#REF!"}},{"$f":"IF(A538=H455,7,\"\")","v":{"$error":"#REF!"}},{"$f":"IF(A538=I455,8,\"\")","v":{"$error":"#REF!"}},{"$error":"#REF!"},"TS3L7-VS7STD6AK",{"$error":"#REF!"},{"$error":"#REF!"},{"$error":"#REF!"},{"$error":"#REF!"},{"$error":"#REF!"},{"$error":"#REF!"},{"$error":"#REF!"},{"$error":"#REF!"},{"$error":"#REF!"},"TS3L7-VS7STD6AK",{"$error":"#REF!"},{"$error":"#REF!"},{"$error":"#REF!"},{"$error":"#REF!"},{"$error":"#REF!"},{"$error":"#REF!"},{"$error":"#REF!"},{"$error":"#REF!"},{"$error":"#REF!"}]
["TS3L7-VS7STD",{"$f":"IF(A539=B455,1,\"\")","v":{"$error":"#REF!"}},{"$f":"IF(A539=C455,2,\"\")","v":{"$error":"#REF!"}},{"$f":"IF(A539=D455,3,\"\")","v":{"$error":"#REF!"}},{"$f":"IF(A539=E455,4,\"\")","v":{"$error":"#REF!"}},{"$f":"IF(A539=F455,5,\"\")","v":{"$error":"#REF!"}},{"$f":"IF(A539=G455,6,\"\")","v":{"$error":"#REF!"}},{"$f":"IF(A539=H455,7,\"\")","v":{"$error":"#REF!"}},{"$f":"IF(A539=I455,8,\"\")","v":{"$error":"#REF!"}},{"$error":"#REF!"},"TS3L7-VS7STD",{"$error":"#REF!"},{"$error":"#REF!"},{"$error":"#REF!"},{"$error":"#REF!"},{"$error":"#REF!"},{"$error":"#REF!"},{"$error":"#REF!"},{"$error":"#REF!"},{"$error":"#REF!"},"TS3L7-VS7STD",{"$error":"#REF!"},{"$error":"#REF!"},{"$error":"#REF!"},{"$error":"#REF!"},{"$error":"#REF!"},{"$error":"#REF!"},{"$error":"#REF!"},{"$error":"#REF!"},{"$error":"#REF!"}]
["TS3L7-VS7EPL6AK",{"$f":"IF(A540=B455,1,\"\")","v":{"$error":"#REF!"}},{"$f":"IF(A540=C455,2,\"\")","v":{"$error":"#REF!"}},{"$f":"IF(A540=D455,3,\"\")","v":{"$error":"#REF!"}},{"$f":"IF(A540=E455,4,\"\")","v":{"$error":"#REF!"}},{"$f":"IF(A540=F455,5,\"\")","v":{"$error":"#REF!"}},{"$f":"IF(A540=G455,6,\"\")","v":{"$error":"#REF!"}},{"$f":"IF(A540=H455,7,\"\")","v":{"$error":"#REF!"}},{"$f":"IF(A540=I455,8,\"\")","v":{"$error":"#REF!"}},{"$error":"#REF!"},"TS3L7-VS7EPL6AK",{"$error":"#REF!"},{"$error":"#REF!"},{"$error":"#REF!"},{"$error":"#REF!"},{"$error":"#REF!"},{"$error":"#REF!"},{"$error":"#REF!"},{"$error":"#REF!"},{"$error":"#REF!"},"TS3L7-VS7EPL6AK",{"$error":"#REF!"},{"$error":"#REF!"},{"$error":"#REF!"},{"$error":"#REF!"},{"$error":"#REF!"},{"$error":"#REF!"},{"$error":"#REF!"},{"$error":"#REF!"},{"$error":"#REF!"}]
["TS3L7-VS7EPL",{"$f":"IF(A541=B455,1,\"\")","v":{"$error":"#REF!"}},{"$f":"IF(A541=C455,2,\"\")","v":{"$error":"#REF!"}},{"$f":"IF(A541=D455,3,\"\")","v":{"$error":"#REF!"}},{"$f":"IF(A541=E455,4,\"\")","v":{"$error":"#REF!"}},{"$f":"IF(A541=F455,5,\"\")","v":{"$error":"#REF!"}},{"$f":"IF(A541=G455,6,\"\")","v":{"$error":"#REF!"}},{"$f":"IF(A541=H455,7,\"\")","v":{"$error":"#REF!"}},{"$f":"IF(A541=I455,8,\"\")","v":{"$error":"#REF!"}},{"$error":"#REF!"},"TS3L7-VS7EPL",{"$error":"#REF!"},{"$error":"#REF!"},{"$error":"#REF!"},{"$error":"#REF!"},{"$error":"#REF!"},{"$error":"#REF!"},{"$error":"#REF!"},{"$error":"#REF!"},{"$error":"#REF!"},"TS3L7-VS7EPL",{"$error":"#REF!"},{"$error":"#REF!"},{"$error":"#REF!"},{"$error":"#REF!"},{"$error":"#REF!"},{"$error":"#REF!"},{"$error":"#REF!"},{"$error":"#REF!"},{"$error":"#REF!"}]
["TS3L7-VCS7STD",{"$f":"IF(A542=B455,1,\"\")","v":{"$error":"#REF!"}},{"$f":"IF(A542=C455,2,\"\")","v":{"$error":"#REF!"}},{"$f":"IF(A542=D455,3,\"\")","v":{"$error":"#REF!"}},{"$f":"IF(A542=E455,4,\"\")","v":{"$error":"#REF!"}},{"$f":"IF(A542=F455,5,\"\")","v":{"$error":"#REF!"}},{"$f":"IF(A542=G455,6,\"\")","v":{"$error":"#REF!"}},{"$f":"IF(A542=H455,7,\"\")","v":{"$error":"#REF!"}},{"$f":"IF(A542=I455,8,\"\")","v":{"$error":"#REF!"}},{"$error":"#REF!"},"TS3L7-VCS7STD",{"$error":"#REF!"},{"$error":"#REF!"},{"$error":"#REF!"},{"$error":"#REF!"},{"$error":"#REF!"},{"$error":"#REF!"},{"$error":"#REF!"},{"$error":"#REF!"},{"$error":"#REF!"},"TS3L7-VCS7STD",{"$error":"#REF!"},{"$error":"#REF!"},{"$error":"#REF!"},{"$error":"#REF!"},{"$error":"#REF!"},{"$error":"#REF!"},{"$error":"#REF!"},{"$error":"#REF!"},{"$error":"#REF!"}]
["TS3L7-ST7ENT",{"$f":"IF(A543=B455,1,\"\")","v":{"$error":"#REF!"}},{"$f":"IF(A543=C455,2,\"\")","v":{"$error":"#REF!"}},{"$f":"IF(A543=D455,3,\"\")","v":{"$error":"#REF!"}},{"$f":"IF(A543=E455,4,\"\")","v":{"$error":"#REF!"}},{"$f":"IF(A543=F455,5,\"\")","v":{"$error":"#REF!"}},{"$f":"IF(A543=G455,6,\"\")","v":{"$error":"#REF!"}},{"$f":"IF(A543=H455,7,\"\")","v":{"$error":"#REF!"}},{"$f":"IF(A543=I455,8,\"\")","v":{"$error":"#REF!"}},{"$error":"#REF!"},"TS3L7-ST7ENT",{"$error":"#REF!"},{"$error":"#REF!"},{"$error":"#REF!"},{"$error":"#REF!"},{"$error":"#REF!"},{"$error":"#REF!"},{"$error":"#REF!"},{"$error":"#REF!"},{"$error":"#REF!"},"TS3L7-ST7ENT",{"$error":"#REF!"},{"$error":"#REF!"},{"$error":"#REF!"},{"$error":"#REF!"},{"$error":"#REF!"},{"$error":"#REF!"},{"$error":"#REF!"},{"$error":"#REF!"},{"$error":"#REF!"}]
["TS3L7-HZ8ADC10",{"$f":"IF(A544=B455,1,\"\")","v":{"$error":"#REF!"}},{"$f":"IF(A544=C455,2,\"\")","v":{"$error":"#REF!"}},{"$f":"IF(A544=D455,3,\"\")","v":{"$error":"#REF!"}},{"$f":"IF(A544=E455,4,\"\")","v":{"$error":"#REF!"}},{"$f":"IF(A544=F455,5,\"\")","v":{"$error":"#REF!"}},{"$f":"IF(A544=G455,6,\"\")","v":{"$error":"#REF!"}},{"$f":"IF(A544=H455,7,\"\")","v":{"$error":"#REF!"}},{"$f":"IF(A544=I455,8,\"\")","v":{"$error":"#REF!"}},{"$error":"#REF!"},"TS3L7-HZ8ADC10",{"$error":"#REF!"},{"$error":"#REF!"},{"$error":"#REF!"},{"$error":"#REF!"},{"$error":"#REF!"},{"$error":"#REF!"},{"$error":"#REF!"},{"$error":"#REF!"},{"$error":"#REF!"},"TS3L7-HZ8ADC10",{"$error":"#REF!"},{"$error":"#REF!"},{"$error":"#REF!"},{"$error":"#REF!"},{"$error":"#REF!"},{"$error":"#REF!"},{"$error":"#REF!"},{"$error":"#REF!"},{"$error":"#REF!"}]
["TS3L7-HZ8ENC10",{"$f":"IF(A545=B455,1,\"\")","v":{"$error":"#REF!"}},{"$f":"IF(A545=C455,2,\"\")","v":{"$error":"#REF!"}},{"$f":"IF(A545=D455,3,\"\")","v":{"$error":"#REF!"}},{"$f":"IF(A545=E455,4,\"\")","v":{"$error":"#REF!"}},{"$f":"IF(A545=F455,5,\"\")","v":{"$error":"#REF!"}},{"$f":"IF(A545=G455,6,\"\")","v":{"$error":"#REF!"}},{"$f":"IF(A545=H455,7,\"\")","v":{"$error":"#REF!"}},{"$f":"IF(A545=I455,8,\"\")","v":{"$error":"#REF!"}},{"$error":"#REF!"},"TS3L7-HZ8ENC10",{"$error":"#REF!"},{"$error":"#REF!"},{"$error":"#REF!"},{"$error":"#REF!"},{"$error":"#REF!"},{"$error":"#REF!"},{"$error":"#REF!"},{"$error":"#REF!"},{"$error":"#REF!"},"TS3L7-HZ8ENC10",{"$error":"#REF!"},{"$error":"#REF!"},{"$error":"#REF!"},{"$error":"#REF!"},{"$error":"#REF!"},{"$error":"#REF!"},{"$error":"#REF!"},{"$error":"#REF!"},{"$error":"#REF!"}]
["TS3L7-HZ8ADN10",{"$f":"IF(A546=B455,1,\"\")","v":{"$error":"#REF!"}},{"$f":"IF(A546=C455,2,\"\")","v":{"$error":"#REF!"}},{"$f":"IF(A546=D455,3,\"\")","v":{"$error":"#REF!"}},{"$f":"IF(A546=E455,4,\"\")","v":{"$error":"#REF!"}},{"$f":"IF(A546=F455,5,\"\")","v":{"$error":"#REF!"}},{"$f":"IF(A546=G455,6,\"\")","v":{"$error":"#REF!"}},{"$f":"IF(A546=H455,7,\"\")","v":{"$error":"#REF!"}},{"$f":"IF(A546=I455,8,\"\")","v":{"$error":"#REF!"}},{"$error":"#REF!"},"TS3L7-HZ8ADN10",{"$error":"#REF!"},{"$error":"#REF!"},{"$error":"#REF!"},{"$error":"#REF!"},{"$error":"#REF!"},{"$error":"#REF!"},{"$error":"#REF!"},{"$error":"#REF!"},{"$error":"#REF!"},"TS3L7-HZ8ADN10",{"$error":"#REF!"},{"$error":"#REF!"},{"$error":"#REF!"},{"$error":"#REF!"},{"$error":"#REF!"},{"$error":"#REF!"},{"$error":"#REF!"},{"$error":"#REF!"},{"$error":"#REF!"}]
["TS3L7-HZ8ENN10",{"$f":"IF(A547=B455,1,\"\")","v":{"$error":"#REF!"}},{"$f":"IF(A547=C455,2,\"\")","v":{"$error":"#REF!"}},{"$f":"IF(A547=D455,3,\"\")","v":{"$error":"#REF!"}},{"$f":"IF(A547=E455,4,\"\")","v":{"$error":"#REF!"}},{"$f":"IF(A547=F455,5,\"\")","v":{"$error":"#REF!"}},{"$f":"IF(A547=G455,6,\"\")","v":{"$error":"#REF!"}},{"$f":"IF(A547=H455,7,\"\")","v":{"$error":"#REF!"}},{"$f":"IF(A547=I455,8,\"\")","v":{"$error":"#REF!"}},{"$error":"#REF!"},"TS3L7-HZ8ENN10",{"$error":"#REF!"},{"$error":"#REF!"},{"$error":"#REF!"},{"$error":"#REF!"},{"$error":"#REF!"},{"$error":"#REF!"},{"$error":"#REF!"},{"$error":"#REF!"},{"$error":"#REF!"},"TS3L7-HZ8ENN10",{"$error":"#REF!"},{"$error":"#REF!"},{"$error":"#REF!"},{"$error":"#REF!"},{"$error":"#REF!"},{"$error":"#REF!"},{"$error":"#REF!"},{"$error":"#REF!"},{"$error":"#REF!"}]
["TS3L7-Encl13Y4H",{"$f":"IF(A548=B455,1,\"\")","v":{"$error":"#REF!"}},{"$f":"IF(A548=C455,2,\"\")","v":{"$error":"#REF!"}},{"$f":"IF(A548=D455,3,\"\")","v":{"$error":"#REF!"}},{"$f":"IF(A548=E455,4,\"\")","v":{"$error":"#REF!"}},{"$f":"IF(A548=F455,5,\"\")","v":{"$error":"#REF!"}},{"$f":"IF(A548=G455,6,\"\")","v":{"$error":"#REF!"}},{"$f":"IF(A548=H455,7,\"\")","v":{"$error":"#REF!"}},{"$f":"IF(A548=I455,8,\"\")","v":{"$error":"#REF!"}},{"$error":"#REF!"},"TS3L7-Encl13Y4H",{"$error":"#REF!"},{"$error":"#REF!"},{"$error":"#REF!"},{"$error":"#REF!"},{"$error":"#REF!"},{"$error":"#REF!"},{"$error":"#REF!"},{"$error":"#REF!"},{"$error":"#REF!"},"TS3L7-Encl13Y4H",{"$error":"#REF!"},{"$error":"#REF!"},{"$error":"#REF!"},{"$error":"#REF!"},{"$error":"#REF!"},{"$error":"#REF!"},{"$error":"#REF!"},{"$error":"#REF!"},{"$error":"#REF!"}]
["TS3L7-Encl25Y4H",{"$f":"IF(A549=B455,1,\"\")","v":{"$error":"#REF!"}},{"$f":"IF(A549=C455,2,\"\")","v":{"$error":"#REF!"}},{"$f":"IF(A549=D455,3,\"\")","v":{"$error":"#REF!"}},{"$f":"IF(A549=E455,4,\"\")","v":{"$error":"#REF!"}},{"$f":"IF(A549=F455,5,\"\")","v":{"$error":"#REF!"}},{"$f":"IF(A549=G455,6,\"\")","v":{"$error":"#REF!"}},{"$f":"IF(A549=H455,7,\"\")","v":{"$error":"#REF!"}},{"$f":"IF(A549=I455,8,\"\")","v":{"$error":"#REF!"}},{"$error":"#REF!"},"TS3L7-Encl25Y4H",{"$error":"#REF!"},{"$error":"#REF!"},{"$error":"#REF!"},{"$error":"#REF!"},{"$error":"#REF!"},{"$error":"#REF!"},{"$error":"#REF!"},{"$error":"#REF!"},{"$error":"#REF!"},"TS3L7-Encl25Y4H",{"$error":"#REF!"},{"$error":"#REF!"},{"$error":"#REF!"},{"$error":"#REF!"},{"$error":"#REF!"},{"$error":"#REF!"},{"$error":"#REF!"},{"$error":"#REF!"},{"$error":"#REF!"}]
["TS3L7-RACKM32A",{"$f":"IF(A550=B455,1,\"\")","v":{"$error":"#REF!"}},{"$f":"IF(A550=C455,2,\"\")","v":{"$error":"#REF!"}},{"$f":"IF(A550=D455,3,\"\")","v":{"$error":"#REF!"}},{"$f":"IF(A550=E455,4,\"\")","v":{"$error":"#REF!"}},{"$f":"IF(A550=F455,5,\"\")","v":{"$error":"#REF!"}},{"$f":"IF(A550=G455,6,\"\")","v":{"$error":"#REF!"}},{"$f":"IF(A550=H455,7,\"\")","v":{"$error":"#REF!"}},{"$f":"IF(A550=I455,8,\"\")","v":{"$error":"#REF!"}},{"$error":"#REF!"},"TS3L7-RACKM32A",{"$error":"#REF!"},{"$error":"#REF!"},{"$error":"#REF!"},{"$error":"#REF!"},{"$error":"#REF!"},{"$error":"#REF!"},{"$error":"#REF!"},{"$error":"#REF!"},{"$error":"#REF!"},"TS3L7-RACKM32A",{"$error":"#REF!"},{"$error":"#REF!"},{"$error":"#REF!"},{"$error":"#REF!"},{"$error":"#REF!"},{"$error":"#REF!"},{"$error":"#REF!"},{"$error":"#REF!"},{"$error":"#REF!"}]
["TS3L7-RACKT32A",{"$f":"IF(A551=B455,1,\"\")","v":{"$error":"#REF!"}},{"$f":"IF(A551=C455,2,\"\")","v":{"$error":"#REF!"}},{"$f":"IF(A551=D455,3,\"\")","v":{"$error":"#REF!"}},{"$f":"IF(A551=E455,4,\"\")","v":{"$error":"#REF!"}},{"$f":"IF(A551=F455,5,\"\")","v":{"$error":"#REF!"}},{"$f":"IF(A551=G455,6,\"\")","v":{"$error":"#REF!"}},{"$f":"IF(A551=H455,7,\"\")","v":{"$error":"#REF!"}},{"$f":"IF(A551=I455,8,\"\")","v":{"$error":"#REF!"}},{"$error":"#REF!"},"TS3L7-RACKT32A",{"$error":"#REF!"},{"$error":"#REF!"},{"$error":"#REF!"},{"$error":"#REF!"},{"$error":"#REF!"},{"$error":"#REF!"},{"$error":"#REF!"},{"$error":"#REF!"},{"$error":"#REF!"},"TS3L7-RACKT32A",{"$error":"#REF!"},{"$error":"#REF!"},{"$error":"#REF!"},{"$error":"#REF!"},{"$error":"#REF!"},{"$error":"#REF!"},{"$error":"#REF!"},{"$error":"#REF!"},{"$error":"#REF!"}]
["TS3L7-DAC3SFP",{"$f":"IF(A552=B455,1,\"\")","v":{"$error":"#REF!"}},{"$f":"IF(A552=C455,2,\"\")","v":{"$error":"#REF!"}},{"$f":"IF(A552=D455,3,\"\")","v":{"$error":"#REF!"}},{"$f":"IF(A552=E455,4,\"\")","v":{"$error":"#REF!"}},{"$f":"IF(A552=F455,5,\"\")","v":{"$error":"#REF!"}},{"$f":"IF(A552=G455,6,\"\")","v":{"$error":"#REF!"}},{"$f":"IF(A552=H455,7,\"\")","v":{"$error":"#REF!"}},{"$f":"IF(A552=I455,8,\"\")","v":{"$error":"#REF!"}},{"$error":"#REF!"},"TS3L7-DAC3SFP",{"$error":"#REF!"},{"$error":"#REF!"},{"$error":"#REF!"},{"$error":"#REF!"},{"$error":"#REF!"},{"$error":"#REF!"},{"$error":"#REF!"},{"$error":"#REF!"},{"$error":"#REF!"},"TS3L7-DAC3SFP",{"$error":"#REF!"},{"$error":"#REF!"},{"$error":"#REF!"},{"$error":"#REF!"},{"$error":"#REF!"},{"$error":"#REF!"},{"$error":"#REF!"},{"$error":"#REF!"},{"$error":"#REF!"}]
["TS3L7-MLX100M3",{"$f":"IF(A553=B455,1,\"\")","v":{"$error":"#REF!"}},{"$f":"IF(A553=C455,2,\"\")","v":{"$error":"#REF!"}},{"$f":"IF(A553=D455,3,\"\")","v":{"$error":"#REF!"}},{"$f":"IF(A553=E455,4,\"\")","v":{"$error":"#REF!"}},{"$f":"IF(A553=F455,5,\"\")","v":{"$error":"#REF!"}},{"$f":"IF(A553=G455,6,\"\")","v":{"$error":"#REF!"}},{"$f":"IF(A553=H455,7,\"\")","v":{"$error":"#REF!"}},{"$f":"IF(A553=I455,8,\"\")","v":{"$error":"#REF!"}},{"$error":"#REF!"},"TS3L7-MLX100M3",{"$error":"#REF!"},{"$error":"#REF!"},{"$error":"#REF!"},{"$error":"#REF!"},{"$error":"#REF!"},{"$error":"#REF!"},{"$error":"#REF!"},{"$error":"#REF!"},{"$error":"#REF!"},"TS3L7-MLX100M3",{"$error":"#REF!"},{"$error":"#REF!"},{"$error":"#REF!"},{"$error":"#REF!"},{"$error":"#REF!"},{"$error":"#REF!"},{"$error":"#REF!"},{"$error":"#REF!"},{"$error":"#REF!"}]
["TS3L7-DAC3SFP28",{"$f":"IF(A554=B455,1,\"\")","v":{"$error":"#REF!"}},{"$f":"IF(A554=C455,2,\"\")","v":{"$error":"#REF!"}},{"$f":"IF(A554=D455,3,\"\")","v":{"$error":"#REF!"}},{"$f":"IF(A554=E455,4,\"\")","v":{"$error":"#REF!"}},{"$f":"IF(A554=F455,5,\"\")","v":{"$error":"#REF!"}},{"$f":"IF(A554=G455,6,\"\")","v":{"$error":"#REF!"}},{"$f":"IF(A554=H455,7,\"\")","v":{"$error":"#REF!"}},{"$f":"IF(A554=I455,8,\"\")","v":{"$error":"#REF!"}},{"$error":"#REF!"},"TS3L7-DAC3SFP28",{"$error":"#REF!"},{"$error":"#REF!"},{"$error":"#REF!"},{"$error":"#REF!"},{"$error":"#REF!"},{"$error":"#REF!"},{"$error":"#REF!"},{"$error":"#REF!"},{"$error":"#REF!"},"TS3L7-DAC3SFP28",{"$error":"#REF!"},{"$error":"#REF!"},{"$error":"#REF!"},{"$error":"#REF!"},{"$error":"#REF!"},{"$error":"#REF!"},{"$error":"#REF!"},{"$error":"#REF!"},{"$error":"#REF!"}]
["TS3L7-DAC3SFP",{"$f":"IF(A555=B455,1,\"\")","v":{"$error":"#REF!"}},{"$f":"IF(A555=C455,2,\"\")","v":{"$error":"#REF!"}},{"$f":"IF(A555=D455,3,\"\")","v":{"$error":"#REF!"}},{"$f":"IF(A555=E455,4,\"\")","v":{"$error":"#REF!"}},{"$f":"IF(A555=F455,5,\"\")","v":{"$error":"#REF!"}},{"$f":"IF(A555=G455,6,\"\")","v":{"$error":"#REF!"}},{"$f":"IF(A555=H455,7,\"\")","v":{"$error":"#REF!"}},{"$f":"IF(A555=I455,8,\"\")","v":{"$error":"#REF!"}},{"$error":"#REF!"},"TS3L7-DAC3SFP",{"$error":"#REF!"},{"$error":"#REF!"},{"$error":"#REF!"},{"$error":"#REF!"},{"$error":"#REF!"},{"$error":"#REF!"},{"$error":"#REF!"},{"$error":"#REF!"},{"$error":"#REF!"},"TS3L7-DAC3SFP",{"$error":"#REF!"},{"$error":"#REF!"},{"$error":"#REF!"},{"$error":"#REF!"},{"$error":"#REF!"},{"$error":"#REF!"},{"$error":"#REF!"},{"$error":"#REF!"},{"$error":"#REF!"}]
["TS3L7-MLX100M3",{"$f":"IF(A556=B455,1,\"\")","v":{"$error":"#REF!"}},{"$f":"IF(A556=C455,2,\"\")","v":{"$error":"#REF!"}},{"$f":"IF(A556=D455,3,\"\")","v":{"$error":"#REF!"}},{"$f":"IF(A556=E455,4,\"\")","v":{"$error":"#REF!"}},{"$f":"IF(A556=F455,5,\"\")","v":{"$error":"#REF!"}},{"$f":"IF(A556=G455,6,\"\")","v":{"$error":"#REF!"}},{"$f":"IF(A556=H455,7,\"\")","v":{"$error":"#REF!"}},{"$f":"IF(A556=I455,8,\"\")","v":{"$error":"#REF!"}},{"$error":"#REF!"},"TS3L7-MLX100M3",{"$error":"#REF!"},{"$error":"#REF!"},{"$error":"#REF!"},{"$error":"#REF!"},{"$error":"#REF!"},{"$error":"#REF!"},{"$error":"#REF!"},{"$error":"#REF!"},{"$error":"#REF!"},"TS3L7-MLX100M3",{"$error":"#REF!"},{"$error":"#REF!"},{"$error":"#REF!"},{"$error":"#REF!"},{"$error":"#REF!"},{"$error":"#REF!"},{"$error":"#REF!"},{"$error":"#REF!"},{"$error":"#REF!"}]
["TS3L7-MCX4DP",{"$f":"IF(A557=B455,1,\"\")","v":{"$error":"#REF!"}},{"$f":"IF(A557=C455,2,\"\")","v":{"$error":"#REF!"}},{"$f":"IF(A557=D455,3,\"\")","v":{"$error":"#REF!"}},{"$f":"IF(A557=E455,4,\"\")","v":{"$error":"#REF!"}},{"$f":"IF(A557=F455,5,\"\")","v":{"$error":"#REF!"}},{"$f":"IF(A557=G455,6,\"\")","v":{"$error":"#REF!"}},{"$f":"IF(A557=H455,7,\"\")","v":{"$error":"#REF!"}},{"$f":"IF(A557=I455,8,\"\")","v":{"$error":"#REF!"}},{"$error":"#REF!"},"TS3L7-MCX4DP",{"$error":"#REF!"},{"$error":"#REF!"},{"$error":"#REF!"},{"$error":"#REF!"},{"$error":"#REF!"},{"$error":"#REF!"},{"$error":"#REF!"},{"$error":"#REF!"},{"$error":"#REF!"},"TS3L7-MCX4DP",{"$error":"#REF!"},{"$error":"#REF!"},{"$error":"#REF!"},{"$error":"#REF!"},{"$error":"#REF!"},{"$error":"#REF!"},{"$error":"#REF!"},{"$error":"#REF!"},{"$error":"#REF!"}]
["TS3L7-MCX4DP-L",{"$f":"IF(A558=B455,1,\"\")","v":{"$error":"#REF!"}},{"$f":"IF(A558=C455,2,\"\")","v":{"$error":"#REF!"}},{"$f":"IF(A558=D455,3,\"\")","v":{"$error":"#REF!"}},{"$f":"IF(A558=E455,4,\"\")","v":{"$error":"#REF!"}},{"$f":"IF(A558=F455,5,\"\")","v":{"$error":"#REF!"}},{"$f":"IF(A558=G455,6,\"\")","v":{"$error":"#REF!"}},{"$f":"IF(A558=H455,7,\"\")","v":{"$error":"#REF!"}},{"$f":"IF(A558=I455,8,\"\")","v":{"$error":"#REF!"}},{"$error":"#REF!"},"TS3L7-MCX4DP-L",{"$error":"#REF!"},{"$error":"#REF!"},{"$error":"#REF!"},{"$error":"#REF!"},{"$error":"#REF!"},{"$error":"#REF!"},{"$error":"#REF!"},{"$error":"#REF!"},{"$error":"#REF!"},"TS3L7-MCX4DP-L",{"$error":"#REF!"},{"$error":"#REF!"},{"$error":"#REF!"},{"$error":"#REF!"},{"$error":"#REF!"},{"$error":"#REF!"},{"$error":"#REF!"},{"$error":"#REF!"},{"$error":"#REF!"}]
["TS3L7-OMEA",null,null,null,null,null,null,null,null,"","TS3L7-OMEA",{"$error":"#REF!"},{"$f":"IF(K559=$M$455,2,\"\")","v":{"$error":"#REF!"}},{"$f":"IF(K559=$N$455,3,\"\")","v":{"$error":"#REF!"}},{"$f":"IF(K559=$O$455,4,\"\")","v":{"$error":"#REF!"}},{"$f":"IF(K559=$P$455,5,\"\")","v":{"$error":"#REF!"}},{"$f":"IF(K559=$Q$455,6,\"\")","v":{"$error":"#REF!"}},{"$f":"IF(K559=$R$455,7,\"\")","v":{"$error":"#REF!"}},{"$f":"IF(K559=$S$455,8,\"\")","v":{"$error":"#REF!"}},{"$f":"IF(SUM(L559:S559)=0,\"\",CONCATENATE(\" (Slot PCI \",L559,\".\",M559,\".\",N559,\".\",O559,\".\",P559,\".\",Q559,\".\",R559,\".\",S559,\")\"))","v":{"$error":"#REF!"}},"TS3L7-OMEA",{"$f":"IF(U559=$V$455,1,\"\")","v":{"$error":"#REF!"}},{"$f":"IF(U559=$W$455,2,\"\")","v":{"$error":"#REF!"}},{"$f":"IF(U559=$X$455,3,\"\")","v":{"$error":"#REF!"}},{"$f":"IF(U559=$Y$455,4,\"\")","v":{"$error":"#REF!"}},{"$f":"IF(U559=$Z$455,5,\"\")","v":{"$error":"#REF!"}},{"$f":"IF(U559=$AA$455,6,\"\")","v":{"$error":"#REF!"}},{"$f":"IF(U559=$AB$455,7,\"\")","v":{"$error":"#REF!"}},{"$f":"IF(U559=$AC$455,8,\"\")","v":{"$error":"#REF!"}},{"$error":"#REF!"}]
["TS3L7-A100",{"$f":"IF(A560=B455,1,\"\")","v":{"$error":"#REF!"}},{"$f":"IF(A560=C455,2,\"\")","v":{"$error":"#REF!"}},{"$f":"IF(A560=D455,3,\"\")","v":{"$error":"#REF!"}},{"$f":"IF(A560=E455,4,\"\")","v":{"$error":"#REF!"}},{"$f":"IF(A560=F455,5,\"\")","v":{"$error":"#REF!"}},{"$f":"IF(A560=G455,6,\"\")","v":{"$error":"#REF!"}},{"$f":"IF(A560=H455,7,\"\")","v":{"$error":"#REF!"}},{"$f":"IF(A560=I455,8,\"\")","v":{"$error":"#REF!"}},{"$error":"#REF!"},"TS3L7-A100",{"$f":"IF(K560=$L$455,1,\"\")","v":{"$error":"#REF!"}},{"$f":"IF(K560=$M$455,2,\"\")","v":{"$error":"#REF!"}},{"$f":"IF(K560=$N$455,3,\"\")","v":{"$error":"#REF!"}},{"$f":"IF(K560=$O$455,4,\"\")","v":{"$error":"#REF!"}},{"$f":"IF(K560=$P$455,5,\"\")","v":{"$error":"#REF!"}},{"$f":"IF(K560=$Q$455,6,\"\")","v":{"$error":"#REF!"}},{"$f":"IF(K560=$R$455,7,\"\")","v":{"$error":"#REF!"}},{"$f":"IF(K560=$S$455,8,\"\")","v":{"$error":"#REF!"}},{"$f":"IF(SUM(L560:S560)=0,\"\",CONCATENATE(\" (Slot PCI \",L560,\".\",M560,\".\",N560,\".\",O560,\".\",P560,\".\",Q560,\".\",R560,\".\",S560,\")\"))","v":{"$error":"#REF!"}},"TS3L7-A100",{"$f":"IF(U560=$V$455,1,\"\")","v":{"$error":"#REF!"}},{"$f":"IF(U560=$W$455,2,\"\")","v":{"$error":"#REF!"}},{"$f":"IF(U560=$X$455,3,\"\")","v":{"$error":"#REF!"}},{"$f":"IF(U560=$Y$455,4,\"\")","v":{"$error":"#REF!"}},{"$f":"IF(U560=$Z$455,5,\"\")","v":{"$error":"#REF!"}},{"$f":"IF(U560=$AA$455,6,\"\")","v":{"$error":"#REF!"}},{"$f":"IF(U560=$AB$455,7,\"\")","v":{"$error":"#REF!"}},{"$f":"IF(U560=$AC$455,8,\"\")","v":{"$error":"#REF!"}},{"$error":"#REF!"}]
["TS3L7-SAS12-L",{"$f":"IF(A561=B455,1,\"\")","v":{"$error":"#REF!"}},{"$f":"IF(A561=C455,2,\"\")","v":{"$error":"#REF!"}},{"$f":"IF(A561=D455,3,\"\")","v":{"$error":"#REF!"}},{"$f":"IF(A561=E455,4,\"\")","v":{"$error":"#REF!"}},{"$f":"IF(A561=F455,5,\"\")","v":{"$error":"#REF!"}},{"$f":"IF(A561=G455,6,\"\")","v":{"$error":"#REF!"}},{"$f":"IF(A561=H455,7,\"\")","v":{"$error":"#REF!"}},{"$f":"IF(A561=I455,8,\"\")","v":{"$error":"#REF!"}},{"$error":"#REF!"},"TS3L7-SAS12-L",{"$f":"IF(K561=$L$455,1,\"\")","v":{"$error":"#REF!"}},{"$f":"IF(K561=$M$455,2,\"\")","v":{"$error":"#REF!"}},{"$f":"IF(K561=$N$455,3,\"\")","v":{"$error":"#REF!"}},{"$f":"IF(K561=$O$455,4,\"\")","v":{"$error":"#REF!"}},{"$f":"IF(K561=$P$455,5,\"\")","v":{"$error":"#REF!"}},{"$f":"IF(K561=$Q$455,6,\"\")","v":{"$error":"#REF!"}},{"$f":"IF(K561=$R$455,7,\"\")","v":{"$error":"#REF!"}},{"$f":"IF(K561=$S$455,8,\"\")","v":{"$error":"#REF!"}},{"$f":"IF(SUM(L561:S561)=0,\"\",CONCATENATE(\" (Slot PCI \",L561,\".\",M561,\".\",N561,\".\",O561,\".\",P561,\".\",Q561,\".\",R561,\".\",S561,\")\"))","v":{"$error":"#REF!"}},"TS3L7-SAS12-L",{"$f":"IF(U561=$V$455,1,\"\")","v":{"$error":"#REF!"}},{"$f":"IF(U561=$W$455,2,\"\")","v":{"$error":"#REF!"}},{"$f":"IF(U561=$X$455,3,\"\")","v":{"$error":"#REF!"}},{"$f":"IF(U561=$Y$455,4,\"\")","v":{"$error":"#REF!"}},{"$f":"IF(U561=$Z$455,5,\"\")","v":{"$error":"#REF!"}},{"$f":"IF(U561=$AA$455,6,\"\")","v":{"$error":"#REF!"}},{"$f":"IF(U561=$AB$455,7,\"\")","v":{"$error":"#REF!"}},{"$f":"IF(U561=$AC$455,8,\"\")","v":{"$error":"#REF!"}},{"$error":"#REF!"}]
["TS3L7-SAS12",{"$f":"IF(A562=B455,1,\"\")","v":{"$error":"#REF!"}},{"$f":"IF(A562=C455,2,\"\")","v":{"$error":"#REF!"}},{"$f":"IF(A562=D455,3,\"\")","v":{"$error":"#REF!"}},{"$f":"IF(A562=E455,4,\"\")","v":{"$error":"#REF!"}},{"$f":"IF(A562=F455,5,\"\")","v":{"$error":"#REF!"}},{"$f":"IF(A562=G455,6,\"\")","v":{"$error":"#REF!"}},{"$f":"IF(A562=H455,7,\"\")","v":{"$error":"#REF!"}},{"$f":"IF(A562=I455,8,\"\")","v":{"$error":"#REF!"}},{"$error":"#REF!"},"TS3L7-SAS12",{"$f":"IF(K562=$L$455,1,\"\")","v":{"$error":"#REF!"}},{"$f":"IF(K562=$M$455,2,\"\")","v":{"$error":"#REF!"}},{"$f":"IF(K562=$N$455,3,\"\")","v":{"$error":"#REF!"}},{"$f":"IF(K562=$O$455,4,\"\")","v":{"$error":"#REF!"}},{"$f":"IF(K562=$P$455,5,\"\")","v":{"$error":"#REF!"}},{"$f":"IF(K562=$Q$455,6,\"\")","v":{"$error":"#REF!"}},{"$f":"IF(K562=$R$455,7,\"\")","v":{"$error":"#REF!"}},{"$f":"IF(K562=$S$455,8,\"\")","v":{"$error":"#REF!"}},{"$f":"IF(SUM(L562:S562)=0,\"\",CONCATENATE(\" (Slot PCI \",L562,\".\",M562,\".\",N562,\".\",O562,\".\",P562,\".\",Q562,\".\",R562,\".\",S562,\")\"))","v":{"$error":"#REF!"}},"TS3L7-SAS12",{"$f":"IF(U562=$V$455,1,\"\")","v":{"$error":"#REF!"}},{"$f":"IF(U562=$W$455,2,\"\")","v":{"$error":"#REF!"}},{"$f":"IF(U562=$X$455,3,\"\")","v":{"$error":"#REF!"}},{"$f":"IF(U562=$Y$455,4,\"\")","v":{"$error":"#REF!"}},{"$f":"IF(U562=$Z$455,5,\"\")","v":{"$error":"#REF!"}},{"$f":"IF(U562=$AA$455,6,\"\")","v":{"$error":"#REF!"}},{"$f":"IF(U562=$AB$455,7,\"\")","v":{"$error":"#REF!"}},{"$f":"IF(U562=$AC$455,8,\"\")","v":{"$error":"#REF!"}},{"$error":"#REF!"}]
["TS3L7-H840-L",{"$f":"IF(A563=B455,1,\"\")","v":{"$error":"#REF!"}},{"$f":"IF(A563=C455,2,\"\")","v":{"$error":"#REF!"}},{"$f":"IF(A563=D455,3,\"\")","v":{"$error":"#REF!"}},{"$f":"IF(A563=E455,4,\"\")","v":{"$error":"#REF!"}},{"$f":"IF(A563=F455,5,\"\")","v":{"$error":"#REF!"}},{"$f":"IF(A563=G455,6,\"\")","v":{"$error":"#REF!"}},{"$f":"IF(A563=H455,7,\"\")","v":{"$error":"#REF!"}},{"$f":"IF(A563=I455,8,\"\")","v":{"$error":"#REF!"}},{"$error":"#REF!"},"TS3L7-H840-L",{"$f":"IF(K563=$L$455,1,\"\")","v":{"$error":"#REF!"}},{"$f":"IF(K563=$M$455,2,\"\")","v":{"$error":"#REF!"}},{"$f":"IF(K563=$N$455,3,\"\")","v":{"$error":"#REF!"}},{"$f":"IF(K563=$O$455,4,\"\")","v":{"$error":"#REF!"}},{"$f":"IF(K563=$P$455,5,\"\")","v":{"$error":"#REF!"}},{"$f":"IF(K563=$Q$455,6,\"\")","v":{"$error":"#REF!"}},{"$f":"IF(K563=$R$455,7,\"\")","v":{"$error":"#REF!"}},{"$f":"IF(K563=$S$455,8,\"\")","v":{"$error":"#REF!"}},{"$f":"IF(SUM(L563:S563)=0,\"\",CONCATENATE(\" (Slot PCI \",L563,\".\",M563,\".\",N563,\".\",O563,\".\",P563,\".\",Q563,\".\",R563,\".\",S563,\")\"))","v":{"$error":"#REF!"}},"TS3L7-H840-L",{"$f":"IF(U563=$V$455,1,\"\")","v":{"$error":"#REF!"}},{"$f":"IF(U563=$W$455,2,\"\")","v":{"$error":"#REF!"}},{"$f":"IF(U563=$X$455,3,\"\")","v":{"$error":"#REF!"}},{"$f":"IF(U563=$Y$455,4,\"\")","v":{"$error":"#REF!"}},{"$f":"IF(U563=$Z$455,5,\"\")","v":{"$error":"#REF!"}},{"$f":"IF(U563=$AA$455,6,\"\")","v":{"$error":"#REF!"}},{"$f":"IF(U563=$AB$455,7,\"\")","v":{"$error":"#REF!"}},{"$f":"IF(U563=$AC$455,8,\"\")","v":{"$error":"#REF!"}},{"$error":"#REF!"}]
[]
["_C14C13"]
["_C20C19"]
[]
[]
[]
[]
[0]
[2]
[4]
[6]
["Illimitate"]
[]
[]
[1,2]
[2,4]
[3,6]
[]
[1]
[2]
[3]
[4]
[5]
[6]
[7]
[8]
[9]
[10]
[11]
[12]
[13]
[14]
[15]
[16]

{"sheet":"Tabella_prezzi","index":6,"n_rows":157,"n_cols":17,"rows_kept":157,"cut":false,"hidden":true,"merged":[[1,9,7,9],[37,8,38,8],[37,6,38,6],[14,4,15,4],[1,2,7,2],[16,5,17,5],[18,5,19,5],[12,4,13,4],[14,5,15,5],[16,4,17,4],[20,3,21,3],[20,4,21,4],[20,5,21,5],[18,4,19,4],[12,5,13,5],[26,2,27,2],[1,0,7,0],[1,1,7,1],[1,3,7,3],[1,4,7,4],[1,5,7,5],[37,10,38,10],[22,0,23,0],[22,1,23,1],[22,2,23,2],[22,3,23,3],[22,4,23,4],[22,5,23,5],[26,3,27,3],[26,4,27,4],[37,4,38,4],[37,0,38,0],[22,9,23,9],[26,5,27,5],[26,9,27,9],[26,0,27,0],[26,1,27,1],[12,3,13,3],[18,2,19,2],[18,3,19,3],[16,0,17,0],[16,1,17,1],[14,0,15,0],[14,1,15,1],[14,2,15,2],[14,3,15,3],[16,2,17,2],[16,3,17,3],[12,9,13,9],[14,9,15,9],[16,9,17,9],[18,9,19,9],[20,9,21,9],[20,0,21,0],[20,1,21,1],[12,0,13,0],[12,1,13,1],[12,2,13,2],[18,0,19,0],[18,1,19,1],[20,2,21,2],[52,0,53,0],[54,0,55,0],[52,2,53,2],[52,3,53,3],[52,9,53,9],[54,9,55,9],[52,4,53,4],[54,4,55,4],[52,1,53,1],[54,1,55,1],[52,5,53,5],[54,5,55,5],[54,2,55,2],[93,5,96,5],[93,9,96,9],[93,0,96,0],[93,1,96,1],[93,2,96,2],[93,3,96,3],[93,4,96,4],[37,9,38,9],[37,5,38,5],[37,2,38,2],[37,3,38,3],[54,3,55,3]]}
["L7N01",1,"Server rackable bi-processore prest.",4047.7,"L7N01","TS4L7-SRV",1,null,"PowerEdge R7525 Server","L7N01-ServerR7525","210-AMTE","DELL",null,null,null,"210-321-BCPX","-"]
["L7N02",2,"Kit n. 1 Processore aggiuntivo",680.84,"L7N02","TS4L7-CPU",1,"AMD EPYC 7313 3.0GHz, 16C/32T, 128M Cache (155W) DDR4-3200","AMD EPYC 7313 3.0GHz, 16C/32T, 128M Cache (155W) DDR4-3200","L7N02-OpzCPU","338-BZSB","DELL",null,null,null,"338-BZSB","WX6G7"]
[null,null,null,null,null,null,1,"L Shape Heatsink for 2nd CPU equal to or greater than 180W,PowerEdge R6525/R7525, Customer Install","L Shape Heatsink for 2nd CPU equal to or greater than 180W,PowerEdge R6525/R7525, Customer Install",null,"412-AASW","DELL",null,null,null,"412-AASW","4RCGC"]
[null,null,null,null,null,null,1,"PowerEdge R7525 High Performance Fan Customer Kit V3","PowerEdge R7525 High Performance Fan Customer Kit V3",null,"121-BBBI","DELL",null,null,null,"121-BBBI","HVVRP"]
[null,null,null,null,null,null,1,"Riser with Two x8(x16 connector) PCIe Gen4 (Slots 4 & 5), Customer Install","Riser with Two x8(x16 connector) PCIe Gen4 (Slots 4 & 5), Customer Install",null,"330-BBTM","DELL",null,null,null,"330-BBTM","234T7"]
[null,null,null,null,null,null,1,"Riser 4B, PCIe Gen4 1x16 (x16 connector), Half Length, PowerEdge R7525, CK","Riser 4B, PCIe Gen4 1x16 (x16 connector), Half Length, PowerEdge R7525, CK",null,"330-BBPR","DELL",null,null,null,"330-BBPR"]
[null,null,null,null,null,null,1,"Riser 1B, PCIe Gen4 2x8 (x16 connector), Half Length, PowerEdge R7525, CK","Riser 1B, PCIe Gen4 2x8 (x16 connector), Half Length, PowerEdge R7525, CK",null,"330-BBPV","DELL",null,null,null,"330-BBPV","R80PP"]
[null,null,null,null,null,null,1,"Riser 2A, PCIe Gen4 2x16 (x16 connector), PowerEdge R7525, CK","Riser 2A, PCIe Gen4 2x16 (x16 connector), PowerEdge R7525, CK",null,"330-BBPO","DELL",null,null,null,"330-BBPO"]
["L7N03",3,"OpzRAM32GB",263.87,"L7N03","TS4L7-RAM32",1,"32GB - 2Rx4 DDR4 RDIMM 3200MHz","32GB - 2Rx4 DDR4 RDIMM 3200MHz","L7N03-OpzRAM32GB","AA799087","DELL",null,null,null,"AA79SNP75X1VC/32G","SNP75X1VC/32G"]
["L7N04",4,"OpzRAM64GB",302.60000000000002,"L7N04","TS4L7-RAM64",1,"64GB - 2RX4 DDR4 RDIMM 3200MHz","64GB - 2RX4 DDR4 RDIMM 3200MHz","L7N04-OpzRAM64GB","AA799110","DELL",null,null,null,"AA79SNPP2MYXC/64G","SNPP2MYXC/64G"]
["L7N05",5,"OpzGigabit",29.18,"L7N05","TS4L7-LAN1",1,"Broadcom 5719 Quad Port 1Gb Network Interface Card, Low Profile ","Broadcom 5719 Quad Port 1Gb Network Interface Card, Low Profile ","L7N75-OpzGigabitLP","540-BBDF","DELL",1,2,3,"540-XF9VF","XF9VF"]
["L7N75",5,"OpzGigabit",29.18,"L7N05b","TS4L7-LAN1-OCP",1,"Broadcom 5719 Quad Port 1GbE BASE-T Adapter, OCP NIC 3.0","Broadcom 5719 Quad Port 1GbE BASE-T Adapter, OCP NIC 3.0","L7N75-OpzGigabitOCP","540-BCOB","DELL",4,null,null,"540-W0N4T","W0N4T"]
["L7N06",6,"OpzGigabit10Gbps",160.47999999999999,"L7N06","TS4L7-LAN10",1,"Broadcom 57412 Dual Port 10Gb, SFP+, PCIe Adapter, Low Profile + Optics","Broadcom 57412 Dual Port 10Gb, SFP+, PCIe Adapter, Low Profile + Optics","L7N06-OpzGigabit10Gbps","540-BBUP","DELL",1,2,3,"540-H6N50","H6N50"]
[null,null,null,null,null,null,2,"SFP+ SR Optic for all SFP+","Dell Networking, Transceiver, SFP+, 10GbE, SR, 850nm Wavelength, 300m Reach - Kit",null,"407-BCBE","DELL",null,null,null,"407-4Y8DN","4Y8DN"]
["L7N76",6,"OpzGigabit10Gbps",160.47999999999999,"L7N76","TS4L7-LAN10-OCP",1,"\tBroadcom 57412 Dual Port 10GbE SFP+, OCP NIC 3.0","\tBroadcom 57412 Dual Port 10GbE SFP+, OCP NIC 3.0","L7N76-OpzGigabit10GbpsLP","540-BCNT","DELL",4,null,null,"540-N7R67","N7R67"]
[null,null,null,null,null,null,2,"SFP+ SR Optic for all SFP+","Dell Networking, Transceiver, SFP+, 10GbE, SR, 850nm Wavelength, 300m Reach - Kit",null,"407-BBOU","DELL",null,null,null,"407-4Y8DN","4Y8DN"]
["L7N07",7,"OpzGigabit25Gbps",249.64,"L7N07","TS4L7-LAN25",1,"Intel Ethernet XXV710 Dual Port 10/25GbE SFP28 Adapter, PCIe Low Profile + Optics","Intel Ethernet XXV710 Dual Port 10/25GbE SFP28 Adapter, PCIe Low Profile + Optics","L7N07-OpzGigabit25Gbps","540-BCCM","DELL",1,2,3,"540-86P4V","86P4V"]
[null,null,null,null,null,null,2,"SFP28 SR Optic, 25GbE, 85C, for all SFP28 ports","SFP28 SR Optic, 25GbE, 85C, for all SFP28 ports",null,"407-BCHI","DELL",null,null,null,"407-PY7V9","PY7V9"]
["L7N77",7,"OpzGigabit25Gbps",249.64,"L7N07b","TS4L7-LAN25-L",1,"Intel Ethernet XXV710 Dual Port 10/25GbE SFP28 Adapter, PCIe Low Profile + Optics","Intel Ethernet XXV710 Dual Port 10/25GbE SFP28 Adapter, PCIe Low Profile + Optics","L7N77-OpzGigabit25GbpsLP","540-BBZO","DELL",4,null,null,"540-9RVF0","9RVF0"]
[null,null,null,null,null,null,2,"Dell Networking, Transceiver, 25GbE SFP28 SR, No FEC, MMF, Duplex LC","Dell Networking, Transceiver, 25GbE SFP28 SR, No FEC, MMF, Duplex LC",null,"407-BCGJ","DELL",null,null,null,"407-PY7V9","PY7V9"]
["L7N08",8,"OpzGigabit10Gbps CNA",153.19,"L7N08","TS4L7-CNA10",1,"QLogic FastLinQ 41262 Dual Port 25Gb SFP28 Adapter, Low Profile + Optics","QLogic FastLinQ 41262 Dual Port 25Gb SFP28 Adapter, Low Profile + Optics","L7N08-OpzCNA10Gbps","540-BBYH","DELL",1,2,3,"540-42H35","42H35"]
[null,null,null,null,null,null,2,"SFP+ SR Optic for all SFP+","SFP+ SR Optic for all SFP+",null,"407-BBOU","DELL",null,null,null,"407-4Y8DN","4Y8DN"]
["L7N78",8,"OpzGigabit10Gbps CNA",153.19,"L7N08b","TS4L7-CNA10-L",1,"QLogic 41262 Dual Port 25Gb SFP28 Adapter, Low Profile + Optics","QLogic 41262 Dual Port 25Gb SFP28 Adapter, Low Profile + Optics","L7N08-OpzCNA10GbpsLP","540-BBZM","DELL",4,null,null,"540-01CN1","01CN1"]
[null,null,null,null,null,null,2,"Dell Networking, Transceiver, SFP+, 10GbE, SR, 850nm Wavelength, 300m Reach - Kit","Dell Networking, Transceiver, SFP+, 10GbE, SR, 850nm Wavelength, 300m Reach - Kit",null,"407-BBOU","DELL",null,null,null,"407-4Y8DN","4Y8DN"]
["L7N09",9,"Opz10Gigabit BaseT",147.52000000000001,"L7N09","TS4L7-BaseT-LP",1,"Intel X710-T2L Dual Port 10GbE BASE-T Adapter, PCIe LP","Intel X710-T2L Dual Port 10GbE BASE-T Adapter, PCIe LP","L7N09-Opz-BaseT","540-BCSC","DELL",1,2,3,"403-YH1DK","YH1DK"]
["L7N79",9,"Opz10Gigabit BaseT",147.52000000000001,"L7N09b","TS4L7- BaseT-L",1,"Intel X710-T2L Dual Port 10GbE BASE-T, OCP NIC 3.0","Intel X710-T2L Dual Port 10GbE BASE-T, OCP NIC 3.0","L7N79-Opz-BaseT","540-BCRS","DELL",4,null,null,"403-P0TRP","P0TRP"]
["L7N10",10,"Opz100Gbit",811.34,"L7N10","TS4L7- Opz100Gbit",1,"Intel E810 Dual Port 100GbE QSFP28 Adapter, PCIe Low Profile + Optics","Intel E810 Dual Port 100GbE QSFP28 Adapter, PCIe Low Profile + Optics","L7N10-Opz100Gbit","540-BDDX","DELL",4,null,null,"403-P0TRP","P0TRP"]
[null,null,null,null,null,null,1,"Dell EMC PowerEdge QSFP28 SR4 100GbE 85C optic","Dell EMC PowerEdge QSFP28 SR4 100GbE 85C optic",null,"407-BCEQ","DELL",4,null,null,"403-P0TRP","P0TRP"]
["L7N11",11,"OpzFibreChannel",425.36,"L7N11","TS4L7- FibreChannel",1,"QLogic 2772 Dual Port 32GbE Fibre Channel HBA, PCIe Low Profile+ Optics","QLogic 2772 Dual Port 32GbE Fibre Channel HBA, PCIe Low Profile+ Optics","L7N11-OpzFibreChannel","540-BDHC","DELL",4,null,null,"403-P0TRP","P0TRP"]
["L7N12",12,"OpzHDD2TB",205.39,"L7N12","TS4L7-HDD2TB",1,"2.4TB 10k SAS ISE 12Gbps","2.4TB 10K RPM SAS ISE 12Gbps 512e 2.5in Hot-plug Hard Drive","L7N10-OpzHDD2TB","400-AVEZ","DELL",null,null,null,"400-HTMGW","HTMGW"]
["L7N13",13,"OpzHDD1TB",89.16,"L7N13","TS4L7-HDD1TB",1,"1.2TB 10K RPM SAS ISE 12Gbps","1.2TB 10K RPM SAS ISE 12Gbps 512n 2.5in Hot-plug Hard Drive","L7N11-OpzHDD1TB","400-AVFE","DELL",null,null,null,"400-400-ATJL","400-ATJL"]
["L7N14",14,"OpzSSD-RI3,8TB",1010.45,"L7N14","TS4L7-SSD-RI3,8TB",1,"3.84TB SSD SAS ISE RI 12Gbps","3.84TB SSD SAS ISE RI 12Gbps 512e 2.5in PM6 Hot-Plug 1 DWPD","L7N12-OpzHDD300GB","345-BCNU","DELL",null,null,null,"400-PDNT1","PDNT1"]
["L7N15",15,"OpzGPU",6264.37,"L7N15","TS4L7-GPU",1,"AMD MI100,300W PCIe, 32GB Passive, Double Wide, GPU","AMD MI100,300W PCIe, 32GB Passive, Double Wide, GPU","L7N15-GPU","470-AEFO","DELL"]
["L7N16",16,"OpzSSD-RI1,6TB",499.28,"L7N16","TS4L7-SSD-RI1,6TB",1,"1.92TB SSD SAS ISE RI 12Gbps","1.92TB SSD SAS ISE RI 12Gbps 512e 2.5in Hot-Plug 1 DWPD","L7N13-OpzSSD-RI1,6TB","345-BBVC","DELL",null,null,null,"400-2H59H","2H59H"]
["L7N17",17,"OpzSSD-MU1,6TB",473.08,"L7N17","TS4L7-SSD-MU1,6TB",1,"1.6TB SSD SAS ISE MU 12Gbp","1.6TB SSD SAS ISE MU 12Gbps 512e 2.5in Hot-Plug PM6 3 DWPD","L7N14-OpzSSD-MU1,6TB","400-AZOY","DELL",null,null,null,"400-CDPWY","CDPWY"]
["L7N18",18,"OpzSSD-RI800GB",283.68,"L7N18","TS4L7-SSD-RI800GB",1,"960GB SSD SAS ISE RI 12Gbps","960GB SSD SAS ISE RI 12Gbps 512e 2.5in Hot-Plug 1 DWPD","L7N15-OpzSSD-RI800GB","400-AXQU","DELL",null,null,null,"400-VPV60","VPV60"]
["L7N19",19,"OpzSSD-MU800GB",295.02999999999997,"L7N19","TS4L7-SSD-MU800GB",1,"800GB SSD SAS ISE Mix Use 12Gbps","800GB SSD SAS ISE Mix Use 12Gbps 512e 2.5in Hot-plug, 3 DWPD","L7N16-OpzSSD-MU800GB","400-AZQO","DELL",null,null,null,"400-MW0DK","MW0DK"]
["L7N20",20,"OpzUps (3000VA)",386.02,"L7N20","TS4L7-UPS",1,"Dispositivo UPS di tipo On-line doppia conversione, strutturato per il montaggio a rack da 19”","Dispositivo UPS di tipo On-line doppia conversione, strutturato per il montaggio a rack da 19”","L7N19-OpzUps","RPMM9/3K",null,null,null,null,"RPMMRPMM9/3K","RPMM9/3K"]
[null,null,null,null,null,null,null,null,null,null,null,null,null,null,null,""]
["L7N21",21,"OpzGUI",491.62,"L7N21","TS4L7-GUI",1,"Unità KVM - monitor 17\", cavo combi PS/2&USB da 1,8mt, tastiera italiana, touch pad","Unità KVM - monitor 17\", cavo combi PS/2&USB da 1,8mt, tastiera italiana, touch pad","L7N20-OpzGUI","F9857N",null,null,null,null,"F985F9857N","F9857N"]
["L7N22",22,"OpzKVM",552.47,"L7N22","TS4L7-KVM",1,"KVM Switch IP per GUI 16P","KVM Switch IP per GUI 16P","L7N21-OpzKVM","T9816NIP",null,null,null,null,"T981T9816NIP","T9816NIP"]
["L7N23",23,"OpzWinServSTD",816.77,"L7N23","TS4L7-WINSRVSTD",1,"Windows Server 2022,Standard,ROK,16CORE","Windows Server 2022,Standard,ROK,16CORE","L7N22-OpzWinServSTD","634-BYKR","DELL",null,null,null,"634-634-BSFX","634-BSFX"]
["L7N24",24,"OpzDeviceCal",27.23,"L7N24","TS4L7-WINDEVCAL",1,"1-pack of Windows Server 2022/2019 Device CALs (STD or DC)","1-pack of Windows Server 2022/2019 Device CALs (STD or DC)","L7N23-OpzDeviceCal","634-BYLD","DELL",null,null,null,"623-623-BBCV","623-BBCV"]
["L7N25",25,"OpzUserCal",37.450000000000003,"L7N25","TS4L7-WINUSRCAL",1,"1-pack of Windows Server 2022/2019 User CALs (STD or DC)","1-pack of Windows Server 2022/2019 User CALs (STD or DC)","L7N24-OpzUserCal","634-BYKZ","DELL",null,null,null,"623-623-BBCT","623-BBCT"]
["L7N26",26,"OpzWinServSTD2core",92.94,"L7N26","TS4L7-WINSRV2C",1,"Windows Server 2022 Standard Edition, Add License,2CORE","Windows Server 2022 Standard Edition, Add License,2CORE","L7N25-OpzWinServSTD2core","634-BYKQ","DELL",null,null,null,"634-634-BSGS","634-BSGS"]
["L7N27",27,"OpzOpenSource",37.119999999999997,"L7N27","TS4L7-LINUX",1,"Ubuntu Server 22.04 LTS 64 Bit","Ubuntu Server 22.04 LTS 64 Bit","L7N26-OpzOpenSource",null,null,null,null,null,""]
["L7N28",28,"OpzHDDRetention36",25.19,"L7N28","TS4L7-HDRTN36",1,"Hard Disk Retention 36 mesi","Hard Disk Retention 36 mesi","L7N29-OpzHDDRetention60","785-10921","DELL",1,2,3,"405-V5FKR","V5FKR"]
["L7N28b",28,"OpzHDDRetention60",41.81,"L7N28","TS4L7-HDRTN60",1,"Hard Disk Retention 60 mesi","Hard Disk Retention 60 mesi","L7N29-OpzHDDRetention60","785-10921","DELL",1,2,3,"405-V5FKR","V5FKR"]
["L7N29",29,"OpzEstensione24",183.01,"L7N29","TS4L7-OpzEst24",1,"Estensione della manutenzione in garanzia per ulteriori 24 mesi","Estensione della manutenzione in garanzia per ulteriori 24 mesi","L7N30-OpzEst24","P6142NCONSIP",null,null,null,null,"P614P6142NCONSIP","P6142NCONSIP"]
["L7N30",30,"OpzRack",579.63,"L7N30","TS4L7-RACK",1,"Armadio Rack 42U","Armadio Rack 42U","L7N29-OpzRack","P6142NCONSIP",null,null,null,null,"P614P6142NCONSIP","P6142NCONSIP"]
["L7N31",31,"OpzEstensione24-GPU",115.54,"L7N31","TS4L7-OpzEst24GPU",1,"Estensione della manutenzione GPU in garanzia per ulteriori 24 mesi","Estensione della manutenzione GPU in garanzia per ulteriori 24 mesi","L7N31 - OpzEstensione24-GPU","P6142NCONSIP",null,null,null,null,"P614P6142NCONSIP","P6142NCONSIP"]
["L7N31",31,null,334,"L7N31","TS4L7-57416-L",1,"Broadcom 57416 Dual Port 10Gb, Base-T, PCIe Adapter, Low Profile","Broadcom 57416 Dual Port 10Gb, Base-T, PCIe Adapter, Low Profile","TS4-OpzA205741L","540-BBVM","DELL",4,null,null,"540-MT69G","MT69G"]
["L7N32",32,null,null,"L7N32","TS4L7-BOSS240",1,"BOSS controller card, full height, with 2 240G M.2 Drives","BOSS controller card, full height, with 2 240G M.2 Drives",null,"403-BBVQ","DELL",1,2,3,"403-4FXXT","4FXXT"]
[null,null,null,null,null,null,2,"Dell 240GB SSD M.2 SATA 6Gbps Drive","Dell 240GB SSD M.2 SATA 6Gbps Drive",null,"400-ASDQ","DELL",null,null,null,"400-4GWX0","4GWX0"]
["L7N33",33,null,748,"L7N33","TS4L7-BOSS480",1,"BOSS controller card, full height, with 2 480G M.2 Drives","BOSS controller card, full height, with 2 480G M.2 Drives","TS4-OpzA20B480G","403-BBVQ","DELL",1,2,3,"403-4FXXT","4FXXT"]
[null,null,null,null,null,null,2,"Dell 480GB M.2 SSD SATA 512n 6Gbps S3520","Dell 480GB M.2 SSD SATA 512n 6Gbps S3520",null,"400-AVSS","DELL",null,null,null,"400-9NF27","9NF27"]
["L7N34",34,null,180,"L7N34","TS4L7-HBA355i-L",1,"HBA355i Controller Adapter, Front, Cust Kit","HBA355i Controller Adapter, Front, Cust Kit","TS4-OpzA20HBA3L","405-AANM","DELL",4,null,null,"405-Y29HF","Y29HF"]
["L7N35",35,null,9999,"L7N35","TS4L7-HBA330M",1,"Customer Kit,Card,Controller,HBA330,Minicard","Customer Kit,Card,Controller,HBA330,Minicard",null,"405-AAJW","DELL","int",null,null,"405-THN56","THN56"]
["L7N36",36,null,299,"L7N36","TS4L7-GPUSW",1,"Kit upgrade chassies for Server GPU Single-Wide Ready","Kit upgrade chassies for Server GPU Single-Wide Ready","TS4-OpzA20GPUSW","490-BEIX","DELL",null,null,null,"490-JKFGX","JKFGX"]
["L7N37",37,null,0,"L7N37","TS4L7-GPUDW",1,"Kit upgrade chassies for Server GPU Double-Wide Ready","Kit upgrade chassies for Server GPU Double-Wide Ready","TS4-OpzA20GPUDW","490-BEIX","DELL",null,null,null,"490-JKFGX","JKFGX"]
["L7N105",105,null,0,"L7N105","TS4L7_2cpuChassis",1,"Kit upgrade chassies for 2 CPU","Kit upgrade chassies for 2 CPU","TS4-Opz2CPU",null,"DELL",null,null,null,"490-JKFGX","JKFGX"]
["L7N38",38,null,0,"L7N38","TS4L7-VSAN",1,"Kit upgrade chassies for Server vSAN Ready","Kit upgrade chassies for Server vSAN Ready","TS4-OpzA20VSAN",null,"DELL",null,null,null,""]
["L7N39",39,null,720,"L7N39","TS4L7-CONX6SP",1,"Mellanox ConnectX-6 Single Port HDR100 QSFP56 Infiniband FULL","Mellanox ConnectX-6 Single Port HDR100 QSFP56 Infiniband FULL","TS4-OpzA20CX6SP","540-BCMU","DELL","NO",null,null,"540-DXMD8","DXMD8"]
["L7N40",40,null,812,"L7N40","TS4L7-CONX6DP",1,"Mellanox ConnectX-6 DX Dual Port 100GbE QFSFP56 FULL","Mellanox ConnectX-6 DX Dual Port 100GbE QFSFP56 FULL","TS4-OpzA20CX6DP","540-BCXP",null,"NO",null,null,"540-2RMCP","2RMCP"]
["L7N41",41,null,342,"L7N41","TS4L7-X710DP-L",1,"Intel X710 Dual Port 10Gb SFP+ LOW","Intel X710 Dual Port 10Gb SFP+ LOW","TS4-OpzA20710DL","540-BBML","Intel X710 adapters require firmware 19.0 or later to work with the SFP + SR Optic (Factory Installed SKU # 407-BCBE and Kit SKU 407-BCBN).",4,null,null,"540-VHNMC","VHNMC"]
["L7N42",42,null,342,"L7N42","TS4L7-X710DP",1,"Intel X710 Dual Port 10Gb SFP+ FULL","Intel X710 Dual Port 10Gb SFP+ FULL","TS4-OpzA20710D","540-BBIV",null,1,2,3,"540-6W1YC","6W1YC"]
["L7N43",43,null,518,"L7N43","TS4L7-X710QP",1,"Intel X710 Quad Port 10Gb SFP+ FULL","Intel X710 Quad Port 10Gb SFP+ FULL","TS4-OpzA20710Q","540-BBIW","Intel X710 adapters require firmware 19.0 or later to work with the SFP + SR Optic (Factory Installed SKU # 407-BCBE and Kit SKU 407-BCBN).",null,null,null,"540-60WX8","60WX8"]
["L7N44",44,null,null,"L7N44",null,1,"PERC H745 Controller","PERC H745 Controller",null,"405-AAMX","DELL",4,null,null,"405-39M19","39M19"]
["L7N45",45,null,null,"L7N45",null,1,"Customer Kit,Card,Controller,H740P,Minicard","Customer Kit,Card,Controller,H740P,Minicard",null,"405-AANL","DELL","int",null,null,"405-4R84R","4R84R"]
["L7N46",46,null,334,"L7N46","TS4L7-57416",1,"Broadcom 57416 Dual Port 10Gb, Base-T, PCIe Adapter, Full Height","Broadcom 57416 Dual Port 10Gb, Base-T, PCIe Adapter, Full Height","TS4-OpzA2057416","540-BBUO","DELL",null,null,null,"540-GRT2K","GRT2K"]
["L7N47",47,"Kit n. 1 Processore 8 Core base",99999,"L7N47","TS4L7-SRV8CORE",1,"Upgrade da Processore base a Processore 8 core","Upgrade da Processore base a Processore 8 core","TS4-OpzA20SRV8C","338-BTSX","DELL",null,null,null,"338-WP22J","WP22J"]
["L7N48",48,"Kit n. 1 Processore 8 Core aggiuntivo",99999,"L7N48","TS4L7-CPU8CORE",1,"Upgrade da Processore aggiuntivo a Processore 8 core","Upgrade da Processore aggiuntivo a Processore 8 core","TS4-OpzA20CPU8C","338-BTSX","DELL",null,null,null,"338-WP22J","WP22J"]
["L7N49",49,"OpzPSU2400W",0,"L7N49","TS4L7-PSU2400W",1,"Dual, Hot-Plug, Power Supply 2400W Redundant, D","Dual, Hot-Plug, Power Supply 2400W Redundant, D","TS4L7-PSU2400W","\t450-AJEV","DELL",null,null,null,"450-T4RTF","T4RTF"]
["L7N50",50,"OpzPSU2000W",306,"L7N50","TS4L7-PSU2000W",1,"Dual, Hot-plug Power Supply (1+1), 2000W in sostituzione di quelli in configurazione BASE","Dual, Hot-plug Power Supply (1+1), 2000W in sostituzione di quelli in configurazione BASE","TS4-OpzA202000W","450-AENT","DELL",null,null,null,"450-54WHW","54WHW"]
["L7N51",51,"OpzSSD-RI3,84TB",1380,"L7N51","TS4L7-RI3840GB",1,"SSD 3,84TB SAS RI 12Gbps 2.5in Hot-plug, 1 DWPD","SSD 3,84TB SAS RI 12Gbps 2.5in Hot-plug, 1 DWPD","TS4-OpzA20RI384","400-BBQZ","DELL",null,null,null,"400-64G77","64G77"]
["L7N52",52,"OpzSSD-RI7,68TB",2580,"L7N52","TS4L7-RI7680GB",1,"SSD 7,68TB VSAS RI 12Gbps 2.5in Hot-plug, 1 DWPD","SSD 7,68TB VSAS RI 12Gbps 2.5in Hot-plug, 1 DWPD","TS4-OpzA20RI768","400-BFPF","DELL",null,null,null,"400-7HH3W","7HH3W"]
["L7N53",53,"OpzSSD-WI800GB",1106,"L7N53","TS4L7-WI800GB",1,"800GB SSD SAS Write Intensive 12Gbps 512e 2.5in Hot Plug Drive, PM5, 10 DWPD, 29200 TBW, CK","800GB SSD SAS Write Intensive 12Gbps 512e 2.5in Hot Plug Drive, PM5, 10 DWPD, 29200 TBW, CK","TS4-OpzA20800WI","400-BDIL","DELL",null,null,null,"400-6P43P","6P43P"]
["L7N54",54,"OpzSSD-WI1600GB",9999,"L7N54","TS4L7-WI1600GB",1,"1.6TB SSD SAS Write Intensive 12Gbps 512e 2.5in Hot Plug PM5-M Dr, 10 DWPD, 29200 TBW, CK","1.6TB SSD SAS Write Intensive 12Gbps 512e 2.5in Hot Plug PM5-M Dr, 10 DWPD, 29200 TBW, CK",null,"400-BDGY","DELL",null,null,null,"400-NHGRN","NHGRN"]
["L7N55",55,"OpzGPUT4",2450,"L7N55","TS4L7-TESLAT4",1,"NVIDIA TeslaT4 16GB GPU","NVIDIA TeslaT4 16GB GPU","TS4-OpzA20GPUT4","490-BEYM","DELL",null,null,null,"490-F9PH5","F9PH5"]
["L7N56",56,"OpzGPURTX6000",4800,"L7N56","TS4L7-RTX6000",1,"NVIDIA Quadro RTX 6000 24 GB, 250W, Dual Slot, GPU","NVIDIA Quadro RTX 6000 24 GB, 250W, Dual Slot, GPU","TS4-OpzA20GPU60","490-BFRS","DELL",null,null,null,"490-VN574","VN574"]
["L7N57",57,"OpzGPUM10",2700,"L7N57","TS4L7-TESLAM10",1,"NVIDIA Tesla M10 GPU","NVIDIA Tesla M10 GPU","TS4-OpzA20GPU10","489-BBCJ","DELL",null,null,null,"489-409GF ","409GF "]
["L7N58",58,"OpzGPUV100S",10130,"L7N58","TS4L7-V100S32G",1,"NVIDIA Tesla V100S 32GB, 250W, Passive, Double Wide, GPU","NVIDIA Tesla V100S 32GB, 250W, Passive, Double Wide, GPU","TS4-OpzA20V100S","490-BFRT","DELL",null,null,null,"490-GH9J0","GH9J0"]
["L7N59",59,"OpzWinServDC",4339,"L7N59","TS4L7-WINDC",1,"Windows Server 2019 Data Center, ROK, 16CORE","Windows Server 2019 Data Center, ROK, 16CORE","TS4-OpzA20WDC","634-BSGB","DELL",null,null,null,"634-634-BSGB","634-BSGB"]
["L7N60",60,"OpzWinServDC2core",545,"L7N60","TS4L7-WINDC2C",1,"Windows Server 2019 Data Center, Additional License, 2CORE","Windows Server 2019 Data Center, Additional License, 2CORE","TS4-OpzA20WDC2C","634-BSGR","DELL",null,null,null,"634-634-BSGR","634-BSGR"]
["L7N61",61,"OpzWinServDC16core",4336,"L7N61","TS4L7-WINDC16C",1,"MS2019 Datacenter Ed, Additional License, 16 CORE,NO MEDIA/KEY, Customer Kit","MS2019 Datacenter Ed, Additional License, 16 CORE,NO MEDIA/KEY, Customer Kit",null,"634-BSGT","DELL",null,null,null,"634-634-BSGT","634-BSGT"]
["L7N62",62,"OpzRJ45 3m",3,"L7N62","TS4L7-RJ453M",1,"Cavo “patch” di 3 mt RJ45 certificato per gigabit ethernet","Cavo “patch” di 3 mt RJ45 certificato per gigabit ethernet","TS4-OpzA20RJ45",null,null,null,null,null,""]
["L7N63",63,"OpzLINKX3m",9999,"L7N63","TS4L7-MEL100M3",1,"Mellanox LinkX 100Gb/s Passive Copper Cables - attacco cavo diretto - 3 m - nero","Mellanox LinkX 100Gb/s Passive Copper Cables - attacco cavo diretto - 3 m - nero",null,"AA407867","DELL",null,null,null,"AA40AA407867","AA407867"]
["L7N64",64,"OpzLINKX10m",9999,"L7N64","TS4L7-MEL100M10",1,"Mellanox LinkX 100Gb/s VCSEL-Based Active Optical Cables - cavo InfiniBand - 10 m","Mellanox LinkX 100Gb/s VCSEL-Based Active Optical Cables - cavo InfiniBand - 10 m",null,"A8431034","DELL",null,null,null,"A843MFA1A00-E010","MFA1A00-E010"]
["L7N65",65,"OpzQSFP28",9999,"L7N65","TS4L7-QSFP28",1,"Dell EMC PowerEdge QSFP28 SR4 100GbE 85C optic Customer Install","Dell EMC PowerEdge QSFP28 SR4 100GbE 85C optic Customer Install",null,"407-BCEX","DELL",null,null,null,"407-5M3CP","5M3CP"]
["L7N66",66,"Opz10GBIC",90,"L7N66","TS4L7-10GBIC",1,"Transceiver, SFP+, 10GbE, SR, 850nm Wavelength, 300m Reach","Transceiver, SFP+, 10GbE, SR, 850nm Wavelength, 300m Reach",null,"407-BBOU","DELL",null,null,null,"407-RK0CX","RK0CX"]
["L7N67",67,"OpzDAC3M",9999,"L7N67","TS4L7-DAC3M",1,"Cable, SFP+ to SFP+, 10GbE, Copper Twinax Direct Attach Cable, 3 Meter","Cable, SFP+ to SFP+, 10GbE, Copper Twinax Direct Attach Cable, 3 Meter",null,"470-AAVJ","DELL",null,null,null,"470-4WM8D","4WM8D"]
["L7N68",68,"OpzBezelLCD",63,"L7N68","TS4L7-BZLLCD",1,"PowerEdge 2U LCD Bezel","PowerEdge 2U LCD Bezel","TS4-OpzA20BZLCD","325-BCHW","DELL",null,null,null,"325-MPW3H","MPW3H"]
["L7N69",69,"OpzBezelSTD",42,"L7N69","TS4L7-BZLSTD",1,"PowerEdge 2U Standard Bezel","PowerEdge 2U Standard Bezel","TS4-OpzA20BZSTD","350-BBJW","DELL",null,null,null,"350-0V5VK","0V5VK"]
["L7N70",70,"OpBOSS",134,"L7N70","TS4L7-BOSS",1,"BOSS-S2 controller card without cable","BOSS-S2 controller card without cable","TS4-OpzBOSS","403-BCMD","DELL",null,null,null,"385-NYT1H","NYT1H"]
[null,null,null,null,null,null,1,"Cables & mechanical part for BOSS S2, R7525","Cables & mechanical part for BOSS S2, R7525",null,"403-BCNS","DELL",null,null,null,"385-YYC3N","YYC3N"]
[null,null,null,null,null,null,1,"Rear x4 Cables & mechanical part for BOSS S2, R7525","Rear x4 Cables & mechanical part for BOSS S2, R7525",null,"403-BCQC","DELL"]
[null,null,null,null,null,null,2,"480GB,2E,IT06,M.2 Single Stick","480GB,2E,IT06,M.2 Single Stick",null,"400-BLCK","DELL"]
["L7N71",71,"OpzH840",479,"L7N71","TS4L7-H840",1,"PERC H840 RAID Adapter for External MD14XX Only, 8GB NV Cache, Full Height","PERC H840 RAID Adapter for External MD14XX Only, 8GB NV Cache, Full Height","TS4-OpzA20H840","405-AAMZ","DELL",null,null,null,""]
["L7N72",72,null,16549,"L7N72","TS4L7-VS7STD6AK",1,"VMware vSphere 7 Standard Acceleration Kit OEM for 6 CPU, 3YR License and Maintenance","VMware vSphere 7 Standard Acceleration Kit OEM for 6 CPU, 3YR License and Maintenance","TS4-OpzA20VMW01",null,"DELL",null,null,null,""]
["L7N73",73,null,1557,"L7N73","TS4L7-VS7STD",1,"VMware vSphere 7 Standard OEM, 1 CPU (max 32 cores/CPU socket), 3YR License and Maintenance","VMware vSphere 7 Standard OEM, 1 CPU (max 32 cores/CPU socket), 3YR License and Maintenance","TS4-OpzA20VMW02",null,"DELL",null,null,null,""]
["L7N74",74,null,34860,"L7N74","TS4L7-VS7EPL6AK",1,"VMware vSphere 7 Enterprise Plus Acceleration Kit OEM for 6 CPU, 3YR License and Maintenance","VMware vSphere 7 Enterprise Plus Acceleration Kit OEM for 6 CPU, 3YR License and Maintenance","TS4-OpzA20VMW03",null,"DELL",null,null,null,""]
["L7N80",75,null,4576,"L7N80","TS4L7-VS7EPL",1,"VMware vSphere 7 Enterprise Plus OEM, 1 CPU (max 32 cores/CPU socket), 3YR License and Maintenance","VMware vSphere 7 Enterprise Plus OEM, 1 CPU (max 32 cores/CPU socket), 3YR License and Maintenance","TS4-OpzA20VMW04",null,"DELL",null,null,null,""]
["L7N81",76,null,7860,"L7N81","TS4L7-VCS7STD",1,"VMware vCenter 7 Standard OEM ,Per Instance,3YR License and Maintenance","VMware vCenter 7 Standard OEM ,Per Instance,3YR License and Maintenance","TS4-OpzA20VMW05"]
["L7N82",77,null,7196,"L7N82","TS4L7-ST7ENT",1,"VMware vSAN 7 Enterprise OEM, 1 CPU (max 32 cores/CPU socket), 3YR License and Maintenance","VMware vSAN 7 Enterprise OEM, 1 CPU (max 32 cores/CPU socket), 3YR License and Maintenance","TS4-OpzA20VMW06"]
["L7N83",78,null,5028,"L7N83","TS4L7-HZ8ADC10",1,"VMware Horizon 8 Advanced OEM,10 Pack,CCU, 3YR License and Maintenance","VMware Horizon 8 Advanced OEM,10 Pack,CCU, 3YR License and Maintenance","TS4-OpzA20VMW07"]
["L7N84",79,null,7116,"L7N84","TS4L7-HZ8ENC10",1,"VMware Horizon 8 Enterprise OEM,10 Pack,CCU, 3YR License and Maintenance","VMware Horizon 8 Enterprise OEM,10 Pack,CCU, 3YR License and Maintenance","TS4-OpzA20VMW08"]
["L7N85",80,null,3089,"L7N85","TS4L7-HZ8ADN10",1,"VMware Horizon Advanced OEM, 10 Pack, Named User, 3YR License and Maintenance","VMware Horizon Advanced OEM, 10 Pack, Named User, 3YR License and Maintenance","TS4-OpzA20VMW09"]
["L7N86",81,null,4398,"L7N86","TS4L7-HZ8ENN10",1,"VMware Horizon 8 Enterprise OEM,10 Pack, Named User, 3YR License and Maintenance","VMware Horizon 8 Enterprise OEM,10 Pack, Named User, 3YR License and Maintenance","TS4-OpzA20VMW10"]
["L7N87",82,null,2727,"L7N87","TS4L7-Encl13Y4H",1,"Enclosure SAS 12 Slot 3.5\", 3YR ProSupport and 4hr Mission Critical","Enclosure SAS 12 Slot 3.5\", 3YR ProSupport and 4hr Mission Critical","TS4-OpzA20E13Y4"]
["L7N88",83,null,2827,"L7N88","TS4L7-Encl25Y4H",1,"Enclosure SAS 12 Slot 3.5\", 5YR ProSupport and 4hr Mission Critical","Enclosure SAS 12 Slot 3.5\", 5YR ProSupport and 4hr Mission Critical","TS4-OpzA20E25Y4"]
["L7N89",84,null,2653,"L7N89","TS4L7-RACKM32A",1,"Armadio Rack 42U 600x1200, 2 x PDU Monofase 2G, ZeroU, 32A, 230V, (36) C13 & (6) C19","Armadio Rack 42U 600x1200, 2 x PDU Monofase 2G, ZeroU, 32A, 230V, (36) C13 & (6) C19","TS4-OpzA20RAPCM"]
["L7N90",85,null,4311,"L7N90","TS4L7-RACKT32A",1,"Armadio Rack 42U 600x1200, 2 x PDU Trifase 2G, ZeroU, 22.0kW(32A) 17.3kW(24A), 230V, (30) C13 & (12) C19","Armadio Rack 42U 600x1200, 2 x PDU Trifase 2G, ZeroU, 22.0kW(32A) 17.3kW(24A), 230V, (30) C13 & (12) C19","TS4-OpzA20RAPCT"]
["L7N91",86,null,84,"L7N91","TS4L7-DAC3SFP",1,"Dell Networking, Cable, SFP+ to SFP+, 10GbE, Copper Twinax Direct Attach Cable, 3 Meter","Dell Networking, Cable, SFP+ to SFP+, 10GbE, Copper Twinax Direct Attach Cable, 3 Meter","TS4-OpzA20DAC3S"]
["L7N92",87,null,258,"L7N92","TS4L7-MLX100M3",1,"Mellanox LinkX 100Gb/s Passive Copper DAC 3m per scheda TS4L7-CONX6DP","Mellanox LinkX 100Gb/s Passive Copper DAC 3m per scheda TS4L7-CONX6DP","TS4-OpzA20ML100"]
["L7N93",88,null,99,"L7N93","TS4L7-DAC3SFP28",1,"Dell Cable SFP28 to SFP28 25GbE Passive Copper Twinax Direct Attach Cable 3 Meter ","Dell Cable SFP28 to SFP28 25GbE Passive Copper Twinax Direct Attach Cable 3 Meter ","TS4-OpzA20DAC28"]
["L7N94",89,null,419,"L7N94","TS4L7-MCX4DP",1,"Mellanox ConnectX-4 Lx Dual Port 25GbE SFP28 Network Adapter, PCIe Full Height, 2 x SFP28 SR Optic, 25GbE","Mellanox ConnectX-4 Lx Dual Port 25GbE SFP28 Network Adapter, PCIe Full Height, 2 x SFP28 SR Optic, 25GbE","TS4-OpzA20MCX4F"]
["L7N95",90,null,419,"L7N95","TS4L7-MCX4DP-L",1,"Mellanox ConnectX-4 Lx Dual Port 25GbE SFP28 Network Adapter, Low Profile, 2 x SFP28 SR Optic, 25GbE","Mellanox ConnectX-4 Lx Dual Port 25GbE SFP28 Network Adapter, Low Profile, 2 x SFP28 SR Optic, 25GbE","TS4-OpzA20MCX4L"]
["L7N96",91,null,214,"L7N96","TS4L7-OMEA",1,"OpenManage Enterprise Advanced","OpenManage Enterprise Advanced","TS4-OpzA20OMEA"]
["L7N97",97,null,0,"L7N97","TS4L7-NVME",1,"Kit upgrade chassies for Server nVME","Kit upgrade chassies for Server nVME","TS4-OpzA20NVME","330-BBLV","DELL",null,null,null,""]
["L7N98",98,null,3027,"L7N98","TS4L7-Encl33Y4H",1,"Enclosure SAS 24 Slot 2.5\", 3YR ProSupport and 4hr Mission Critical","Enclosure SAS 24 Slot 2.5\", 3YR ProSupport and 4hr Mission Critical","TS4-OpzA20E33Y4","210-ADBP","DELL"]
["L7N99",99,null,3327,"L7N99","TS4L7-EncL75Y4H",1,"Enclosure SAS 24 Slot 2.5\", 5YR ProSupport and 4hr Mission Critical","Enclosure SAS 24 Slot 2.5\", 5YR ProSupport and 4hr Mission Critical","TS4-OpzA20E45Y4","210-ADBP","DELL"]
["L7N100",100,null,92,"L7N100","TS4L7-SAS12-L",1,"SAS 12Gbps HBA External Controller, Low Profile","SAS 12Gbps HBA External Controller, Low Profile","TS4-OpzA20SAS12L","405-AAES","DELL"]
["L7N101",101,null,92,"L7N101","TS4L7-SAS12",1,"SAS 12Gbps HBA External Controller, Full Height","SAS 12Gbps HBA External Controller, Full Height","TS4-OpzA20SAS12","405-AADZ","DELL"]
["L7N102",102,null,479,"L7N102","TS4L7-H840-L",1,"PERC H840 RAID Adapter, Low Profile for External Enclosure ","PERC H840 RAID Adapter, Low Profile for External Enclosure ","TS4-OpzA20H840L","405-AANN","DELL"]
["L7N103",103,null,494,"L7N103","TS4L7-ED16TB",1,"HDD 16TB SAS 12Gbps 7k 3.5in Hot-Plug per Enclosure 3.5\"","HDD 16TB SAS 12Gbps 7k 3.5in Hot-Plug per Enclosure 3.5\"","TS4-OpzA20ED16TB","400-BJKO","DELL"]
["L7N104",104,null,443,"L7N104","TS4L7-ED12TB",1,"HDD 12TB SAS 12Gbps 7k 3.5in Hot-Plug per Enclosure 3.5\"","HDD 12TB SAS 12Gbps 7k 3.5in Hot-Plug per Enclosure 3.5\"","TS4-OpzA20ED12TB","400-AXLG","DELL"]
["L7N105",105,null,281,"L7N105","TS4L7-ED08TB",1,"HDD 8TB SAS 12Gbps 7k 3.5in Hot-Plug per Enclosure 3.5\"","HDD 8TB SAS 12Gbps 7k 3.5in Hot-Plug per Enclosure 3.5\"","TS4-OpzA20ED8TB","400-BLCE","DELL"]
["L7N106",106,null,226,"L7N106","TS4L7-ED2TB",1,"HDD 2400GB 10K SAS 12Gbps 2.5in Hot-plug per Enclosure 2.5\"","HDD 2400GB 10K SAS 12Gbps 2.5in Hot-plug per Enclosure 2.5\"","L2N05-OpzHDD2TB","400-AUQX","DELL"]
["L7N107",107,null,727,"L7N107","TS4L2-EDRI800",1,"SSD 960GB SAS RI 12Gbps 2.5in Hot-plug, 1 DWPD per Enclosure 2.5\"","SSD 960GB SAS RI 12Gbps 2.5in Hot-plug, 1 DWPD per Enclosure 2.5\"","L2N08-OpzSSD-RI800GB","400-BBOU","DELL"]
["L7N108",108,null,10130,"L7N108","TS4L7-A100",1,"NVIDIA Ampere A100, PCIe, 250W , 40GB Passive, Double Wide, Full Height GPU","NVIDIA Ampere A100, PCIe, 250W , 40GB Passive, Double Wide, Full Height GPU","TS4-OpzA20A100","490-BGFV","DELL"]
["L7N109",109,null,126,"L7N109","TS4L7-OT10GB",1,"SFP+ SR Optic for SFP+ ports (Intel X710)","SFP+ SR Optic for SFP+ ports (Intel X710)","TS4-OpzA20O10GB","407-BCBN","DELL"]
["L7N110",110,null,8.66,"L7N110","TS4L7-VAPPS1Y",1,"NVIDIA vApps Subscription License 1 Year, 1 CCU","NVIDIA vApps Subscription License 1 Year, 1 CCU","TS4-OpzA20NVIDIA1","A9923501","DELL"]
["L7N111",111,null,25.98,"L7N111","TS4L7-VAPPS3Y",1,"NVIDIA vApps Subscription License 3 Years, 1 CCU","NVIDIA vApps Subscription License 3 Years, 1 CCU","TS4-OpzA20NVIDIA2","A9923502","DELL"]
["L7N112",112,null,43.3,"L7N112","TS4L7-VAPPS5Y",1,"NVIDIA vApps Subscription License 5 Years, 1 CCU","NVIDIA vApps Subscription License 5 Years, 1 CCU","TS4-OpzA20NVIDIA3","AA121477","DELL"]
["L7N113",113,null,43.3,"L7N113","TS4L7-VPC1Y",1,"NVIDIA vPC Subscription License 1 Year, 1 CCU","NVIDIA vPC Subscription License 1 Year, 1 CCU","TS4-OpzA20NVIDIA4","A9923507","DELL"]
["L7N114",114,null,129.91,"L7N114","TS4L7-VPC3Y",1,"NVIDIA vPC Subscription License 3 Years, 1 CCU","NVIDIA vPC Subscription License 3 Years, 1 CCU","TS4-OpzA20NVIDIA5","A9923508","DELL"]
["L7N115",115,null,173.2,"L7N115","TS4L7-VPC5Y",1,"NVIDIA vPC Subscription License 5 Years, 1 CCU","NVIDIA vPC Subscription License 5 Years, 1 CCU","TS4-OpzA20NVIDIA6","AA121478","DELL"]
["L7N116",116,null,210.13,"L7N116","TS4L7-VWS1Y",1,"NVIDIA RTX vWS Subscription License 1 Year, 1 CCU","NVIDIA RTX vWS Subscription License 1 Year, 1 CCU","TS4-OpzA20NVIDIA7","A9923513","DELL"]
["L7N117",117,null,649.5,"L7N117","TS4L7-VWS3Y",1,"NVIDIA RTX vWS Subscription License 3 Years, 1 CCU","NVIDIA RTX vWS Subscription License 3 Years, 1 CCU","TS4-OpzA20NVIDIA8","A9923514","DELL"]
["L7N118",118,null,1082.51,"L7N118","TS4L7-VWS5Y",1,"NVIDIA RTX vWS Subscription License 5 Years, 1 CCU","NVIDIA RTX vWS Subscription License 5 Years, 1 CCU","TS4-OpzA20NVIDIA9","AA121476","DELL"]
["L7N119",119,null,129.91,"L7N119","TS4L7-VCS1Y",1,"NVIDIA Virtual Compute Server Subscription, 1 GPU (Max 8 CC VMs), 1 Year","NVIDIA Virtual Compute Server Subscription, 1 GPU (Max 8 CC VMs), 1 Year","TS4-OpzA20NVIDIA10","AA731569","DELL"]
["L7N120",120,null,378.25,"L7N120","TS4L7-VCS3Y",1,"NVIDIA Virtual Compute Server Subscription, 1 GPU (Max 8 CC VMs), 3 Years","NVIDIA Virtual Compute Server Subscription, 1 GPU (Max 8 CC VMs), 3 Years","TS4-OpzA20NVIDIA11","AB229530","DELL"]
["L7N121",121,null,630.41,"L7N121","TS4L7-VCS5Y",1,"NVIDIA Virtual Compute Server Subscription, 1 GPU (Max 8 CC VMs), 5 Years","NVIDIA Virtual Compute Server Subscription, 1 GPU (Max 8 CC VMs), 5 Years","TS4-OpzA20NVIDIA12","AB229531","DELL"]
["L7N122",122,null,36.56,"L7N122","TS4L7-VAPPS-P4Y",1,"NVIDIA vApps Bundle Perpetual License Plus 4yr vApps SUMS, 1CCU","NVIDIA vApps Bundle Perpetual License Plus 4yr vApps SUMS, 1CCU","TS4-OpzA20NVIDIA13","AA787756","DELL"]
["L7N123",123,null,41.37,"L7N123","TS4L7-VAPPS-P5Y",1,"NVIDIA vApps Bundle Perpetual License Plus 5yr vApps SUMS, 1CCU","NVIDIA vApps Bundle Perpetual License Plus 5yr vApps SUMS, 1CCU","TS4-OpzA20NVIDIA14","AA787759","DELL"]
["L7N124",124,null,182.82,"L7N124","TS4L7-VPC-P4Y",1,"NVIDIA vPC Bundle Perpetual License Plus 4yr vPC SUMS, 1CCU","NVIDIA vPC Bundle Perpetual License Plus 4yr vPC SUMS, 1CCU","TS4-OpzA20NVIDIA15","AA787765","DELL"]
["L7N125",125,null,206.87,"L7N125","TS4L7-VPC-P5Y",1,"NVIDIA vPC Bundle Perpetual License Plus 5yr vPC SUMS, 1CCU","NVIDIA vPC Bundle Perpetual License Plus 5yr vPC SUMS, 1CCU","TS4-OpzA20NVIDIA16","AA787768","DELL"]
["L7N126",126,null,774.6,"L7N126","TS4L7-VWS-P4Y",1,"NVIDIA RTX vWS Bundle Perpetual License Plus 4yr RTX vWS SUMS, 1CCU","NVIDIA RTX vWS Bundle Perpetual License Plus 4yr RTX vWS SUMS, 1CCU","TS4-OpzA20NVIDIA17","AA787774","DELL"]
["L7N127",127,null,870.81,"L7N127","TS4L7-VWS-P5Y",1,"NVIDIA RTX vWS Bundle Perpetual License Plus 5yr RTX vWS SUMS, 1CCU","NVIDIA RTX vWS Bundle Perpetual License Plus 5yr RTX vWS SUMS, 1CCU","TS4-OpzA20NVIDIA18","AA787777","DELL"]
["L7N128",128,null,1,"L7N128","TS4L7-VWSUPG4Y",1,"NVIDIA vPC to NVIDIA RTX vWS Upgrade 4 year SUMS Bundle","NVIDIA vPC to NVIDIA RTX vWS Upgrade 4 year SUMS Bundle","TS4-OpzA20NVIDIA19","AB284633","DELL"]
["L7N129",129,null,1,"L7N129","TS4L7-VWSUPG5Y",1,"NVIDIA vPC to NVIDIA RTX vWS Upgrade 5 year SUMS Bundle","NVIDIA vPC to NVIDIA RTX vWS Upgrade 5 year SUMS Bundle","TS4-OpzA20NVIDIA20","AB284636","DELL"]
["L7N130",130,null,69,"L7N130","TS4L7-OM4M3",1,"Dell Networking Cable, OM4 LC/LC Fiber Cable, 3 Meter","Dell Networking Cable, OM4 LC/LC Fiber Cable, 3 Meter","TS4L7-OM4M3",null,"DELL"]
["L7N131",131,null,12460,"L7N131","TS4L7-A10080GB",1,"NVIDIA Ampere A100, PCIe, 300W, 80GB Passive, Double Wide, Full Height GPU","NVIDIA Ampere A100, PCIe, 300W, 80GB Passive, Double Wide, Full Height GPU","TS4-OpzA20A10080","490-BHBK","DELL"]
["L7N132",132,null,1269,"L7N132","TS4L7-GPUA2",1,"NVIDIA Ampere A2, PCIe, 60W, 16GB Passive, Single Wide, Full Height GPU","NVIDIA Ampere A2, PCIe, 60W, 16GB Passive, Single Wide, Full Height GPU","TS4-OpzA20A2","490-BHMC","DELL"]
["L7N133",133,null,4657,"L7N133","TS4L7-GPUA30",1,"NVIDIA Ampere A30, PCIe, 165W, 24GB Passive, Double Wide, Full Height GPU","NVIDIA Ampere A30, PCIe, 165W, 24GB Passive, Double Wide, Full Height GPU","TS4-OpzA20A30","490-BGUS","DELL"]
["L7N134",134,null,3394,"L7N134","TS4L7-GPUA16",1,"NVIDIA Ampere A16, PCIe, 250W, 64GB Passive, Double Wide, Full Height GPU","NVIDIA Ampere A16, PCIe, 250W, 64GB Passive, Double Wide, Full Height GPU","TS4-OpzA20A16","490-BHES","DELL"]
["L7N135",135,null,50,"L7N135","TS4L7-CMA2U",1,"2U Cable Management Arm","2U Cable Management Arm","TS4-OpzA20CMA2U","770-BBIP","DELL"]