{"text_format":"1","workbook":"xlsx","n_sheets":7,"sheets":["Lotto7_R7525_1","Lotto7_R7525_2","Lotto7_R7525_3","Altre_Opzioni","Riepilogo_Ordine","ConfigurationTS3L4","Tabella_prezzi"],"not_rendered":{"charts":0,"images":8,"macros":1,"external_links":1,"defined_names":85,"comments":0,"pivot_tables":0},"unopened":[],"bounds":{"document_bytes":16777216,"sheet_cells":100000,"rows_first":2000,"rows_last":500,"rows_between":2000,"halvings":0,"cell_chars":16384,"cell_head_chars":4096},"cells_cut":0,"cells_raw":0,"read":"whole","date_system":"1900"}

{"sheet":"Lotto7_R7525_1","index":0,"n_rows":154,"n_cols":31,"rows_kept":154,"cut":false,"hidden":false,"merged":[[8,8,8,10],[8,11,8,12],[9,8,9,10],[9,11,9,12],[11,8,11,10],[11,11,11,12],[48,7,49,7],[12,8,12,10],[12,11,12,12],[14,8,14,10],[14,11,14,12],[15,8,15,10],[15,11,15,12],[18,8,19,8],[21,8,22,8],[22,12,25,12],[27,8,28,8],[45,8,46,8],[154,7,165,10],[135,8,136,8],[69,8,70,8],[71,12,73,13],[72,8,73,8],[132,8,133,8],[138,8,139,8],[153,7,153,10]]}
[]
[null,null,null,null,null,null,null,"Convenzione \nTecnologie Server 4 - Lotto 7",null,{"$f":"IF(T100>1,\"ERRORE NELLA CONFIGURAZIONE\",\"\")","v":""}]
[null,null,null,null,null,null,null,null,null,null,null,null,"Quota massima 20 %"]
[null,null,null,null,null,null,null,null,null,"Guida alla Convenzione","Totale Singola Configurazione",null,{"$f":"Riepilogo_Ordine!G59","v":0}]
[null,null,null,null,null,null,null,null,null,null,{"$f":"K152","v":0},null,"Totale Ordine \nIva Esclusa"]
[null,null,null,null,null,null,null,"DELL POWEREDGE R7525\nGPU Ready",null,"Quantità Server",0,null,{"$f":"Riepilogo_Ordine!J60","v":0}]
[]
[]
[null,null,null,null,null,null,null,"N° Ordine Consip","Amministrazione",null,null,"Data"]
[]
[]
[null,null,null,null,null,null,null,"Nom. Referente Consegna","Email Consegna",null,null,"Tel."]
[]
[]
[null,null,null,null,null,null,null,"Nom. Referente Installazione","Email Installazione","Tel.",null,"Tel."]
{"$rows_left_out":140}
{"sheet":"Lotto7_R7525_2","index":1,"n_rows":154,"n_cols":31,"rows_kept":154,"cut":false,"hidden":false,"merged":[[154,7,165,10],[69,8,70,8],[71,12,73,13],[72,8,73,8],[132,8,133,8],[138,8,139,8],[153,7,153,10],[135,8,136,8],[48,7,49,7],[12,8,12,10],[12,11,12,12],[14,8,14,10],[14,11,14,12],[15,8,15,10],[15,11,15,12],[18,8,19,8],[21,8,22,8],[22,12,25,12],[27,8,28,8],[45,8,46,8],[8,8,8,10],[8,11,8,12],[9,8,9,10],[9,11,9,12],[11,8,11,10],[11,11,11,12]]}
[]
[null,null,null,null,null,null,null,"Convenzione \nTecnologie Server 4 - Lotto 7",null,{"$f":"IF(T100>1,\"ERRORE NELLA CONFIGURAZIONE\",\"\")","v":""}]
[null,null,null,null,null,null,null,null,null,null,null,null,"Quota massima 20 %"]
[null,null,null,null,null,null,null,null,null,"Guida alla Convenzione","Totale Singola Configurazione",null,{"$f":"Riepilogo_Ordine!G59","v":0}]
[null,null,null,null,null,null,null,{"$f":"IF($J$23=\"TS4L7-VSAN\",\"vSAN Server Ready\",IF($J$23=\"TS4L7-GPUDW\",\"GPU Double-Wide Server Ready\",IF($J$23=\"TS4L7-GPUSW\",\"GPU Single-Wide Server Ready\",IF(N20=\"VxFlex\",\"PowerFlex Server\",\"\"))))","v":""},null,null,{"$f":"K152","v":0},null,"Totale Ordine \nIva Esclusa"]
[null,null,null,null,null,null,null,"DELL POWEREDGE R7525\nGPU Ready",null,"Quantità Server",0,null,{"$f":"Riepilogo_Ordine!J60","v":0}]
[]
[]
[null,null,null,null,null,null,null,"N° Ordine Consip","Amministrazione",null,null,"Data"]
[]
[]
[null,null,null,null,null,null,null,"Nom. Referente Consegna","Email Consegna",null,null,"Tel."]
[]
[]
[null,null,null,null,null,null,null,"Nom. Referente Installazione","Email Installazione","Tel.",null,"Tel."]
{"$rows_left_out":140}
{"sheet":"Lotto7_R7525_3","index":2,"n_rows":154,"n_cols":31,"rows_kept":154,"cut":false,"hidden":false,"merged":[[154,7,165,10],[69,8,70,8],[71,12,73,13],[72,8,73,8],[132,8,133,8],[138,8,139,8],[153,7,153,10],[135,8,136,8],[48,7,49,7],[12,8,12,10],[12,11,12,12],[14,8,14,10],[14,11,14,12],[15,8,15,10],[15,11,15,12],[18,8,19,8],[21,8,22,8],[22,12,25,12],[27,8,28,8],[45,8,46,8],[8,8,8,10],[8,11,8,12],[9,8,9,10],[9,11,9,12],[11,8,11,10],[11,11,11,12]]}
[]
[null,null,null,null,null,null,null,"Convenzione \nTecnologie Server 4 - Lotto 7",null,{"$f":"IF(T100>1,\"ERRORE NELLA CONFIGURAZIONE\",\"\")","v":""}]
[null,null,null,null,null,null,null,null,null,null,null,null,"Quota massima 20 %"]
[null,null,null,null,null,null,null,null,null,"Guida alla Convenzione","Totale Singola Configurazione",null,{"$f":"Riepilogo_Ordine!G59","v":0}]
[null,null,null,null,null,null,null,{"$f":"IF($J$23=\"TS4L7-VSAN\",\"vSAN Server Ready\",IF($J$23=\"TS4L7-GPUDW\",\"GPU Double-Wide Server Ready\",IF($J$23=\"TS4L7-GPUSW\",\"GPU Single-Wide Server Ready\",IF(N20=\"VxFlex\",\"PowerFlex Server\",\"\"))))","v":""},null,null,{"$f":"K152","v":0},null,"Totale Ordine \nIva Esclusa"]
[null,null,null,null,null,null,null,"DELL POWEREDGE R7525\nGPU Ready",null,"Quantità Server",0,null,{"$f":"Riepilogo_Ordine!J60","v":0}]
[]
[]
[null,null,null,null,null,null,null,"N° Ordine Consip","Amministrazione",null,null,"Data"]
[]
[]
[null,null,null,null,null,null,null,"Nom. Referente Consegna","Email Consegna",null,null,"Tel."]
[]
[]
[null,null,null,null,null,null,null,"Nom. Referente Installazione","Email Installazione","Tel.",null,"Tel."]
{"$rows_left_out":140}
{"sheet":"Altre_Opzioni","index":3,"n_rows":25,"n_cols":14,"rows_kept":25,"cut":false,"hidden":false,"merged":[[15,5,16,5],[19,5,20,5],[23,5,24,5],[1,7,1,9],[4,5,5,5],[7,5,8,5],[11,5,12,5]]}
[]
[null,null,null,null,"Opzioni",null,null,"Totale altre opzioni"]
[]
[]
[null,null,null,null,"Opzione Rack APC con PDU Monofase"]
[null,null,null,null,"Armadio Rack 42U 600x1200, 2 x PDU Monofase 2G, ZeroU, 32A, 230V, (36) C13 & (6) C19",null,{"$f":"VLOOKUP($E6,TS4L4_ALL,13,FALSE)","v":{"$error":"#NAME?"}},null,null,null,null,{"$f":"VLOOKUP($E6,TS4L4_ALL,10,FALSE)*H6","v":{"$error":"#NAME?"}},{"$f":"VLOOKUP($E6,TS4L4_ALL,11,FALSE)*H6","v":{"$error":"#NAME?"}},{"$f":"VLOOKUP($E6,TS4L4_ALL,12,FALSE)","v":{"$error":"#NAME?"}}]
[]
[null,null,null,null,"Opzione Rack APC con PDU Trifase"]
[null,null,null,null,"Armadio Rack 42U 600x1200, 2 x PDU Trifase 2G, ZeroU, 22.0kW(32A) 17.3kW(24A), 230V, (30) C13 & (12) C19",null,{"$f":"VLOOKUP($E9,TS4L4_ALL,13,FALSE)","v":{"$error":"#NAME?"}},null,null,null,null,{"$f":"VLOOKUP($E9,TS4L4_ALL,10,FALSE)*H9","v":{"$error":"#NAME?"}},{"$f":"VLOOKUP($E9,TS4L4_ALL,11,FALSE)*H9","v":{"$error":"#NAME?"}},{"$f":"VLOOKUP($E9,TS4L4_ALL,12,FALSE)","v":{"$error":"#NAME?"}}]
[null,null,null,null,null,null,null,{"$f":"SUM(L13:L25)","v":0}]
[]
[null,null,null,null,"OpzRack"]
[null,null,null,null,{"$f":"Tabella_prezzi!H38","v":"Dispositivo UPS di tipo On-line doppia conversione, strutturato per il montaggio a rack da 19”"},null,{"$f":"VLOOKUP($E13,TS4L7_UPS,13,FALSE)","v":"TS4L7-UPS"},0,null,{"$f":"L13","v":0},null,{"$f":"VLOOKUP($E13,TS4L7_UPS,10,FALSE)*H13","v":0},{"$f":"VLOOKUP($E13,TS4L7_UPS,11,FALSE)","v":0},{"$f":"VLOOKUP($E13,TS4L7_UPS,12,FALSE)","v":"L7N20"}]
[]
[]
{"$rows_left_out":11}
{"sheet":"Riepilogo_Ordine","index":4,"n_rows":62,"n_cols":24,"rows_kept":62,"cut":false,"hidden":false,"merged":[[60,5,60,6],[60,7,60,8],[1,5,1,6],[1,7,1,8],[5,5,5,6],[6,5,6,6],[7,5,7,9],[47,5,47,9],[57,5,57,6],[57,7,57,8],[58,7,58,8],[59,5,59,6],[59,7,59,8]]}
[]
[null,null,null,null,null,"Convenzione \nTecnologie Server 4 - Lotto 7",null,"Salva in PDF -->",null,null,null,null,null,null,null,null,null,null,null,null,null,null,null,"SI"]
[null,null,null,null,null,null,null,null,null,null,null,null,null,null,null,null,null,null,null,null,null,null,null,"SI"]
[null,null,null,null,null,null,null,null,null,null,null,null,null,null,null,null,null,null,null,null,null,null,null,"SI"]
[null,null,null,null,null,null,{"$f":"IF($L$23=\"TS4L7-VSAN\",\"vSAN Server Ready\",IF($L$23=\"TS4L7-GPUDW\",\"GPU Double-Wide Server Ready\",IF($L$23=\"TS4L7-GPUSW\",\"GPU Single-Wide Server Ready\",IF(M20=\"VxFlex\",\"PowerFlex Server\",\"\"))))","v":""},null,null,null,null,null,null,null,null,null,null,null,null,null,null,null,null,"SI"]
[null,null,null,null,null,"Riepilogo Ordine",null,null,null,null,null,null,null,null,null,null,null,null,null,null,null,null,null,"SI"]
[null,null,null,null,null,null,null,null,null,null,null,null,null,null,null,null,null,null,null,null,null,null,null,"SI"]
[null,null,null,null,null,"Articoli in convenzione",null,null,null,null,null,null,null,null,null,null,"Config 1","Config 2","Config 3","Totale",null,null,null,"SI"]
[null,null,null,null,null,"Codice Produttore","Codice Convenzione","Qtà","Costo unitario","Costo Totale",null,null,null,null,"N°","Codice Convenzione",{"$f":"Lotto7_R7525_1!K6","v":0},{"$f":"Lotto7_R7525_2!K6","v":0},{"$f":"Lotto7_R7525_3!K6","v":0},null,null,null,null,"SI"]
[null,null,null,null,null,{"$f":"IF(H10=\"\",\"\",VLOOKUP(O10,TABELLA_PREZZI,10,FALSE))","v":""},{"$f":"IF(H10=\"\",\"\",VLOOKUP(O10,TABELLA_PREZZI,6,FALSE))","v":""},{"$f":"IF(T10>0,T10,\"\")","v":""},{"$f":"IF(H10=\"\",\"\",VLOOKUP(O10,TABELLA_PREZZI,4,FALSE))","v":""},{"$f":"IF(F10=\"\",\"\",I10*H10)","v":""},null,null,null,null,"L7N01",{"$f":"VLOOKUP(O10,TABELLA_PREZZI,6,FALSE)","v":"TS4L7-SRV"},{"$f":"COUNTIF(TS4L7_1,O10)*$Q$9","v":0},{"$f":"COUNTIF(TS4L7_2,O10)*$R$9","v":0},{"$f":"COUNTIF(TS4L7_3,O10)*$S$9","v":0},{"$f":"SUM(Q10:S10)","v":0},null,null,null,{"$f":"IF(H10<>\"\",\"SI\",\"NO\")","v":"NO"}]
[null,null,null,null,null,"","",{"$f":"IF(T11>0,T11,\"\")","v":""},"",{"$f":"IF(F11=\"\",\"\",I11*H11)","v":""},null,null,null,null,"L7N02","TS4L7-CPU",{"$f":"COUNTIF(TS4L7_1,O11)*$Q$9","v":0},{"$f":"COUNTIF(TS4L7_2,O11)*$R$9","v":0},{"$f":"COUNTIF(TS4L7_3,O11)*$S$9","v":0},0,null,null,null,{"$f":"IF(H11<>\"\",\"SI\",\"NO\")","v":"NO"}]
[null,null,null,null,null,"","","","","",null,null,null,null,"L7N03","TS4L7-RAM32",{"$f":"COUNTIF(TS4L7_1,O12)*Lotto7_R7525_1!K35*$Q$9","v":0},{"$f":"COUNTIF(TS4L7_2,O12)*Lotto7_R7525_2!K35*R9","v":0},{"$f":"COUNTIF(TS4L7_3,O12)*Lotto7_R7525_3!K35*S9","v":0},0,null,null,null,{"$f":"IF(H12<>\"\",\"SI\",\"NO\")","v":"NO"}]
[null,null,null,null,null,"","","","","",null,null,null,null,"L7N04","TS4L7-RAM64",{"$f":"COUNTIF(TS4L7_1,O13)*Lotto7_R7525_1!K35*$Q$9","v":0},{"$f":"COUNTIF(TS4L7_2,O13)*Lotto7_R7525_2!K35*$R$9","v":0},{"$f":"COUNTIF(TS4L7_3,O13)*Lotto7_R7525_3!K35*$S$9","v":0},0,null,null,null,"NO"]
[null,null,null,null,null,"","","","","",null,null,null,null,"L7N05","TS4L7-LAN1",{"$f":"COUNTIF(TS4L7_1,O14)*$Q$9","v":0},{"$f":"COUNTIF(TS4L7_2,O14)*$R$9","v":0},{"$f":"COUNTIF(TS4L7_3,O14)*$S$9","v":0},0,null,null,null,"NO"]
[null,null,null,null,null,"","","","","",null,null,null,null,"L7N75","TS4L7-LAN1-OCP",{"$f":"COUNTIF(TS4L7_1,O15)*$Q$9","v":0},{"$f":"COUNTIF(TS4L7_2,O15)*$R$9","v":0},{"$f":"COUNTIF(TS4L7_3,O15)*$S$9","v":0},0,null,null,null,"NO"]
{"$rows_left_out":48}
{"sheet":"ConfigurationTS3L4","index":5,"n_rows":597,"n_cols":30,"rows_kept":597,"cut":false,"hidden":true,"merged":[]}
[]
[null,"Module Name","Option ID","Option Name","Option List Price","SKUs","Qty","SKU Customer Kit","Attributo","Valore inserito",null,"N°","Codice Convenzione"]
["PowerEdge R7525 Server (General Purpose)","Chassis with Up to 16 x 2.5 Hard Drives for 1CPU Configuration",null,{"$f":"VLOOKUP(L3,Tabella_prezzi!$A$1:$L$189,8,FALSE)","v":0},null,null,null,{"$f":"VLOOKUP(L3,Tabella_prezzi!$A$1:$L$189,9,FALSE)","v":"PowerEdge R7525 Server"},{"$f":"VLOOKUP(L3,Tabella_prezzi!$A$1:$L$189,3,FALSE)","v":"Server rackable bi-processore prest."},{"$f":"VLOOKUP(L3,Tabella_prezzi!$A$1:$L$189,4,FALSE)","v":4047.7},null,"L7N01",{"$f":"VLOOKUP(L3,Tabella_prezzi!$A$1:$L$189,6,FALSE)","v":"TS4L7-SRV"}]
["PowerEdge R7525 Server (GPU Double-Wide Ready)","Chassis with Up to 16 x 2.5 Hard Drives for 2CPU, GPU Double-Wide Configuration",null,{"$f":"VLOOKUP(L4,Tabella_prezzi!$A$1:$L$189,8,FALSE)","v":0},null,null,null,{"$f":"VLOOKUP(L4,Tabella_prezzi!$A$1:$L$189,9,FALSE)","v":"PowerEdge R7525 Server"},{"$f":"VLOOKUP(L4,Tabella_prezzi!$A$1:$L$189,3,FALSE)","v":"Server rackable bi-processore prest."},{"$f":"VLOOKUP(L4,Tabella_prezzi!$A$1:$L$189,4,FALSE)","v":4047.7},null,"L7N01",{"$f":"VLOOKUP(L4,Tabella_prezzi!$A$1:$L$189,6,FALSE)","v":"TS4L7-SRV"}]
["PowerEdge R7525 Server (GPU Single-Wide Ready)","Chassis with Up to 16 x 2.5 Hard Drives for 2CPU, GPU Single-Wide Configuration",null,{"$f":"VLOOKUP(L5,Tabella_prezzi!$A$1:$L$189,8,FALSE)","v":0},null,null,null,{"$f":"VLOOKUP(L5,Tabella_prezzi!$A$1:$L$189,9,FALSE)","v":"PowerEdge R7525 Server"},{"$f":"VLOOKUP(L5,Tabella_prezzi!$A$1:$L$189,3,FALSE)","v":"Server rackable bi-processore prest."},{"$f":"VLOOKUP(L5,Tabella_prezzi!$A$1:$L$189,4,FALSE)","v":4047.7},null,"L7N01",{"$f":"VLOOKUP(L5,Tabella_prezzi!$A$1:$L$189,6,FALSE)","v":"TS4L7-SRV"}]
["PowerEdge R7525 Server (GPU Double-Wide Ready)","Chassis with Up to 16 x 2.5 Hard Drives for 2CPU, GPU Double-Wide Configuration",null,{"$f":"VLOOKUP(L6,Tabella_prezzi!$A$1:$L$189,8,FALSE)","v":0},null,null,null,{"$f":"VLOOKUP(L6,Tabella_prezzi!$A$1:$L$189,9,FALSE)","v":"PowerEdge R7525 Server"},{"$f":"VLOOKUP(L6,Tabella_prezzi!$A$1:$L$189,3,FALSE)","v":"Server rackable bi-processore prest."},{"$f":"VLOOKUP(L6,Tabella_prezzi!$A$1:$L$189,4,FALSE)","v":4047.7},null,"L7N01",{"$f":"VLOOKUP(L6,Tabella_prezzi!$A$1:$L$189,6,FALSE)","v":"TS4L7-SRV"}]
[]
["TS3L7_Chassis"]
["PowerEdge R7525 Server (General Purpose)","Chassis with Up to 16 x 2.5 Hard Drives for 1CPU Configuration","Chassis with Up to 16 x 2.5'' Hard Drives for 2CPU Configuration",null,null,0,1,{"$f":"VLOOKUP(L9,Tabella_prezzi!$A$1:$L$189,9,FALSE)","v":"Kit upgrade chassies for 2 CPU"},"TS4-Opz1CPU",null,{"$f":"VLOOKUP(L9,Tabella_prezzi!$A$1:$L$189,4,FALSE)","v":0},"L7N105",{"$f":"\"\"","v":""}]
["PowerEdge R7525 Server (nVME)","Chassis with Up to 16X 2.5 SAS/SATA + 8X 2.5 NVME for 2CPU Configuration","Chassis with Up to 16X 2.5 SAS/SATA + 8X 2.5 NVME for 2CPU Configuration","Kit upgrade chassies for Server nVME",null,null,1,{"$f":"VLOOKUP(L10,Tabella_prezzi!$A$1:$L$189,9,FALSE)","v":"Kit upgrade chassies for Server nVME"},{"$f":"VLOOKUP(L10,Tabella_prezzi!$A$1:$L$189,9,FALSE)","v":"Kit upgrade chassies for Server nVME"},null,{"$f":"VLOOKUP(L10,Tabella_prezzi!$A$1:$L$189,4,FALSE)","v":0},"L7N97",{"$f":"VLOOKUP(L10,Tabella_prezzi!$A$1:$L$189,6,FALSE)","v":"TS4L7-NVME"}]
["PowerEdge R7525 Server (vSAN Ready)","Chassis with Up to 16X 2.5 SAS/SATA + 8X 2.5 NVME for 2CPU Configuration","Chassis with Up to 16X 2.5 SAS/SATA + 8X 2.5 NVME for 2CPU Configuration",{"$f":"VLOOKUP(L11,Tabella_prezzi!$A$1:$L$189,8,FALSE)","v":"Kit upgrade chassies for Server vSAN Ready"},null,null,1,{"$f":"VLOOKUP(L11,Tabella_prezzi!$A$1:$L$189,9,FALSE)","v":"Kit upgrade chassies for Server vSAN Ready"},{"$f":"VLOOKUP(L11,Tabella_prezzi!$A$1:$L$189,9,FALSE)","v":"Kit upgrade chassies for Server vSAN Ready"},null,{"$f":"VLOOKUP(L11,Tabella_prezzi!$A$1:$L$189,4,FALSE)","v":0},"L7N38",{"$f":"VLOOKUP(L11,Tabella_prezzi!$A$1:$L$189,6,FALSE)","v":"TS4L7-VSAN"}]
["PowerEdge R7525 Server (GPU Single-Wide Ready)","Chassis with Up to 16 x 2.5 Hard Drives for 2CPU, GPU Single-Wide Configuration","Chassis with Up to 16 x 2.5 Hard Drives for 2CPU, GPU Single-Wide Configuration",{"$f":"VLOOKUP(L12,Tabella_prezzi!$A$1:$L$189,8,FALSE)","v":"Kit upgrade chassies for Server GPU Single-Wide Ready"},null,null,1,{"$f":"VLOOKUP(L12,Tabella_prezzi!$A$1:$L$189,9,FALSE)","v":"Kit upgrade chassies for Server GPU Single-Wide Ready"},{"$f":"VLOOKUP(L12,Tabella_prezzi!$A$1:$L$189,9,FALSE)","v":"Kit upgrade chassies for Server GPU Single-Wide Ready"},null,{"$f":"VLOOKUP(L12,Tabella_prezzi!$A$1:$L$189,4,FALSE)","v":299},"L7N36",{"$f":"VLOOKUP(L12,Tabella_prezzi!$A$1:$L$189,6,FALSE)","v":"TS4L7-GPUSW"}]
["PowerEdge R7525 Server (GPU Double-Wide Ready)","Chassis with Up to 16 x 2.5 Hard Drives for 2CPU, GPU Double-Wide Configuration","Chassis with Up to 16 x 2.5 Hard Drives for 2CPU, GPU Double-Wide Configuration",{"$f":"VLOOKUP(L13,Tabella_prezzi!$A$1:$L$189,8,FALSE)","v":"Kit upgrade chassies for Server GPU Double-Wide Ready"},null,null,1,{"$f":"VLOOKUP(L13,Tabella_prezzi!$A$1:$L$189,9,FALSE)","v":"Kit upgrade chassies for Server GPU Double-Wide Ready"},{"$f":"VLOOKUP(L13,Tabella_prezzi!$A$1:$L$189,9,FALSE)","v":"Kit upgrade chassies for Server GPU Double-Wide Ready"},null,{"$f":"VLOOKUP(L13,Tabella_prezzi!$A$1:$L$189,4,FALSE)","v":0},"L7N37",{"$f":"VLOOKUP(L13,Tabella_prezzi!$A$1:$L$189,6,FALSE)","v":"TS4L7-GPUDW"}]
[]
["TS3L7_CPU"]
{"$rows_left_out":583}
{"sheet":"Tabella_prezzi","index":6,"n_rows":157,"n_cols":17,"rows_kept":157,"cut":false,"hidden":true,"merged":[[1,9,7,9],[37,8,38,8],[37,6,38,6],[14,4,15,4],[1,2,7,2],[16,5,17,5],[18,5,19,5],[12,4,13,4],[14,5,15,5],[16,4,17,4],[20,3,21,3],[20,4,21,4],[20,5,21,5],[18,4,19,4],[12,5,13,5],[26,2,27,2],[1,0,7,0],[1,1,7,1],[1,3,7,3],[1,4,7,4],[1,5,7,5],[37,10,38,10],[22,0,23,0],[22,1,23,1],[22,2,23,2],[22,3,23,3],[22,4,23,4],[22,5,23,5],[26,3,27,3],[26,4,27,4],[37,4,38,4],[37,0,38,0],[22,9,23,9],[26,5,27,5],[26,9,27,9],[26,0,27,0],[26,1,27,1],[12,3,13,3],[18,2,19,2],[18,3,19,3],[16,0,17,0],[16,1,17,1],[14,0,15,0],[14,1,15,1],[14,2,15,2],[14,3,15,3],[16,2,17,2],[16,3,17,3],[12,9,13,9],[14,9,15,9],[16,9,17,9],[18,9,19,9],[20,9,21,9],[20,0,21,0],[20,1,21,1],[12,0,13,0],[12,1,13,1],[12,2,13,2],[18,0,19,0],[18,1,19,1],[20,2,21,2],[52,0,53,0],[54,0,55,0],[52,2,53,2],[52,3,53,3],[52,9,53,9],[54,9,55,9],[52,4,53,4],[54,4,55,4],[52,1,53,1],[54,1,55,1],[52,5,53,5],[54,5,55,5],[54,2,55,2],[93,5,96,5],[93,9,96,9],[93,0,96,0],[93,1,96,1],[93,2,96,2],[93,3,96,3],[93,4,96,4],[37,9,38,9],[37,5,38,5],[37,2,38,2],[37,3,38,3],[54,3,55,3]]}
["L7N01",1,"Server rackable bi-processore prest.",4047.7,"L7N01","TS4L7-SRV",1,null,"PowerEdge R7525 Server","L7N01-ServerR7525","210-AMTE","DELL",null,null,null,"210-321-BCPX","-"]
["L7N02",2,"Kit n. 1 Processore aggiuntivo",680.84,"L7N02","TS4L7-CPU",1,"AMD EPYC 7313 3.0GHz, 16C/32T, 128M Cache (155W) DDR4-3200","AMD EPYC 7313 3.0GHz, 16C/32T, 128M Cache (155W) DDR4-3200","L7N02-OpzCPU","338-BZSB","DELL",null,null,null,"338-BZSB","WX6G7"]
[null,null,null,null,null,null,1,"L Shape Heatsink for 2nd CPU equal to or greater than 180W,PowerEdge R6525/R7525, Customer Install","L Shape Heatsink for 2nd CPU equal to or greater than 180W,PowerEdge R6525/R7525, Customer Install",null,"412-AASW","DELL",null,null,null,"412-AASW","4RCGC"]
[null,null,null,null,null,null,1,"PowerEdge R7525 High Performance Fan Customer Kit V3","PowerEdge R7525 High Performance Fan Customer Kit V3",null,"121-BBBI","DELL",null,null,null,"121-BBBI","HVVRP"]
[null,null,null,null,null,null,1,"Riser with Two x8(x16 connector) PCIe Gen4 (Slots 4 & 5), Customer Install","Riser with Two x8(x16 connector) PCIe Gen4 (Slots 4 & 5), Customer Install",null,"330-BBTM","DELL",null,null,null,"330-BBTM","234T7"]
[null,null,null,null,null,null,1,"Riser 4B, PCIe Gen4 1x16 (x16 connector), Half Length, PowerEdge R7525, CK","Riser 4B, PCIe Gen4 1x16 (x16 connector), Half Length, PowerEdge R7525, CK",null,"330-BBPR","DELL",null,null,null,"330-BBPR"]
[null,null,null,null,null,null,1,"Riser 1B, PCIe Gen4 2x8 (x16 connector), Half Length, PowerEdge R7525, CK","Riser 1B, PCIe Gen4 2x8 (x16 connector), Half Length, PowerEdge R7525, CK",null,"330-BBPV","DELL",null,null,null,"330-BBPV","R80PP"]
[null,null,null,null,null,null,1,"Riser 2A, PCIe Gen4 2x16 (x16 connector), PowerEdge R7525, CK","Riser 2A, PCIe Gen4 2x16 (x16 connector), PowerEdge R7525, CK",null,"330-BBPO","DELL",null,null,null,"330-BBPO"]
["L7N03",3,"OpzRAM32GB",263.87,"L7N03","TS4L7-RAM32",1,"32GB - 2Rx4 DDR4 RDIMM 3200MHz","32GB - 2Rx4 DDR4 RDIMM 3200MHz","L7N03-OpzRAM32GB","AA799087","DELL",null,null,null,"AA79SNP75X1VC/32G","SNP75X1VC/32G"]
["L7N04",4,"OpzRAM64GB",302.60000000000002,"L7N04","TS4L7-RAM64",1,"64GB - 2RX4 DDR4 RDIMM 3200MHz","64GB - 2RX4 DDR4 RDIMM 3200MHz","L7N04-OpzRAM64GB","AA799110","DELL",null,null,null,"AA79SNPP2MYXC/64G","SNPP2MYXC/64G"]
["L7N05",5,"OpzGigabit",29.18,"L7N05","TS4L7-LAN1",1,"Broadcom 5719 Quad Port 1Gb Network Interface Card, Low Profile ","Broadcom 5719 Quad Port 1Gb Network Interface Card, Low Profile ","L7N75-OpzGigabitLP","540-BBDF","DELL",1,2,3,"540-XF9VF","XF9VF"]
["L7N75",5,"OpzGigabit",29.18,"L7N05b","TS4L7-LAN1-OCP",1,"Broadcom 5719 Quad Port 1GbE BASE-T Adapter, OCP NIC 3.0","Broadcom 5719 Quad Port 1GbE BASE-T Adapter, OCP NIC 3.0","L7N75-OpzGigabitOCP","540-BCOB","DELL",4,null,null,"540-W0N4T","W0N4T"]
["L7N06",6,"OpzGigabit10Gbps",160.47999999999999,"L7N06","TS4L7-LAN10",1,"Broadcom 57412 Dual Port 10Gb, SFP+, PCIe Adapter, Low Profile + Optics","Broadcom 57412 Dual Port 10Gb, SFP+, PCIe Adapter, Low Profile + Optics","L7N06-OpzGigabit10Gbps","540-BBUP","DELL",1,2,3,"540-H6N50","H6N50"]
[null,null,null,null,null,null,2,"SFP+ SR Optic for all SFP+","Dell Networking, Transceiver, SFP+, 10GbE, SR, 850nm Wavelength, 300m Reach - Kit",null,"407-BCBE","DELL",null,null,null,"407-4Y8DN","4Y8DN"]
["L7N76",6,"OpzGigabit10Gbps",160.47999999999999,"L7N76","TS4L7-LAN10-OCP",1,"\tBroadcom 57412 Dual Port 10GbE SFP+, OCP NIC 3.0","\tBroadcom 57412 Dual Port 10GbE SFP+, OCP NIC 3.0","L7N76-OpzGigabit10GbpsLP","540-BCNT","DELL",4,null,null,"540-N7R67","N7R67"]
{"$rows_left_out":142}