{"text_format":"1","workbook":"xlsx","n_sheets":9,"sheets":["Benvenuto","Lotto6_R940_1","Lotto6_R940_2","Lotto6_R940_3","Altre_Opzioni","Riepilogo_Ordine","Config","ConfTS4L6","Tabella_prezzi"],"not_rendered":{"charts":0,"images":8,"macros":1,"external_links":0,"defined_names":38,"comments":0,"pivot_tables":0},"unopened":[],"bounds":{"document_bytes":16777216,"sheet_cells":100000,"rows_first":2000,"rows_last":500,"rows_between":2000,"halvings":0,"cell_chars":16384,"cell_head_chars":4096},"cells_cut":0,"cells_raw":0,"read":"whole","date_system":"1900"}

{"sheet":"Benvenuto","index":0,"n_rows":8,"n_cols":17,"rows_kept":8,"cut":false,"hidden":false,"merged":[[2,4,42,13],[2,15,2,16],[4,15,4,16],[6,15,6,16]]}
[]
[]
[null,null,null,null,null,null,null,null,null,null,null,null,null,null,null,"LEGENDA"]
[null,null,null,null,null,null,null,null,null,null,null,null,null,null,null,"Campi Non Editabili","Campi Editabili"]
[]
[null,null,null,null,null,null,null,null,null,null,null,null,null,null,null,"Opzioni 20%","Qtà 20%"]
[]
[null,null,null,null,null,null,null,null,null,null,null,null,null,null,null,"Errore nella Selezione","Verifica Positiva"]

{"sheet":"Lotto6_R940_1","index":1,"n_rows":142,"n_cols":25,"rows_kept":142,"cut":false,"hidden":false,"merged":[[103,7,107,7],[24,13,25,13],[39,11,39,13],[76,13,78,14],[130,9,131,9],[42,8,43,8],[133,9,134,9],[77,9,78,9],[74,9,75,9],[142,8,153,11],[58,10,58,11],[60,10,60,11],[82,10,82,11],[3,8,5,8],[1,8,2,8],[141,8,141,11],[5,10,6,10],[94,10,94,11],[85,10,85,11],[91,10,91,11],[100,10,100,11],[103,10,103,11],[112,10,112,11],[115,10,115,11],[11,9,12,9],[14,9,15,9],[17,9,18,9],[39,9,40,9],[3,10,4,10]]}
[]
[null,null,null,null,null,null,null,null,"Convenzione Tecnologie Server 4 - Lotto 6",null,{"$f":"IF(U105>1,\"ERRORE NELLA CONFIGURAZIONE\",\"\")","v":""},null,null,{"$f":"IF(N6<0,\"Superata Quota 20%\",\"\")","v":""}]
[null,null,null,null,null,null,null,null,null,null,null,null,null,"Articoli 20% Totali",null,null,null,null,"Check CPU","Check RAM","Check NVME","Check PCI","Check Win","Check Tot"]
[null,null,null,null,null,null,null,null,{"$f":"IF(W13=\"vsan\",\"Selezionando la soluzione vSAN si accetta la sostituzione del controller 745 con il HBA355, comprensivo di BOSS Card Certificati per vSAN\",IF(W13=\"v2tb\",\"Selezionando la soluzione vSAN si accetta la sostituzione del controller 745 con il HBA355, comprensivo di BOSS Card Certificati per vSAN\",\"\"))","v":""},null,{"$f":"IF(X4>1,\"Errori nella Configurazione\",IF(S4>0,\"Errore nella Selezione della CPU\",IF(T4>0,\"Errore Nella Selezione della RAM\",IF(U4>0,\"Errore Nella selezione dello Chassis per Dischi nVME\",IF(V4>0,\"Errore nella Selezione Slot PCI\",IF(W4>0,\"Errore nella Selezione Licenze Windows\",\"\"))))))","v":""},"Totale Altre Opzioni",null,{"$f":"Riepilogo_Ordine!K140","v":0},null,null,null,null,{"$f":"IF(L19<>\"\",1,0)","v":0},{"$f":"IF(L24<>\"\",1,0)","v":0},{"$f":"IF(I14<>\"\",1,0)","v":0},{"$f":"IF(K83<>\"\",1,0)","v":0},{"$f":"IF(L27<>\"\",1,0)","v":0},{"$f":"SUM(S4:W4)","v":0}]
[null,null,null,null,null,null,null,null,null,null,null,{"$f":"Altre_Opzioni!H3","v":0},null,"Quota residua 20 %"]
[null,null,null,null,null,null,null,null,null,null,"Guida alla Convenzione","Totale Configurazione",null,{"$f":"Riepilogo_Ordine!G141","v":0}]
[null,null,null,null,null,null,null,null,{"$f":"IF(Riepilogo_Ordine!Q3>0,\"Compilare i Dati Necessari all'Ordine per Stampare in PDF o Controllare le Configurazioni\",\"Dati Completi\")","v":"Compilare i Dati Necessari all'Ordine per Stampare in PDF o Controllare le Configurazioni"},null,null,{"$f":"$L$140","v":0},null,"Totale Ordine Iva Esclusa",null,null,null,null,{"$f":"IF(AND($W$13=\"vsan64GB\",L22=0),ConfTS4L6!$A$47:$A$48,IF(AND($W$13=\"vsan64GB\",$L$22=1),ConfTS4L6!$A$51:$A$52,\"\"))","v":""}]
[null,null,null,null,null,null,null,null,"DELL POWEREDGE R940",null,"Quantità Server",0,null,{"$f":"Riepilogo_Ordine!K141","v":0}]
[]
[]
{"$rows_left_out":133}
{"sheet":"Lotto6_R940_2","index":2,"n_rows":142,"n_cols":25,"rows_kept":142,"cut":false,"hidden":false,"merged":[[142,8,153,11],[103,10,103,11],[112,10,112,11],[115,10,115,11],[100,10,100,11],[103,7,107,7],[130,9,131,9],[133,9,134,9],[141,8,141,11],[76,13,78,14],[77,9,78,9],[82,10,82,11],[94,10,94,11],[17,9,18,9],[24,13,25,13],[39,9,40,9],[39,11,39,13],[60,10,60,11],[74,9,75,9],[85,10,85,11],[91,10,91,11],[42,8,43,8],[58,10,58,11],[14,9,15,9],[1,8,2,8],[3,8,5,8],[3,10,4,10],[5,10,6,10],[11,9,12,9]]}
[]
[null,null,null,null,null,null,null,null,"Convenzione Tecnologie Server 4 - Lotto 6",null,{"$f":"IF(U105>1,\"ERRORE NELLA CONFIGURAZIONE\",\"\")","v":""},null,null,{"$f":"IF(N6<0,\"Superata Quota 20%\",\"\")","v":""}]
[null,null,null,null,null,null,null,null,null,null,null,null,null,"Articoli 20% Totali",null,null,null,null,"Check CPU","Check RAM","Check NVME","Check PCI","Check Win","Check Tot"]
[null,null,null,null,null,null,null,null,{"$f":"IF(W13=\"vsan\",\"Selezionando la soluzione vSAN si accetta la sostituzione del controller 745 con il HBA355, comprensivo di BOSS Card Certificati per vSAN\",IF(W13=\"v2tb\",\"Selezionando la soluzione vSAN si accetta la sostituzione del controller 745 con il HBA355, comprensivo di BOSS Card Certificati per vSAN\",\"\"))","v":""},null,{"$f":"IF(X4>1,\"Errori nella Configurazione\",IF(S4>0,\"Errore nella Selezione della CPU\",IF(T4>0,\"Errore Nella Selezione della RAM\",IF(U4>0,\"Errore Nella selezione dello Chassis per Dischi nVME\",IF(V4>0,\"Errore nella Selezione Slot PCI\",IF(W4>0,\"Errore nella Selezione Licenze Windows\",\"\"))))))","v":""},"Totale Altre Opzioni",null,{"$f":"Riepilogo_Ordine!K140","v":0},null,null,null,null,{"$f":"IF(L19<>\"\",1,0)","v":0},{"$f":"IF(L24<>\"\",1,0)","v":0},{"$f":"IF(I14<>\"\",1,0)","v":0},{"$f":"IF(K83<>\"\",1,0)","v":0},{"$f":"IF(L27<>\"\",1,0)","v":0},{"$f":"SUM(S4:W4)","v":0}]
[null,null,null,null,null,null,null,null,null,null,null,{"$f":"Altre_Opzioni!H3","v":0},null,"Quota residua 20 %"]
[null,null,null,null,null,null,null,null,null,null,"Guida alla Convenzione","Totale Configurazione",null,{"$f":"Riepilogo_Ordine!G141","v":0}]
[null,null,null,null,null,null,null,null,{"$f":"IF(Riepilogo_Ordine!Q3>0,\"Compilare i Dati Necessari all'Ordine per Stampare in PDF o Controllare le Configurazioni\",\"Dati Completi\")","v":"Compilare i Dati Necessari all'Ordine per Stampare in PDF o Controllare le Configurazioni"},null,null,{"$f":"$L$140","v":0},null,"Totale Ordine Iva Esclusa",null,null,null,null,{"$f":"IF(AND($W$13=\"vsan64GB\",L22=0),ConfTS4L6!$A$47:$A$48,IF(AND($W$13=\"vsan64GB\",$L$22=1),ConfTS4L6!$A$51:$A$52,\"\"))","v":""}]
[null,null,null,null,null,null,null,null,"DELL POWEREDGE R940",null,"Quantità Server",0,null,{"$f":"Riepilogo_Ordine!K141","v":0}]
[]
[]
{"$rows_left_out":133}
{"sheet":"Lotto6_R940_3","index":3,"n_rows":142,"n_cols":25,"rows_kept":142,"cut":false,"hidden":false,"merged":[[142,8,153,11],[103,10,103,11],[112,10,112,11],[115,10,115,11],[100,10,100,11],[103,7,107,7],[130,9,131,9],[133,9,134,9],[141,8,141,11],[76,13,78,14],[77,9,78,9],[82,10,82,11],[94,10,94,11],[17,9,18,9],[24,13,25,13],[39,9,40,9],[39,11,39,13],[60,10,60,11],[74,9,75,9],[85,10,85,11],[91,10,91,11],[42,8,43,8],[58,10,58,11],[14,9,15,9],[1,8,2,8],[3,8,5,8],[3,10,4,10],[5,10,6,10],[11,9,12,9]]}
[]
[null,null,null,null,null,null,null,null,"Convenzione Tecnologie Server 4 - Lotto 6",null,{"$f":"IF(U105>1,\"ERRORE NELLA CONFIGURAZIONE\",\"\")","v":""},null,null,{"$f":"IF(N6<0,\"Superata Quota 20%\",\"\")","v":""}]
[null,null,null,null,null,null,null,null,null,null,null,null,null,"Articoli 20% Totali",null,null,null,null,"Check CPU","Check RAM","Check NVME","Check PCI","Check Win","Check Tot"]
[null,null,null,null,null,null,null,null,{"$f":"IF(W13=\"vsan\",\"Selezionando la soluzione vSAN si accetta la sostituzione del controller 745 con il HBA355, comprensivo di BOSS Card Certificati per vSAN\",IF(W13=\"v2tb\",\"Selezionando la soluzione vSAN si accetta la sostituzione del controller 745 con il HBA355, comprensivo di BOSS Card Certificati per vSAN\",\"\"))","v":""},null,{"$f":"IF(X4>1,\"Errori nella Configurazione\",IF(S4>0,\"Errore nella Selezione della CPU\",IF(T4>0,\"Errore Nella Selezione della RAM\",IF(U4>0,\"Errore Nella selezione dello Chassis per Dischi nVME\",IF(V4>0,\"Errore nella Selezione Slot PCI\",IF(W4>0,\"Errore nella Selezione Licenze Windows\",\"\"))))))","v":""},"Totale Altre Opzioni",null,{"$f":"Riepilogo_Ordine!K140","v":0},null,null,null,null,{"$f":"IF(L19<>\"\",1,0)","v":0},{"$f":"IF(L24<>\"\",1,0)","v":0},{"$f":"IF(I14<>\"\",1,0)","v":0},{"$f":"IF(K83<>\"\",1,0)","v":0},{"$f":"IF(L27<>\"\",1,0)","v":0},{"$f":"SUM(S4:W4)","v":0}]
[null,null,null,null,null,null,null,null,null,null,null,{"$f":"Altre_Opzioni!H3","v":0},null,"Quota residua 20 %"]
[null,null,null,null,null,null,null,null,null,null,"Guida alla Convenzione","Totale Configurazione",null,{"$f":"Riepilogo_Ordine!G141","v":0}]
[null,null,null,null,null,null,null,null,{"$f":"IF(Riepilogo_Ordine!Q3>0,\"Compilare i Dati Necessari all'Ordine per Stampare in PDF o Controllare le Configurazioni\",\"Dati Completi\")","v":"Compilare i Dati Necessari all'Ordine per Stampare in PDF o Controllare le Configurazioni"},null,null,{"$f":"$L$140","v":0},null,"Totale Ordine Iva Esclusa",null,null,null,null,{"$f":"IF(AND($W$13=\"vsan64GB\",L22=0),ConfTS4L6!$A$47:$A$48,IF(AND($W$13=\"vsan64GB\",$L$22=1),ConfTS4L6!$A$51:$A$52,\"\"))","v":""}]
[null,null,null,null,null,null,null,null,"DELL POWEREDGE R940",null,"Quantità Server",0,null,{"$f":"Riepilogo_Ordine!K141","v":0}]
[]
[]
{"$rows_left_out":133}
{"sheet":"Altre_Opzioni","index":4,"n_rows":45,"n_cols":14,"rows_kept":45,"cut":false,"hidden":false,"merged":[[43,5,44,5],[29,5,30,5],[20,5,21,5],[23,5,24,5],[26,5,27,5],[34,5,35,5],[37,5,38,5],[40,5,41,5],[17,5,18,5],[1,7,1,9],[5,5,6,5],[8,5,9,5],[11,5,12,5],[14,5,15,5]]}
[]
[null,null,null,null,"Opzioni",null,null,"Totale altre opzioni"]
[null,null,null,null,null,null,null,{"$f":"SUM(J6:J45)","v":0}]
[]
[]
[null,null,null,null,"OpzRack DELL"]
[null,null,null,null,{"$f":"ConfTS4L6!A177","v":"Rack 42RU DellEmc"},null,{"$f":"VLOOKUP($E7,TS4L6_20X100,13,FALSE)","v":"TS4L6-RACK-D"},0,null,{"$f":"L7+M7","v":0},null,{"$f":"VLOOKUP($E7,TS4L6_20X100,10,FALSE)*H7","v":0},{"$f":"VLOOKUP($E7,TS4L6_20X100,11,FALSE)*H7","v":0},{"$f":"VLOOKUP($E7,TS4L6_20X100,12,FALSE)","v":"L6N112"}]
[]
[null,null,null,null,"OpzPDU Mono"]
[null,null,null,null,{"$f":"ConfTS4L6!A178","v":"PDU 220 mono output 20-C13 + 4-C19 IEC 320, input C20"},null,{"$f":"VLOOKUP($E10,TS4L6_20X100,13,FALSE)","v":"TS4L6-PDU-M"},0,null,{"$f":"L10+M10","v":0},null,{"$f":"VLOOKUP($E10,TS4L6_20X100,10,FALSE)*H10","v":0},{"$f":"VLOOKUP($E10,TS4L6_20X100,11,FALSE)*H10","v":0},{"$f":"VLOOKUP($E10,TS4L6_20X100,12,FALSE)","v":"L6N113"}]
{"$rows_left_out":36}
{"sheet":"Riepilogo_Ordine","index":5,"n_rows":143,"n_cols":25,"rows_kept":143,"cut":false,"hidden":false,"merged":[[141,5,141,6],[141,8,141,9],[87,5,87,10],[88,5,88,10],[138,5,138,6],[138,8,138,9],[139,8,139,9],[140,8,140,9],[11,5,11,10],[6,5,6,6],[6,7,6,9],[7,5,7,6],[7,7,7,9],[8,5,8,6],[8,7,8,9],[9,5,9,6],[9,7,9,9],[10,5,10,6],[10,7,10,8],[10,9,10,10],[1,5,1,7],[1,8,3,10],[2,5,2,7],[3,5,3,7],[4,5,4,7],[4,8,4,9],[4,10,5,10],[5,5,5,7],[5,8,5,9]]}
[]
[null,null,null,null,null,"Convenzione \nTecnologie Server 4 - Lotto 6",null,null,{"$f":"IF(Q3>0,\"Compilare i Dati Necessari all'Ordine per Stampare in PDF o Controllare Configurazioni\",\"Dati Completi\")","v":"Compilare i Dati Necessari all'Ordine per Stampare in PDF o Controllare Configurazioni"},null,null,null,null,null,null,null,null,null,null,null,null,null,null,null,"SI"]
[null,null,null,null,null,"Riepilogo Ordine N° (*)",null,null,null,null,null,null,null,null,null,null,{"$f":"P8+U8","v":9},{"$f":"IF(Lotto6_R940_1!L8>0,1,0)","v":0},{"$f":"IF(Lotto6_R940_2!L8>0,1,0)","v":0},{"$f":"IF(Lotto6_R940_3!L8>0,1,0)","v":0},null,{"$f":"SUM(R3:T3)","v":0},null,null,"SI"]
[null,null,null,null,null,null,null,null,null,null,null,null,null,null,null,null,null,null,null,null,null,null,null,null,"SI"]
[null,null,null,null,null,"Ente Ordinante (*)",null,null,"Data  (*)",null,null,null,null,null,null,"Ordine","Ente","data","Ref Cons","mail","tel","Ref Inst","mail","Tel","SI"]
[null,null,null,null,null,null,null,null,null,null,null,null,null,null,null,{"$f":"IF(F4>0,0,1)","v":1},{"$f":"IF(F6>0,0,1)","v":1},{"$f":"IF(I6>0,0,1)","v":1},{"$f":"IF(F8>0,0,1)","v":1},{"$f":"IF(H8>0,0,1)","v":1},{"$f":"IF(K8>0,0,1)","v":1},{"$f":"IF(F10>0,0,1)","v":1},{"$f":"IF(H10>0,0,1)","v":1},{"$f":"IF(K10>0,0,1)","v":1},"SI"]
[null,null,null,null,null,"Referente Consegna (*)",null,"Mail (*)",null,null,"Tel (*)",null,null,null,null,null,null,null,null,null,null,null,null,null,"SI"]
[null,null,null,null,null,null,null,null,null,null,null,null,null,null,null,{"$f":"SUM(P6:X6)","v":9},null,{"$f":"IF(F11<>\"\",1,0)","v":0},{"$f":"IF(H11<>\"\",1,0)","v":0},{"$f":"IF(J11<>\"\",1,0)","v":0},{"$f":"SUM(R8:T8)","v":0},null,null,null,"SI"]
[null,null,null,null,null,"Referente Installazione (*)",null,"Mail (*)",null,null,"Tel (*)",null,null,null,null,null,null,null,null,null,null,null,null,null,"SI"]
[null,null,null,null,null,null,null,null,null,null,null,null,null,null,null,null,null,null,null,null,null,null,null,null,"SI"]
{"$rows_left_out":134}
{"sheet":"Config","index":6,"n_rows":148,"n_cols":18,"rows_kept":148,"cut":false,"hidden":true,"merged":[[9,3,9,4],[9,6,9,7],[10,3,10,4],[10,6,10,7],[10,9,10,10],[7,3,7,4],[7,6,7,7],[7,9,7,10],[8,3,8,4],[8,6,8,7],[8,9,8,10],[6,3,6,4],[6,6,6,7],[1,3,1,10],[3,3,3,4],[4,3,4,4],[5,3,5,4],[5,6,5,7]]}
[]
[null,null,null,"Informazioni di Servizio per processamento Ordine",null,null,null,null,null,null,null,null,null,null,null,null,null,"SI"]
[null,null,null,null,null,null,null,null,null,null,null,null,null,null,null,null,null,"SI"]
[null,null,null,{"$f":"Riepilogo_Ordine!F3","v":"Riepilogo Ordine N° (*)"},null,null,null,null,null,null,null,null,null,null,null,null,null,"SI"]
[null,null,null,{"$f":"Riepilogo_Ordine!F4","v":0},null,null,null,null,null,null,null,null,null,null,null,null,null,"SI"]
[null,null,null,{"$f":"Riepilogo_Ordine!F5","v":"Ente Ordinante (*)"},null,null,{"$f":"Riepilogo_Ordine!I5","v":"Data  (*)"},null,null,null,null,null,null,null,null,null,null,"SI"]
[null,null,null,{"$f":"Riepilogo_Ordine!F6","v":0},null,null,{"$f":"Riepilogo_Ordine!I6","v":"00:00:00"},null,null,null,null,null,null,null,null,null,null,"SI"]
[null,null,null,{"$f":"Riepilogo_Ordine!F7","v":"Referente Consegna (*)"},null,null,{"$f":"Riepilogo_Ordine!H7","v":"Mail (*)"},null,null,{"$f":"Riepilogo_Ordine!K7","v":"Tel (*)"},null,null,null,null,null,null,null,"SI"]
[null,null,null,{"$f":"Riepilogo_Ordine!F8","v":0},null,null,{"$f":"Riepilogo_Ordine!I8","v":0},null,null,{"$f":"Riepilogo_Ordine!K8","v":0},null,null,null,null,null,null,null,"SI"]
[null,null,null,{"$f":"Riepilogo_Ordine!F9","v":"Referente Installazione (*)"},null,null,{"$f":"Riepilogo_Ordine!H9","v":"Mail (*)"},null,null,{"$f":"Riepilogo_Ordine!K9","v":"Tel (*)"},null,null,null,null,null,null,null,"SI"]
{"$rows_left_out":139}
{"sheet":"ConfTS4L6","index":7,"n_rows":219,"n_cols":24,"rows_kept":219,"cut":false,"hidden":true,"merged":[[12,18,12,19],[12,20,12,21],[65,0,66,0],[194,3,194,4],[194,6,194,7],[12,14,12,15],[12,16,12,17]]}
[{"$f":"\"\"","v":""},{"$f":"\"\"","v":""},{"$f":"\"\"","v":""},{"$f":"\"\"","v":""},{"$f":"\"\"","v":""},{"$f":"\"\"","v":""},{"$f":"\"\"","v":""},{"$f":"\"\"","v":""},{"$f":"\"\"","v":""},{"$f":"\"\"","v":""},{"$f":"\"\"","v":""},{"$f":"\"\"","v":""},{"$f":"\"\"","v":""},{"$f":"\"\"","v":""},{"$f":"\"\"","v":""},{"$f":"\"\"","v":""},{"$f":"\"\"","v":""}]
[null,"Module Name","Option ID","Option Name","Option List Price","SKUs","Qty","SKU Customer Kit","Attributo","Valore inserito",null,"N°","Codice Convenzione"]
["PowerEdge R940 Server (General Purpose)","Chassis with Up to 12X 2.5 SAS/SATA + 12X 2.5 for 2CPU Configuration","Chassis with Up to 12X 2.5 SAS/SATA + 12X 2.5 for 4CPU Configuration",{"$f":"VLOOKUP(L3,Tabella_prezzi!$A$2:$L$91,8,FALSE)","v":"PowerEdge R940 Server"},null,null,null,{"$f":"VLOOKUP(L3,Tabella_prezzi!$A$2:$L$91,9,FALSE)","v":"PowerEdge R940 Server"},{"$f":"VLOOKUP(L3,Tabella_prezzi!$A$2:$L$91,3,FALSE)","v":"server\nrackable quad-processore (prestazionale)"},{"$f":"VLOOKUP(L3,Tabella_prezzi!$A$2:$L$91,4,FALSE)","v":5754.51},null,"L6N01","TS4L6-SRV"]
["PowerEdge R940 Server (nVME)","Chassis with Up to 12X 2.5 SAS/SATA + 12X 2.5 NVME for 2CPU Configuration","Chassis with Up to 12X 2.5 SAS/SATA + 12X 2.5 NVME for 4CPU Configuration",{"$f":"VLOOKUP(L4,Tabella_prezzi!$A$2:$L$91,8,FALSE)","v":"PowerEdge R940 Server-NVMe"},null,null,null,{"$f":"VLOOKUP(L4,Tabella_prezzi!$A$2:$L$91,9,FALSE)","v":"PowerEdge R940 Server"},{"$f":"VLOOKUP(L4,Tabella_prezzi!$A$2:$L$91,3,FALSE)","v":"server\nrackable quad-processore (prestazionale)"},{"$f":"J3*1.02","v":5869.6002000000008},null,"L6N01-NVMe","TS4L6-SRV-NVME"]
["PowerEdge R940 Server (vSAN Ready)","Chassis with Up to 12X 2.5 SAS/SATA + 12X 2.5 vSAN for 2CPU Configuration","Chassis with Up to 12X 2.5 SAS/SATA + 12X 2.5 vSAN for 4CPU Configuration",{"$f":"VLOOKUP(L5,Tabella_prezzi!$A$2:$L$91,8,FALSE)","v":"PowerEdge R940 Server-NVMe"},null,null,null,{"$f":"VLOOKUP(L5,Tabella_prezzi!$A$2:$L$91,9,FALSE)","v":"PowerEdge R940 Server"},{"$f":"VLOOKUP(L5,Tabella_prezzi!$A$2:$L$91,3,FALSE)","v":"server\nrackable quad-processore (prestazionale)"},{"$f":"J3*1.02","v":5869.6002000000008},null,"L6N01-NVme",{"$f":"VLOOKUP(L5,Tabella_prezzi!$A$2:$L$91,6,FALSE)","v":"TS4L6-SRV-NVMe"}]
["PowerEdge R940 Server (vSAN Ready) 64GB","Chassis with Up to 12X 2.5 SAS/SATA + 12X 2.5 vSAN for 2CPU Configuration","Chassis with Up to 12X 2.5 SAS/SATA + 12X 2.5 vSAN for 4CPU Configuration",{"$f":"VLOOKUP(L6,Tabella_prezzi!$A$2:$L$91,8,FALSE)","v":"PowerEdge R940 Server-NVMe"},null,null,null,{"$f":"VLOOKUP(L6,Tabella_prezzi!$A$2:$L$91,9,FALSE)","v":"PowerEdge R940 Server"},{"$f":"VLOOKUP(L6,Tabella_prezzi!$A$2:$L$91,3,FALSE)","v":"server\nrackable quad-processore (prestazionale)"},{"$f":"J3*1.02","v":5869.6002000000008},null,"L6N01-NVme",{"$f":"VLOOKUP(L6,Tabella_prezzi!$A$2:$L$91,6,FALSE)","v":"TS4L6-SRV-NVMe"}]
["PowerEdge R940 Server (BOSS 3TB 48x64 GB RAM)","Chassis with Up to 12X 2.5 SAS/SATA + 12X 2.5 vSAN for 4CPU Configuration 2TB RAM Comprensivo di BOSS e HBA 330+","Chassis with Up to 12X 2.5 SAS/SATA + 12X 2.5 vSAN for 4CPU Configuration 2TB RAM Comprensivo di BOSS e HBA 330+","PowerEdge R940 Server-NVMe",null,null,1,"PowerEdge R940 Server","server\nrackable quad-processore (prestazionale)",{"$f":"J3*1.02","v":5869.6002000000008},null,"L6N01-NVme",{"$f":"VLOOKUP(L7,Tabella_prezzi!$A$2:$L$91,6,FALSE)","v":"TS4L6-SRV-NVMe"}]
["PowerEdge R940 Server (vSAN Ready)","Chassis with Up to 16 x 2.5 Hard Drives for 2CPU, GPU Double-Wide Configuration",null,{"$f":"VLOOKUP(L8,Tabella_prezzi!$A$2:$L$91,8,FALSE)","v":"PowerEdge R940 Server-NVMe"},null,null,null,{"$f":"VLOOKUP(L8,Tabella_prezzi!$A$2:$L$91,9,FALSE)","v":"PowerEdge R940 Server"},{"$f":"VLOOKUP(L8,Tabella_prezzi!$A$2:$L$91,3,FALSE)","v":"server\nrackable quad-processore (prestazionale)"},{"$f":"VLOOKUP(L8,Tabella_prezzi!$A$2:$L$91,4,FALSE)","v":5869.6002000000008},null,"L6N01-NVMe",{"$f":"VLOOKUP(L8,Tabella_prezzi!$A$2:$L$91,6,FALSE)","v":"TS4L6-SRV-NVMe"}]
[]
["TS4L6_Chassis"]
{"$rows_left_out":210}
{"sheet":"Tabella_prezzi","index":8,"n_rows":88,"n_cols":18,"rows_kept":88,"cut":false,"hidden":true,"merged":[[23,12,24,12],[25,12,26,12],[39,12,40,12],[4,12,10,12],[15,12,16,12],[17,12,18,12],[19,12,20,12],[21,12,22,12],[39,10,40,10],[4,0,10,0],[4,1,10,1],[4,3,10,3],[4,4,10,4],[4,5,10,5],[4,9,10,9],[39,8,40,8],[39,6,40,6],[17,4,18,4],[4,2,10,2],[19,5,20,5],[21,5,22,5],[15,4,16,4],[17,5,18,5],[19,4,20,4],[15,0,16,0],[15,1,16,1],[15,2,16,2],[15,3,16,3],[21,0,22,0],[21,1,22,1],[21,2,22,2],[21,3,22,3],[19,0,20,0],[19,1,20,1],[17,0,18,0],[17,1,18,1],[17,2,18,2],[17,3,18,3],[19,2,20,2],[19,3,20,3],[25,4,26,4],[25,5,26,5],[15,9,16,9],[17,9,18,9],[19,9,20,9],[21,9,22,9],[23,9,24,9],[25,9,26,9],[15,5,16,5],[23,4,24,4],[23,5,24,5],[21,4,22,4],[23,2,24,2],[25,0,26,0],[25,1,26,1],[25,2,26,2],[25,3,26,3],[23,0,24,0],[23,1,24,1],[23,3,24,3],[39,9,40,9],[39,5,40,5],[39,0,40,0],[39,1,40,1],[39,4,40,4],[39,2,40,2],[39,3,40,3]]}
["N°",null,"Attributo","Valore inserito","N°","Codice Convenzione","Qty:",null,"Description:","Manufacturer Part","Sku Number:","Brand"]
["L6N01",1,"server\nrackable quad-processore (prestazionale)",5754.51,"L6N01","TS4L6-SRV",1,"PowerEdge R940 Server","PowerEdge R940 Server","L6N01-ServerR940","210-AMTE","DELL","TS4L6-SRV",null,null,null,"210-321-BCPX","-"]
["L6N01-NVMe",1,"server\nrackable quad-processore (prestazionale)",{"$f":"D2*1.02","v":5869.6002000000008},"L6N01","TS4L6-SRV-NVMe",1,"PowerEdge R940 Server-NVMe","PowerEdge R940 Server","L6N01-ServerR940-NVMe","210-AMTE","DELL","TS4L6-SRV-NVME",null,null,null,"210-321-BCPX","-"]
["L6N01-NVMe",1,"server\nrackable quad-processore (prestazionale)",{"$f":"D2*1.02","v":5869.6002000000008},"L6N01","TS4L6-SRV-NVMe",1,"PowerEdge R940 Server-NVMe","PowerEdge R940 Server","L6N01-ServerR940-NVMe","210-AMTE","DELL","TS4L6-SRV-vSAN",null,null,null,"210-321-BCPX","-"]
["L6N02",2,"Kit n. 2 Processori\naggiuntivi",1908.9,"L6N02","TS4L6-CPU",1,"2 x Intel Xeon Gold 6252N, 2.3G, 24C/48T, 10.4GT/s, 35.75M Cache, Turbo, HT (150W) DDR4-2933","2 x Intel Xeon Gold 6252N, 2.3G, 24C/48T, 10.4GT/s, 35.75M Cache, Turbo, HT (150W) DDR4-2933","L6N02-OpzCPU","338-BZSB","DELL","TS4L6-CPU-NVME",null,null,null,"338-BZSB","WX6G7"]
[null,null,null,null,null,null,1,"L Shape Heatsink for 2nd CPU equal to or greater than 180W,PowerEdge R6525/R7525, Customer Install","L Shape Heatsink for 2nd CPU equal to or greater than 180W,PowerEdge R6525/R7525, Customer Install",null,"412-AASW","DELL",null,null,null,null,"412-AASW","4RCGC"]
[null,null,null,null,null,null,1,"PowerEdge R7525 High Performance Fan Customer Kit V3","PowerEdge R7525 High Performance Fan Customer Kit V3",null,"121-BBBI","DELL",null,null,null,null,"121-BBBI","HVVRP"]
[null,null,null,null,null,null,1,"Riser with Two x8(x16 connector) PCIe Gen4 (Slots 4 & 5), Customer Install","Riser with Two x8(x16 connector) PCIe Gen4 (Slots 4 & 5), Customer Install",null,"330-BBTM","DELL",null,null,null,null,"330-BBTM","234T7"]
[null,null,null,null,null,null,1,"Riser 4B, PCIe Gen4 1x16 (x16 connector), Half Length, PowerEdge R7525, CK","Riser 4B, PCIe Gen4 1x16 (x16 connector), Half Length, PowerEdge R7525, CK",null,"330-BBPR","DELL",null,null,null,null,"330-BBPR"]
[null,null,null,null,null,null,1,"Riser 1B, PCIe Gen4 2x8 (x16 connector), Half Length, PowerEdge R7525, CK","Riser 1B, PCIe Gen4 2x8 (x16 connector), Half Length, PowerEdge R7525, CK",null,"330-BBPV","DELL",null,null,null,null,"330-BBPV","R80PP"]
{"$rows_left_out":78}