{"text_format":"1","workbook":"xlsx","n_sheets":8,"sheets":["Benvenuto","Lotto5_R840_1","Lotto5_R840_2","Lotto5_R840_3","Altre_Opzioni","Riepilogo_ordine","ConfigurationTS4L6","Tabella_prezzi"],"not_rendered":{"charts":0,"images":7,"macros":1,"external_links":0,"defined_names":39,"comments":0,"pivot_tables":0},"unopened":[],"bounds":{"document_bytes":16777216,"sheet_cells":100000,"rows_first":2000,"rows_last":500,"rows_between":2000,"halvings":0,"cell_chars":16384,"cell_head_chars":4096},"cells_cut":0,"cells_raw":0,"read":"whole","date_system":"1900"}

{"sheet":"Benvenuto","index":0,"n_rows":28,"n_cols":17,"rows_kept":28,"cut":false,"hidden":false,"merged":[[2,4,42,13],[2,15,2,16],[4,15,4,16],[6,15,6,16],[27,15,29,16]]}
[]
[]
[null,null,null,null,null,null,null,null,null,null,null,null,null,null,null,"LEGENDA"]
[null,null,null,null,null,null,null,null,null,null,null,null,null,null,null,"Campi Non Editabili","Campi Editabili"]
[]
[null,null,null,null,null,null,null,null,null,null,null,null,null,null,null,"Opzioni 20%","Qtà 20%"]
[]
[null,null,null,null,null,null,null,null,null,null,null,null,null,null,null,"Errore nella Selezione","Verifica Positiva"]
[]
[]
[]
[]
[]
[]
[]
{"$rows_left_out":14}
{"sheet":"Lotto5_R840_1","index":1,"n_rows":112,"n_cols":26,"rows_kept":112,"cut":false,"hidden":false,"merged":[[23,7,24,7],[26,7,27,7],[111,8,111,11],[112,8,123,11],[56,10,56,11],[58,10,58,11],[40,8,41,8],[100,9,101,9],[103,9,104,9],[65,9,66,9],[62,9,63,9],[88,10,88,11],[1,8,2,8],[3,8,5,8],[64,13,66,14],[40,13,41,13],[3,10,4,10],[11,9,12,9],[14,9,15,9],[17,9,18,9],[37,9,38,9],[5,10,6,10],[37,11,37,13],[18,11,20,11]]}
[]
[null,null,null,null,null,null,null,null,"Convenzione \nTecnologie Server 4 - Lotto 5",null,null,null,null,{"$f":"IF(Riepilogo_ordine!K70>Riepilogo_ordine!G70,\"Superata Quota 20%\",\"\")","v":""}]
[null,null,null,null,null,null,null,null,null,null,null,null,null,"Articoli 20% Totali",null,null,null,null,"Check CPU","Check RAM","Check Dischi","Check Win","Check Gar","Check RAM","Check Tot"]
[null,null,null,null,null,null,null,null,null,null,{"$f":"IF(Y4>1,\"Errori nella Configurazione\",IF(S4>0,\"Errore nella Selezione della CPU\",IF(T4>0,\"Errore Nella Selezione della RAM\",IF(X4>0,\"Errore Nella selezione della RAM\",IF(U4>0,\"Errore Nella selezione dei Dischi\",IF(V4>0,\"Errore nella Selezione Licenze Windows\",IF(W4>0,\"Errore nella Selezione Estensione di Garanzia\",\"\")))))))","v":""},"Totale Altre Opzioni",null,{"$f":"Riepilogo_ordine!K70","v":0},null,null,null,null,{"$f":"IF(L21<>\"\",1,0)","v":0},{"$f":"IF(L24<>\"\",1,0)","v":0},{"$f":"IF(N41<>\"\",1,0)","v":0},{"$f":"IF(L30<>\"\",1,0)","v":0},{"$f":"IF(L104<>\"\",1,0)","v":0},{"$f":"IF(H27=\"Configurazione RAM non congrua selezionare RAM 32GB\",1,0)","v":0},{"$f":"SUM(S4:X4)","v":0}]
[null,null,null,null,null,null,null,null,null,null,null,{"$f":"Altre_Opzioni!J3","v":0},null,"Quota Residua 20 %"]
[null,null,null,null,null,null,null,null,null,null,"Guida alla Convenzione","Totale Configurazione",null,{"$f":"Riepilogo_ordine!G71","v":0}]
[null,null,null,null,null,null,null,null,{"$f":"IF(Riepilogo_ordine!P8>0,\"Compilare i Dati Necessari all'Ordine per Stampare in PDF\",\"Dati Completi\")","v":"Compilare i Dati Necessari all'Ordine per Stampare in PDF"},null,null,{"$f":"$L$110","v":0},null,"Totale Ordine\nIva Esclusa"]
[null,null,null,null,null,null,null,null,"DELL POWEREDGE R840",null,"Quantità Server",0,null,{"$f":"Riepilogo_ordine!K71","v":0}]
[]
[]
[]
[null,null,null,null,null,null,null,null,"Base",null,null,null,null,null,null,null,null,null,null,null,null,"PowerEdge R840 Server (2TB)"]
[null,null,null,null,null,null,null,null,"PowerEdge R840 Server (General Purpose)",null,{"$f":"IF($L$8>0,\"TS4L5-SRV\",\"\")","v":""},{"$f":"IF($L$8>0,1,\"\")","v":""},null,{"$f":"R13","v":4022.56},null,null,null,{"$f":"VLOOKUP($I$13,TS4L6_Chassis,10,FALSE)","v":4022.56},null,{"$f":"VLOOKUP($I13,TS4L6_Chassis,12,FALSE)","v":"L5N01"},null,{"$f":"IF(I13=ConfigurationTS4L6!A9,\"nVME\",\"\")","v":""},{"$f":"IF(I13=ConfigurationTS4L6!A10,\"vSAN\",\"\")","v":""},{"$f":"IF(K16=\"TS3L4-GPUSW\",1,IF(K16=\"TS3L4-GPUDW\",1,\"\"))","v":""}]
[null,null,null,null,null,null,null,null,null,null,null,null,null,null,null,null,null,null,null,null,null,null,null,null,{"$f":"IF($I$22=\"No Additional Processor\",ConfigurationTS4L6!$A$17:$A$24,IF(Z27=\"2TB\",ConfigurationTS4L6!A51,ConfigurationTS4L6!$A$32:$A$47))","v":0}]
[null,null,null,null,null,null,null,null,"Chassis Configuration",null,{"$f":"IF($V$70=\"SW\",\"MAX 4 GPU\",IF($V$70=\"DW\",\"MAX 2 GPU\",\"\"))","v":""},null,null,null,null,null,null,null,null,null,null,null,null,null,128]
{"$rows_left_out":98}
{"sheet":"Lotto5_R840_2","index":2,"n_rows":112,"n_cols":26,"rows_kept":112,"cut":false,"hidden":false,"merged":[[14,9,15,9],[1,8,2,8],[3,8,5,8],[3,10,4,10],[5,10,6,10],[11,9,12,9],[64,13,66,14],[65,9,66,9],[100,9,101,9],[17,9,18,9],[23,7,24,7],[26,7,27,7],[37,9,38,9],[37,11,37,13],[40,8,41,8],[40,13,41,13],[18,11,20,11],[88,10,88,11],[103,9,104,9],[111,8,111,11],[112,8,123,11],[56,10,56,11],[58,10,58,11],[62,9,63,9]]}
[]
[null,null,null,null,null,null,null,null,"Convenzione \nTecnologie Server 4 - Lotto 5",null,null,null,null,{"$f":"IF(Riepilogo_ordine!K70>Riepilogo_ordine!G70,\"Superata Quota 20%\",\"\")","v":""}]
[null,null,null,null,null,null,null,null,null,null,null,null,null,"Articoli 20% Totali",null,null,null,null,"Check CPU","Check RAM","Check Dischi","Check Win","Check Gar","Check RAM","Check Tot"]
[null,null,null,null,null,null,null,null,null,null,{"$f":"IF(Y4>1,\"Errori nella Configurazione\",IF(S4>0,\"Errore nella Selezione della CPU\",IF(T4>0,\"Errore Nella Selezione della RAM\",IF(X4>0,\"Errore Nella selezione della RAM\",IF(U4>0,\"Errore Nella selezione dei Dischi\",IF(V4>0,\"Errore nella Selezione Licenze Windows\",IF(W4>0,\"Errore nella Selezione Estensione di Garanzia\",\"\")))))))","v":""},"Totale Altre Opzioni",null,{"$f":"Riepilogo_ordine!K70","v":0},null,null,null,null,{"$f":"IF(L21<>\"\",1,0)","v":0},{"$f":"IF(L24<>\"\",1,0)","v":0},{"$f":"IF(N41<>\"\",1,0)","v":0},{"$f":"IF(L30<>\"\",1,0)","v":0},{"$f":"IF(L104<>\"\",1,0)","v":0},{"$f":"IF(H27=\"Configurazione RAM non congrua selezionare RAM 32GB\",1,0)","v":0},{"$f":"SUM(S4:X4)","v":0}]
[null,null,null,null,null,null,null,null,null,null,null,{"$f":"Altre_Opzioni!J3","v":0},null,"Quota Residua 20 %"]
[null,null,null,null,null,null,null,null,null,null,"Guida alla Convenzione","Totale Configurazione",null,{"$f":"Riepilogo_ordine!G71","v":0}]
[null,null,null,null,null,null,null,null,{"$f":"IF(Riepilogo_ordine!P8>0,\"Compilare i Dati Necessari all'Ordine per Stampare in PDF\",\"Dati Completi\")","v":"Compilare i Dati Necessari all'Ordine per Stampare in PDF"},null,null,{"$f":"$L$110","v":0},null,"Totale Ordine\nIva Esclusa"]
[null,null,null,null,null,null,null,null,"DELL POWEREDGE R840",null,"Quantità Server",0,null,{"$f":"Riepilogo_ordine!K71","v":0}]
[]
[]
[]
[null,null,null,null,null,null,null,null,"Base",null,null,null,null,null,null,null,null,null,null,null,null,"PowerEdge R840 Server (2TB)"]
[null,null,null,null,null,null,null,null,"PowerEdge R840 Server (General Purpose)",null,{"$f":"IF($L$8>0,\"TS4L5-SRV\",\"\")","v":""},{"$f":"IF($L$8>0,1,\"\")","v":""},null,{"$f":"R13","v":4022.56},null,null,null,{"$f":"VLOOKUP($I$13,TS4L6_Chassis,10,FALSE)","v":4022.56},null,{"$f":"VLOOKUP($I13,TS4L6_Chassis,12,FALSE)","v":"L5N01"},null,{"$f":"IF(I13=ConfigurationTS4L6!A9,\"nVME\",\"\")","v":""},{"$f":"IF(I13=ConfigurationTS4L6!A10,\"vSAN\",\"\")","v":""},{"$f":"IF(K16=\"TS3L4-GPUSW\",1,IF(K16=\"TS3L4-GPUDW\",1,\"\"))","v":""}]
[null,null,null,null,null,null,null,null,null,null,null,null,null,null,null,null,null,null,null,null,null,null,null,null,{"$f":"IF($I$22=\"No Additional Processor\",ConfigurationTS4L6!$A$17:$A$24,IF(Z27=\"2TB\",ConfigurationTS4L6!A51,ConfigurationTS4L6!$A$32:$A$47))","v":2048}]
[null,null,null,null,null,null,null,null,"Chassis Configuration",null,{"$f":"IF($V$70=\"SW\",\"MAX 4 GPU\",IF($V$70=\"DW\",\"MAX 2 GPU\",\"\"))","v":""}]
{"$rows_left_out":98}
{"sheet":"Lotto5_R840_3","index":3,"n_rows":112,"n_cols":26,"rows_kept":112,"cut":false,"hidden":false,"merged":[[14,9,15,9],[1,8,2,8],[3,8,5,8],[3,10,4,10],[5,10,6,10],[11,9,12,9],[64,13,66,14],[65,9,66,9],[100,9,101,9],[17,9,18,9],[23,7,24,7],[26,7,27,7],[37,9,38,9],[37,11,37,13],[40,8,41,8],[40,13,41,13],[18,11,20,11],[88,10,88,11],[103,9,104,9],[111,8,111,11],[112,8,123,11],[56,10,56,11],[58,10,58,11],[62,9,63,9]]}
[]
[null,null,null,null,null,null,null,null,"Convenzione \nTecnologie Server 4 - Lotto 5",null,null,null,null,{"$f":"IF(Riepilogo_ordine!K70>Riepilogo_ordine!G70,\"Superata Quota 20%\",\"\")","v":""}]
[null,null,null,null,null,null,null,null,null,null,null,null,null,"Articoli 20% Totali",null,null,null,null,"Check CPU","Check RAM","Check Dischi","Check Win","Check Gar","Check RAM","Check Tot"]
[null,null,null,null,null,null,null,null,null,null,{"$f":"IF(Y4>1,\"Errori nella Configurazione\",IF(S4>0,\"Errore nella Selezione della CPU\",IF(T4>0,\"Errore Nella Selezione della RAM\",IF(X4>0,\"Errore Nella selezione della RAM\",IF(U4>0,\"Errore Nella selezione dei Dischi\",IF(V4>0,\"Errore nella Selezione Licenze Windows\",IF(W4>0,\"Errore nella Selezione Estensione di Garanzia\",\"\")))))))","v":""},"Totale Altre Opzioni",null,{"$f":"Riepilogo_ordine!K70","v":0},null,null,null,null,{"$f":"IF(L21<>\"\",1,0)","v":0},{"$f":"IF(L24<>\"\",1,0)","v":0},{"$f":"IF(N41<>\"\",1,0)","v":0},{"$f":"IF(L30<>\"\",1,0)","v":0},{"$f":"IF(L104<>\"\",1,0)","v":0},{"$f":"IF(H27=\"Configurazione RAM non congrua selezionare RAM 32GB\",1,0)","v":0},{"$f":"SUM(S4:X4)","v":0}]
[null,null,null,null,null,null,null,null,null,null,null,{"$f":"Altre_Opzioni!J3","v":0},null,"Quota Residua 20 %"]
[null,null,null,null,null,null,null,null,null,null,"Guida alla Convenzione","Totale Configurazione",null,{"$f":"Riepilogo_ordine!G71","v":0}]
[null,null,null,null,null,null,null,null,{"$f":"IF(Riepilogo_ordine!P8>0,\"Compilare i Dati Necessari all'Ordine per Stampare in PDF\",\"Dati Completi\")","v":"Compilare i Dati Necessari all'Ordine per Stampare in PDF"},null,null,{"$f":"$L$110","v":0},null,"Totale Ordine\nIva Esclusa"]
[null,null,null,null,null,null,null,null,"DELL POWEREDGE R840",null,"Quantità Server",0,null,{"$f":"Riepilogo_ordine!K71","v":0}]
[]
[]
[]
[null,null,null,null,null,null,null,null,"Base",null,null,null,null,null,null,null,null,null,null,null,null,"PowerEdge R840 Server (2TB)"]
[null,null,null,null,null,null,null,null,"PowerEdge R840 Server (General Purpose)",null,{"$f":"IF($L$8>0,\"TS4L5-SRV\",\"\")","v":""},{"$f":"IF($L$8>0,1,\"\")","v":""},null,{"$f":"R13","v":4022.56},null,null,null,{"$f":"VLOOKUP($I$13,TS4L6_Chassis,10,FALSE)","v":4022.56},null,{"$f":"VLOOKUP($I13,TS4L6_Chassis,12,FALSE)","v":"L5N01"},null,{"$f":"IF(I13=ConfigurationTS4L6!A9,\"nVME\",\"\")","v":""},{"$f":"IF(I13=ConfigurationTS4L6!A10,\"vSAN\",\"\")","v":""},{"$f":"IF(K16=\"TS3L4-GPUSW\",1,IF(K16=\"TS3L4-GPUDW\",1,\"\"))","v":""}]
[null,null,null,null,null,null,null,null,null,null,null,null,null,null,null,null,null,null,null,null,null,null,null,null,{"$f":"IF($I$22=\"No Additional Processor\",ConfigurationTS4L6!$A$17:$A$24,IF(Z27=\"2TB\",ConfigurationTS4L6!A51,ConfigurationTS4L6!$A$32:$A$47))","v":0}]
[null,null,null,null,null,null,null,null,"Chassis Configuration",null,{"$f":"IF($V$70=\"SW\",\"MAX 4 GPU\",IF($V$70=\"DW\",\"MAX 2 GPU\",\"\"))","v":""},null,null,null,null,null,null,null,null,null,null,null,null,null,128]
{"$rows_left_out":98}
{"sheet":"Altre_Opzioni","index":4,"n_rows":22,"n_cols":16,"rows_kept":22,"cut":false,"hidden":false,"merged":[[1,9,1,11],[20,7,21,7],[17,7,18,7],[5,7,6,7],[8,7,9,7],[11,7,12,7],[14,7,15,7]]}
[]
[null,null,null,null,null,null,"Opzioni",null,null,"Totale altre opzioni"]
[null,null,null,null,null,null,null,null,null,{"$f":"SUM(N7:N16)","v":0}]
[]
[]
[null,null,null,null,null,null,"OpzRack"]
[null,null,null,null,null,null,{"$f":"ConfigurationTS4L6!A115","v":"Armadio Rack 42U"},null,{"$f":"VLOOKUP($G7,TS4L5_RACK,13,FALSE)","v":"TS4L5-RACK"},0,null,{"$f":"N7","v":0},null,{"$f":"VLOOKUP($G7,TS4L5_RACK,11,FALSE)*J7","v":0},{"$f":"VLOOKUP($G7,TS4L5_RACK,10,FALSE)*J7","v":0},{"$f":"VLOOKUP($G7,TS4L5_RACK,12,FALSE)","v":"L5N28"}]
[]
[null,null,null,null,null,null,"OpzUps (3000VA)"]
[null,null,null,null,null,null,{"$f":"ConfigurationTS4L6!A158","v":"Dispositivo UPS di tipo On-line doppia conversione, strutturato per il montaggio a rack da 19”"},null,{"$f":"VLOOKUP($G10,TS4L5_UPS,13,FALSE)","v":"TS4L5-UPS"},0,null,{"$f":"N10","v":0},null,{"$f":"VLOOKUP($G10,TS4L5_UPS,11,FALSE)*J10","v":0},{"$f":"VLOOKUP($G10,TS4L5_UPS,10,FALSE)*J10","v":0},{"$f":"VLOOKUP($G10,TS4L5_UPS,12,FALSE)","v":"L5N18"}]
[]
[null,null,null,null,null,null,"OpzGUI"]
[null,null,null,null,null,null,{"$f":"ConfigurationTS4L6!A161","v":"Unità KVM - monitor 17\", cavo combi PS/2&USB da 1,8mt, tastiera italiana, touch pad"},null,{"$f":"VLOOKUP($G13,TS4L5_GUI,13,FALSE)","v":"TS4L5-GUI"},0,null,{"$f":"N13","v":0},null,{"$f":"VLOOKUP($G13,TS4L5_GUI,11,FALSE)*J13","v":0},{"$f":"VLOOKUP($G13,TS4L5_GUI,10,FALSE)*J13","v":0},{"$f":"VLOOKUP($G13,TS4L5_GUI,12,FALSE)","v":"L5N19"}]
[]
[null,null,null,null,null,null,"OpzKVM"]
{"$rows_left_out":8}
{"sheet":"Riepilogo_ordine","index":5,"n_rows":73,"n_cols":25,"rows_kept":73,"cut":false,"hidden":false,"merged":[[69,8,69,9],[70,8,70,9],[71,5,71,6],[71,8,71,9],[68,5,68,6],[68,8,68,9],[6,5,6,6],[6,7,6,9],[7,5,7,6],[7,7,7,9],[8,5,8,6],[8,7,8,9],[9,5,9,6],[9,7,9,9],[10,8,10,9],[11,5,11,10],[52,5,52,10],[1,5,1,7],[1,8,3,10],[2,5,2,7],[3,5,3,7],[4,5,4,7],[4,8,4,9],[4,10,5,10],[5,5,5,7],[5,8,5,9]]}
[]
[null,null,null,null,null,"Convenzione \nTecnologie Server 4 - Lotto 5",null,null,{"$f":"IF(P8>0,\"Compilare i Dati Necessari (*) all'Ordine o controllare le Configurazioni per Stampare in PDF\",\"Dati Completi\")","v":"Compilare i Dati Necessari (*) all'Ordine o controllare le Configurazioni per Stampare in PDF"},null,null,null,null,null,null,null,null,null,null,null,null,null,null,null,"SI"]
[null,null,null,null,null,"Riepilogo Ordine N°",null,null,null,null,null,null,null,null,null,null,null,{"$f":"IF(Lotto5_R840_1!L8>0,1,0)","v":0},{"$f":"IF(Lotto5_R840_2!L8>0,1,0)","v":0},{"$f":"IF(Lotto5_R840_3!L8>0,1,0)","v":0},null,{"$f":"SUM(R3:T3)","v":0},null,null,"SI"]
[null,null,null,null,null,null,null,null,null,null,null,null,null,null,null,null,null,null,null,null,null,null,null,null,"SI"]
[null,null,null,null,null,"Ente Ordinante",null,null,"Data",null,null,null,null,null,null,"Ordine","Ente","data","Ref Cons","mail","tel","Ref Inst","mail","Tel","SI"]
[null,null,null,null,null,null,null,null,null,null,null,null,null,null,null,{"$f":"IF(F4>0,0,1)","v":1},{"$f":"IF(F6>0,0,1)","v":1},{"$f":"IF(I6>0,0,1)","v":1},{"$f":"IF(F8>0,0,1)","v":1},{"$f":"IF(H8>0,0,1)","v":1},{"$f":"IF(K8>0,0,1)","v":1},{"$f":"IF(F10>0,0,1)","v":1},{"$f":"IF(H10>0,0,1)","v":1},{"$f":"IF(K10>0,0,1)","v":1},"SI"]
[null,null,null,null,null,"Referente Consegna",null,"Mail",null,null,"Tel",null,null,null,null,null,null,null,null,null,null,null,null,null,"SI"]
[null,null,null,null,null,null,null,null,null,null,null,null,null,null,null,{"$f":"SUM(P6:X6)+SUM(R10:T10)","v":9},null,null,null,null,null,null,null,null,"SI"]
[null,null,null,null,null,"Referente Installazione",null,"Mail",null,null,"Tel",null,null,null,null,null,null,null,null,null,null,null,null,null,"SI"]
[null,null,null,null,null,null,null,null,null,null,null,null,null,null,null,null,null,{"$f":"IF(Lotto5_R840_1!K4<>\"\",1,0)","v":0},{"$f":"IF(Lotto5_R840_2!K4<>\"\",1,0)","v":0},{"$f":"IF(Lotto5_R840_3!K4<>\"\",1,0)","v":0},null,null,null,null,"SI"]
[null,null,null,null,null,{"$f":"IF(R10>0,\"Errore nella Configurazione 1\",\"\")","v":""},{"$f":"IF(S10>0,\"Errore nella Configurazione 2\",\"\")","v":""},null,{"$f":"IF(T10>0,\"Errore nella Configurazione 3\",\"\")","v":""},null,null,null,null,null,null,null,null,null,null,null,null,null,null,null,"SI"]
[null,null,null,null,null,"Articoli in convenzione",null,null,null,null,null,null,null,null,null,null,null,"Config 1","Config 2","Config 3","Totale",null,null,null,"SI"]
[null,null,null,null,null,"Codice Produttore","Codice Convenzione","Descrizione","Qtà","Costo unitario","Costo Totale",null,null,null,null,"N°","Codice Convenzione",{"$f":"Lotto5_R840_1!L8","v":0},{"$f":"Lotto5_R840_2!L8","v":0},{"$f":"Lotto5_R840_3!L8","v":0},null,null,null,null,"SI"]
[null,null,null,null,null,{"$f":"IF(I14=\"\",\"\",VLOOKUP(P14,Tabella_Prezzi,10,FALSE))","v":""},{"$f":"IF(I14=\"\",\"\",VLOOKUP(P14,Tabella_Prezzi,6,FALSE))","v":""},{"$f":"IF(J14=\"\",\"\",VLOOKUP(P14,Tabella_Prezzi,9,FALSE))","v":""},{"$f":"IF(U14>0,U14,\"\")","v":""},{"$f":"IF(I14=\"\",\"\",VLOOKUP(P14,Tabella_Prezzi,4,FALSE))","v":""},{"$f":"IF(F14=\"\",\"\",J14*I14)","v":""},null,null,null,null,"L5N01","TS4L6-SRV",{"$f":"COUNTIF(TS4L5_1,P14)*$R$13","v":0},{"$f":"COUNTIF(TS4L5_2,P14)*$S$13","v":0},{"$f":"COUNTIF(TS4L5_3,P14)*$T$13","v":0},{"$f":"SUM(R14:T14)","v":0},null,null,null,{"$f":"IF(I14<>\"\",\"SI\",\"NO\")","v":"NO"}]
[null,null,null,null,null,"","","",{"$f":"IF(U15>0,U15,\"\")","v":""},"","",null,null,null,null,"L5N01-NVMe","TS4L6-SRV-NVME",{"$f":"COUNTIF(TS4L5_1,P15)*$R$13","v":0},{"$f":"COUNTIF(TS4L5_2,P15)*$S$13","v":0},{"$f":"COUNTIF(TS4L5_3,P15)*$T$13","v":0},0,null,null,null,"NO"]
{"$rows_left_out":59}
{"sheet":"ConfigurationTS4L6","index":6,"n_rows":201,"n_cols":24,"rows_kept":201,"cut":false,"hidden":true,"merged":[[176,3,176,4],[176,6,176,7]]}
[]
[null,"Module Name","Option ID","Option Name","Option List Price","SKUs","Qty","SKU Customer Kit","Attributo","Valore inserito",null,"N°","Codice Convenzione"]
["PowerEdge R840 Server (General Purpose)","Chassis with Up to 8X 2.5 SAS/SATA","Chassis with Up to 8X 2.5 SAS/SATA",{"$f":"VLOOKUP(L3,Tabella_prezzi!$A$2:$L$81,8,FALSE)","v":0},null,null,{"$f":"\"\"","v":""},{"$f":"VLOOKUP(L3,Tabella_prezzi!$A$2:$L$81,9,FALSE)","v":"PowerEdge R840 Server"},{"$f":"VLOOKUP(L3,Tabella_prezzi!$A$2:$L$81,3,FALSE)","v":"server\nrackable quad-processore (prestazionale)"},{"$f":"VLOOKUP(L3,Tabella_prezzi!$A$2:$L$81,4,FALSE)","v":4022.56},null,"L5N01",{"$f":"\"\"","v":""},{"$f":"\"\"","v":""}]
["PowerEdge R840 Server (2TB)","Chassis with Up to 8X 2.5 SAS/SATA + kit TS4L5-4CPU-2TB (include BOSS card 2 x ssd per boot)","Chassis with Up to 8X 2.5 SAS/SATA + kit TS4L5-4CPU-2TB (include BOSS card 2 x ssd per boot)","\tkit TS4L5-4CPU-2TB (include BOSS card 2 x ssd per boot)",null,null,1,"kit TS4L5-4CPU-2TB (include BOSS card 2 x ssd per boot)","Opz4CPU-2TB",4022.56,5876.9,"L5N01","TS4L5-4CPU-2TB","L5N42"]
["PowerEdge R840 Server (vSAN Ready)","Chassis with Up to 8X 2.5 SAS/SATA","Chassis with Up to 8X 2.5 SAS/SATA",{"$f":"VLOOKUP(L5,Tabella_prezzi!$A$2:$L$81,8,FALSE)","v":0},null,null,null,{"$f":"VLOOKUP(L5,Tabella_prezzi!$A$2:$L$81,9,FALSE)","v":"PowerEdge R840 Server"},{"$f":"VLOOKUP(L5,Tabella_prezzi!$A$2:$L$81,3,FALSE)","v":"server\nrackable quad-processore (prestazionale)"},{"$f":"J3*1.02","v":4103.0111999999999},null,"L5N01-vSAN",{"$f":"VLOOKUP(L5,Tabella_prezzi!$A$2:$L$81,6,FALSE)","v":"TS4L5-SRV-vSAN"},{"$f":"\"\"","v":""}]
[]
["TS4L5_Chassis"]
["PowerEdge R840 Server (General Purpose)","Chassis with Up to 8X 2.5 SAS/SATA","Chassis with Up to 8X 2.5 SAS/SATA",null,null,0,1,{"$f":"VLOOKUP(L8,Tabella_prezzi!$A$2:$L$81,9,FALSE)","v":{"$error":"#N/A"}},"TS4-Opz1CPU",null,{"$f":"VLOOKUP(L8,Tabella_prezzi!$A$2:$L$81,4,FALSE)","v":{"$error":"#N/A"}},"L5N105",{"$f":"\"\"","v":""}]
["PowerEdge R840 Server (2TB)","Chassis with Up to 8X 2.5 SAS/SATA","Chassis with Up to 8X 2.5 SAS/SATA",{"$f":"VLOOKUP(L9,Tabella_prezzi!$A$2:$L$81,8,FALSE)","v":0},null,0,1,{"$f":"VLOOKUP(L9,Tabella_prezzi!$A$2:$L$81,9,FALSE)","v":"PowerEdge R840 Server"},{"$f":"VLOOKUP(L9,Tabella_prezzi!$A$2:$L$81,3,FALSE)","v":"server\nrackable quad-processore (prestazionale)"},{"$f":"VLOOKUP(L9,Tabella_prezzi!$A$2:$L$81,4,FALSE)","v":4022.56},null,"L5N01-NVMe","TS4L5-SRV-NVME",{"$f":"\"\"","v":""}]
["PowerEdge R840 Server (vSAN Ready)","Chassis with Up to 8X 2.5 SAS/SATA","Chassis with Up to 8X 2.5 SAS/SATA",{"$f":"VLOOKUP(L10,Tabella_prezzi!$A$2:$L$81,8,FALSE)","v":0},null,null,1,{"$f":"VLOOKUP(L10,Tabella_prezzi!$A$2:$L$81,9,FALSE)","v":"PowerEdge R840 Server"},{"$f":"VLOOKUP(L10,Tabella_prezzi!$A$2:$L$81,9,FALSE)","v":"PowerEdge R840 Server"},null,{"$f":"VLOOKUP(L10,Tabella_prezzi!$A$2:$L$81,4,FALSE)","v":4022.56},"L5N01"]
[]
["TS4L5_CPU"]
["No Additional Processor",{"$f":"\"\"","v":""},{"$f":"\"\"","v":""},{"$f":"\"\"","v":""},{"$f":"\"\"","v":""},{"$f":"\"\"","v":""},{"$f":"\"\"","v":""},{"$f":"\"\"","v":""},{"$f":"\"\"","v":""},{"$f":"\"\"","v":""},{"$f":"\"\"","v":""},{"$f":"\"\"","v":""},{"$f":"\"\"","v":""}]
[{"$f":"D14","v":"2 x Intel Xeon Gold 6252N, 2.3G, 24C/48T, 10.4GT/s, 35.75M Cache, Turbo, HT (150W) DDR4-2933"},null,null,{"$f":"VLOOKUP(L14,Tabella_prezzi!$A$2:$L$81,8,FALSE)","v":"2 x Intel Xeon Gold 6252N, 2.3G, 24C/48T, 10.4GT/s, 35.75M Cache, Turbo, HT (150W) DDR4-2933"},null,null,1,{"$f":"VLOOKUP(L14,Tabella_prezzi!$A$2:$L$81,9,FALSE)","v":"2 x Intel Xeon Gold 6252N, 2.3G, 24C/48T, 10.4GT/s, 35.75M Cache, Turbo, HT (150W) DDR4-2933"},{"$f":"VLOOKUP(L14,Tabella_prezzi!$A$2:$L$81,3,FALSE)","v":"Kit n. 2 Processori\naggiuntivi"},{"$f":"VLOOKUP(L14,Tabella_prezzi!$A$2:$L$81,4,FALSE)","v":2034.14},null,"L5N02",{"$f":"VLOOKUP(L14,Tabella_prezzi!$A$2:$L$81,6,FALSE)","v":"TS4L5-CPU"}]
[]
{"$rows_left_out":187}
{"sheet":"Tabella_prezzi","index":7,"n_rows":67,"n_cols":18,"rows_kept":67,"cut":false,"hidden":true,"merged":[[23,12,24,12],[25,12,26,12],[38,12,39,12],[4,12,10,12],[15,12,16,12],[17,12,18,12],[19,12,20,12],[21,12,22,12],[38,10,39,10],[4,0,10,0],[4,1,10,1],[4,3,10,3],[4,4,10,4],[4,5,10,5],[4,9,10,9],[38,8,39,8],[38,6,39,6],[17,4,18,4],[4,2,10,2],[19,5,20,5],[21,5,22,5],[15,4,16,4],[17,5,18,5],[19,4,20,4],[15,0,16,0],[15,1,16,1],[15,2,16,2],[15,3,16,3],[21,0,22,0],[21,1,22,1],[21,2,22,2],[21,3,22,3],[19,0,20,0],[19,1,20,1],[17,0,18,0],[17,1,18,1],[17,2,18,2],[17,3,18,3],[19,2,20,2],[19,3,20,3],[25,4,26,4],[25,5,26,5],[15,9,16,9],[17,9,18,9],[19,9,20,9],[21,9,22,9],[23,9,24,9],[25,9,26,9],[15,5,16,5],[23,4,24,4],[23,5,24,5],[21,4,22,4],[23,2,24,2],[25,0,26,0],[25,1,26,1],[25,2,26,2],[25,3,26,3],[23,0,24,0],[23,1,24,1],[23,3,24,3],[38,9,39,9],[38,5,39,5],[38,0,39,0],[38,1,39,1],[38,4,39,4],[38,2,39,2],[38,3,39,3]]}
["N°",null,"Attributo","Valore inserito","N°","Codice Convenzione","Qty:",null,"Description:","Manufacturer Part","Sku Number:","Brand"]
["L5N01",1,"server\nrackable quad-processore (prestazionale)",4022.56,"L5N01","TS4L5-SRV",1,null,"PowerEdge R840 Server","L5N01-ServerR840","210-AMTE","DELL","TS4L6-SRV",null,null,null,"210-321-BCPX","-"]
["L5N01-NVMe",1,"server\nrackable quad-processore (prestazionale)",4022.56,"L5N01","TS4L5-SRV-NVME",1,null,"PowerEdge R840 Server","L5N01-ServerR840-NVME","210-AMTE","DELL","TS4L6-SRV-NVME",null,null,null,"210-321-BCPX","-"]
["L5N01-vSAN",1,"server\nrackable quad-processore (prestazionale)",4022.56,"L5N01","TS4L5-SRV-vSAN",1,null,"PowerEdge R840 Server","L5N01-ServerR840-vSAN","210-AMTE","DELL","TS4L6-SRV-vSAN",null,null,null,"210-321-BCPX","-"]
["L5N02",2,"Kit n. 2 Processori\naggiuntivi",2034.14,"L5N02","TS4L5-CPU",1,"2 x Intel Xeon Gold 6252N, 2.3G, 24C/48T, 10.4GT/s, 35.75M Cache, Turbo, HT (150W) DDR4-2933","2 x Intel Xeon Gold 6252N, 2.3G, 24C/48T, 10.4GT/s, 35.75M Cache, Turbo, HT (150W) DDR4-2933","L5N02-OpzCPU","338-BZSB","DELL","TS4L6-CPU-NVME",null,null,null,"338-BZSB","WX6G7"]
[null,null,null,null,null,null,1,"L Shape Heatsink for 2nd CPU equal to or greater than 180W,PowerEdge R6525/R7525, Customer Install","L Shape Heatsink for 2nd CPU equal to or greater than 180W,PowerEdge R6525/R7525, Customer Install",null,"412-AASW","DELL",null,null,null,null,"412-AASW","4RCGC"]
[null,null,null,null,null,null,1,"PowerEdge R7525 High Performance Fan Customer Kit V3","PowerEdge R7525 High Performance Fan Customer Kit V3",null,"121-BBBI","DELL",null,null,null,null,"121-BBBI","HVVRP"]
[null,null,null,null,null,null,1,"Riser with Two x8(x16 connector) PCIe Gen4 (Slots 4 & 5), Customer Install","Riser with Two x8(x16 connector) PCIe Gen4 (Slots 4 & 5), Customer Install",null,"330-BBTM","DELL",null,null,null,null,"330-BBTM","234T7"]
[null,null,null,null,null,null,1,"Riser 4B, PCIe Gen4 1x16 (x16 connector), Half Length, PowerEdge R7525, CK","Riser 4B, PCIe Gen4 1x16 (x16 connector), Half Length, PowerEdge R7525, CK",null,"330-BBPR","DELL",null,null,null,null,"330-BBPR"]
[null,null,null,null,null,null,1,"Riser 1B, PCIe Gen4 2x8 (x16 connector), Half Length, PowerEdge R7525, CK","Riser 1B, PCIe Gen4 2x8 (x16 connector), Half Length, PowerEdge R7525, CK",null,"330-BBPV","DELL",null,null,null,null,"330-BBPV","R80PP"]
[null,null,null,null,null,null,1,"Riser 2A, PCIe Gen4 2x16 (x16 connector), PowerEdge R7525, CK","Riser 2A, PCIe Gen4 2x16 (x16 connector), PowerEdge R7525, CK",null,"330-BBPO","DELL",null,null,null,null,"330-BBPO"]
["L5N03",3,"OpzRAM32GB",256.64,"L5N03","TS4L5-RAM32",1,"32GB - 2Rx4 DDR4 RDIMM 3200MHz","32GB - 2Rx4 DDR4 RDIMM 3200MHz","L5N03-OpzRAM32GB","AA799087","DELL","TS4L6-RAM32-NVME",null,null,null,"AA79SNP75X1VC/32G","SNP75X1VC/32G"]
["L5N04",4,"OpzRAM64GB",288.45999999999998,"L5N04","TS4L5-RAM64",1,"64GB - 2RX4 DDR4 RDIMM 3200MHz","64GB - 2RX4 DDR4 RDIMM 3200MHz","L5N04-OpzRAM64GB","AA799110","DELL","TS4L6-RAM64-NVME",null,null,null,"AA79SNPP2MYXC/64G","SNPP2MYXC/64G"]
["L5N05",5,"OpzGigabit",27.82,"L5N05","TS4L5-LAN1",1,"Broadcom 5720 DP 1Gb Network Interface Card,Full Height","Broadcom 5720 DP 1Gb Network Interface Card,Full Height","L5N05-OpzGigabit","540-BBGX","DELL","TS4L6-LAN1-NVME",1,2,3,"540-XF9VF","XF9VF"]
["L5N75",5,"OpzGigabit",27.82,"L5N05b","TS4L5-LAN1",1,"Broadcom 5720 DP 1Gb Network Interface Card, Low Profile ","Broadcom 5720 DP 1Gb Network Interface Car, Low Profile ","L5N75-OpzGigabitLP","540-BBHB","DELL","TS4L6-LAN1-L-NVME",4,null,null,"540-W0N4T","W0N4T"]
{"$rows_left_out":52}