{"text_format":"1","workbook":"xlsx","n_sheets":9,"sheets":["Benvenuto","Lotto4_R7525_1","Lotto4_R7525_2","Lotto4_R7525_3","Altre Opzioni","Riepilogo_Ordine","Config","ConfigurationTS4L4","Tabella_prezzi"],"not_rendered":{"charts":0,"images":13,"macros":1,"external_links":1,"defined_names":38,"comments":0,"pivot_tables":0},"unopened":[],"bounds":{"document_bytes":16777216,"sheet_cells":100000,"rows_first":2000,"rows_last":500,"rows_between":2000,"halvings":0,"cell_chars":16384,"cell_head_chars":4096},"cells_cut":0,"cells_raw":0,"read":"whole","date_system":"1900"}

{"sheet":"Benvenuto","index":0,"n_rows":8,"n_cols":17,"rows_kept":8,"cut":false,"hidden":false,"merged":[[2,15,2,16],[4,15,4,16],[6,15,6,16],[2,4,42,13]]}
[]
[]
[null,null,null,null,null,null,null,null,null,null,null,null,null,null,null,"LEGENDA"]
[null,null,null,null,null,null,null,null,null,null,null,null,null,null,null,"Campi Non Editabili","Campi Editabili"]
[]
[null,null,null,null,null,null,null,null,null,null,null,null,null,null,null,"Opzioni 20%","Qtà 20%"]
[]
[null,null,null,null,null,null,null,null,null,null,null,null,null,null,null,"Errore nella Selezione","Verifica Positiva"]
{"$rows_left_out":1}
{"sheet":"Lotto4_R7525_1","index":1,"n_rows":152,"n_cols":32,"rows_kept":152,"cut":false,"hidden":false,"merged":[[1,10,2,10],[3,10,5,10],[3,12,4,12],[5,12,6,12],[9,11,10,11],[74,11,75,11],[42,15,43,15],[94,8,98,8],[103,8,107,8],[85,8,89,8],[151,10,151,13],[152,10,159,13],[76,15,78,16],[77,11,78,11],[85,12,85,13],[125,11,126,11],[125,12,125,15],[128,11,129,11],[131,11,132,11],[134,11,135,11],[91,12,91,13],[141,11,142,11],[112,8,119,8],[125,8,135,8],[94,12,94,13],[103,12,103,13],[77,9,78,9],[134,9,135,9],[125,9,126,9],[128,9,129,9],[131,9,132,9],[9,9,10,9],[15,9,16,9],[18,9,19,9],[39,9,40,9],[60,15,62,15],[18,11,19,11],[39,11,40,11],[39,12,39,15],[42,10,43,10],[60,12,60,13],[15,11,16,11],[141,9,142,9],[144,9,145,9],[82,10,83,13],[122,10,123,13],[138,10,139,13],[100,12,100,13],[144,11,145,11]]}
[]
[null,null,null,null,null,null,null,null,null,null,"Convenzione \nTecnologie Server 4 - Lotto 4",null,{"$f":"IF(W108>1,\"ERRORE NELLA CONFIGURAZIONE\",\"\")","v":""},null,null,{"$f":"IF(Riepilogo_Ordine!K141>Riepilogo_Ordine!G141,\"Superata Quota 20%\",\"\")","v":""},null,null,null,null,null,null,null,null,null,null,null,null,null,"SALVAPDF"]
[null,null,null,null,null,null,null,null,null,null,null,null,null,null,null,"Articoli 20% Totali",null,null,"Check HD 2","Check HDD Nut","Check CPU","Check RAM","Check NVME","Check PCI","Check Win","Check Warr","Check nVME","Check Tot",null,{"$f":"IF(N8>0,1,0)","v":0}]
[null,null,null,null,null,null,null,null,null,null,{"$f":"IF(Z11=\"Nutanix\",\"Selezionando la soluzione Nutanix si accetta la sostituzione del server base con la versione XC comprensivo di HBA355 (Non RAID), BOSS Card e LAN 10 GB su slot OCP\",IF(W15=\"vsan\",\"Selezionando la soluzione vSAN si accetta la sostituzione del controller 745 con il HBA355 (Non RAID), comprensivo di BOSS Card\",\"Selezionare Il server Base e cliccare su 'Compila Configurazione' per inserire le opzioni necessarie e obbligatorie a soddisfare la configurazione selezionata\"))","v":"Selezionare Il server Base e cliccare su 'Compila Configurazione' per inserire le opzioni necessarie e obbligatorie a soddisfare la configurazione selezionata"},null,{"$f":"IF(AB4>1,\"Errori nella Configurazione\",IF(AA4>0,\"Troppi Dischi nVME\",IF(S4>0,\"Troppi Dischi SAS\",IF(U4>0,\"Errore nella Selezione della CPU\",IF(V4>0,\"Errore Nella Selezione della RAM\",IF(W4>0,\"Errore Nella selezione dello Chassis per Dischi nVME\",IF(X4>0,\"Errore nella Selezione Slot PCI\",IF(Y4>0,\"Errore nella Selezione Licenze Windows\",IF(Z4>0,\"Errore Selezione Garanzia o HDD Retention\",IF(T4>0,\"Errore Selezione Dischi\",IF(T6=1,\"Errore Selezione dischi NVMe\",\"\")))))))))))","v":""},"Totale Altre Opzioni",null,{"$f":"Riepilogo_Ordine!K141","v":0},null,null,{"$f":"IF(N44<0,1,0)","v":0},{"$f":"IF(AND(Z11=\"Nutanix\",AF46>1),1,0)","v":0},{"$f":"IF(N22<>\"\",1,0)","v":0},{"$f":"IF(N25<>\"\",1,0)","v":0},{"$f":"IF(M61<>\"\",1,0)","v":0},{"$f":"IF(M86<>\"\",1,0)","v":0},{"$f":"IF(N28<>\"\",1,0)","v":0},{"$f":"IF(N145<>\"\",1,0)","v":0},{"$f":"IF(N63<0,1,0)","v":0},{"$f":"SUM(S4:AA4)+T6","v":0}]
[null,null,null,null,null,null,null,null,null,null,null,null,null,{"$f":"'Altre Opzioni'!L3","v":0},null,"Quota Residua 20 %",null,null,null,"Check NVMe GPU"]
[null,null,null,null,null,null,null,null,null,null,null,null,"Guida alla Convenzione","Totale Configurazione",null,{"$f":"Riepilogo_Ordine!G142","v":0},null,null,null,{"$f":"IF(AND(N64=0,AA11=\"GPUReady\"),1,0)","v":0}]
[null,null,null,null,null,null,null,null,{"$f":"IF(AND(Y11=\"Vsan\",N73=\"\"),\"Utilizzando il controller HBA355 in una soluzione vSAN, per il boot si deve utilizzare la 'BOSS Card'\",IF(AND(Z11=\"Nutanix\",N73=\"\"),\"Utilizzando il controller HBA355 in una soluzione Nutanix, per il boot si deve utilizzare la 'BOSS Card'\",\"\"))","v":""},null,{"$f":"IF(Riepilogo_Ordine!P8>0,\"Compilare i Dati nel Foglio Riepilogo per Stampare in PDF\",\"\")","v":"Compilare i Dati nel Foglio Riepilogo per Stampare in PDF"},null,null,{"$f":"N148+N149","v":0},null,"Totale Ordine\nIva Esclusa",null,null,null,{"$f":"N7+Lotto4_R7525_2!L7","v":0}]
[null,null,null,null,null,null,null,null,null,null,"DELL POWEREDGE R7525",null,"Quantità Server",0,null,{"$f":"Riepilogo_Ordine!K142","v":0}]
{"$rows_left_out":145}
{"sheet":"Lotto4_R7525_2","index":2,"n_rows":152,"n_cols":32,"rows_kept":152,"cut":false,"hidden":false,"merged":[[122,15,124,15],[3,12,4,12],[5,12,6,12],[9,9,10,9],[15,9,16,9],[18,9,19,9],[39,9,40,9],[1,10,2,10],[3,10,5,10],[112,8,119,8],[122,10,123,13],[9,11,10,11],[15,11,16,11],[18,11,19,11],[39,11,40,11],[39,12,39,15],[42,10,43,10],[42,15,43,15],[60,12,60,13],[60,15,62,15],[74,11,75,11],[76,15,78,16],[125,8,135,8],[125,9,126,9],[125,11,126,11],[125,12,125,15],[128,9,129,9],[128,11,129,11],[131,9,132,9],[131,11,132,11],[134,9,135,9],[77,11,78,11],[82,10,83,13],[85,8,89,8],[85,12,85,13],[77,9,78,9],[91,12,91,13],[94,8,98,8],[94,12,94,13],[100,12,100,13],[103,8,107,8],[103,12,103,13],[151,10,151,13],[152,10,159,13],[134,11,135,11],[138,10,139,13],[141,9,142,9],[141,11,142,11],[144,9,145,9],[144,11,145,11]]}
[]
[null,null,null,null,null,null,null,null,null,null,"Convenzione \nTecnologie Server 4 - Lotto 4",null,{"$f":"IF(W108>1,\"ERRORE NELLA CONFIGURAZIONE\",\"\")","v":""},null,null,{"$f":"IF(Riepilogo_Ordine!K141>Riepilogo_Ordine!G141,\"Superata Quota 20%\",\"\")","v":""},null,null,null,null,null,null,null,null,null,null,null,null,null,"SALVAPDF"]
[null,null,null,null,null,null,null,null,null,null,null,null,null,null,null,"Articoli 20% Totali",null,null,"Check HD 2","Check HDD Nut","Check CPU","Check RAM","Check NVME","Check PCI","Check Win","Check Warr","Check nVME","Check Tot",null,{"$f":"IF(N8>0,1,0)","v":0}]
[null,null,null,null,null,null,null,null,null,null,{"$f":"IF(Z11=\"Nutanix\",\"Selezionando la soluzione Nutanix si accetta la sostituzione del server base con la versione XC comprensivo di HBA355 (Non RAID), BOSS Card e LAN 10 GB su slot OCP\",IF(W15=\"vsan\",\"Selezionando la soluzione vSAN si accetta la sostituzione del controller 745 con il HBA355 (Non RAID), comprensivo di BOSS Card\",\"Selezionare Il server Base e cliccare su 'Compila Configurazione' per inserire le opzioni necessarie e obbligatorie a soddisfare la configurazione selezionata\"))","v":"Selezionare Il server Base e cliccare su 'Compila Configurazione' per inserire le opzioni necessarie e obbligatorie a soddisfare la configurazione selezionata"},null,{"$f":"IF(AB4>1,\"Errori nella Configurazione\",IF(AA4>0,\"Troppi Dischi nVME\",IF(S4>0,\"Troppi Dischi SAS\",IF(U4>0,\"Errore nella Selezione della CPU\",IF(V4>0,\"Errore Nella Selezione della RAM\",IF(W4>0,\"Errore Nella selezione dello Chassis per Dischi nVME\",IF(X4>0,\"Errore nella Selezione Slot PCI\",IF(Y4>0,\"Errore nella Selezione Licenze Windows\",IF(Z4>0,\"Errore Selezione Garanzia o HDD Retention\",IF(T4>0,\"Errore Selezione Dischi\",IF(T6=1,\"Errore Selezione dischi NVMe\",\"\")))))))))))","v":""},"Totale Altre Opzioni",null,{"$f":"Riepilogo_Ordine!K141","v":0},null,null,{"$f":"IF(N44<0,1,0)","v":0},{"$f":"IF(AND(Z11=\"Nutanix\",AF46>1),1,0)","v":0},{"$f":"IF(N22<>\"\",1,0)","v":0},{"$f":"IF(N25<>\"\",1,0)","v":0},{"$f":"IF(M61<>\"\",1,0)","v":0},{"$f":"IF(M86<>\"\",1,0)","v":0},{"$f":"IF(N28<>\"\",1,0)","v":0},{"$f":"IF(N145<>\"\",1,0)","v":0},{"$f":"IF(N63<0,1,0)","v":0},{"$f":"SUM(S4:AA4)+T6","v":0}]
[null,null,null,null,null,null,null,null,null,null,null,null,null,{"$f":"'Altre Opzioni'!L3","v":0},null,"Quota Residua 20 %",null,null,null,"Check NVMe GPU"]
[null,null,null,null,null,null,null,null,null,null,null,null,"Guida alla Convenzione","Totale Configurazione",null,{"$f":"Riepilogo_Ordine!G142","v":0},null,null,null,{"$f":"IF(AND(N64=0,AA11=\"GPUReady\"),1,0)","v":0}]
[null,null,null,null,null,null,null,null,{"$f":"IF(AND(Y11=\"Vsan\",N73=\"\"),\"Utilizzando il controller HBA355 in una soluzione vSAN, per il boot si deve utilizzare la 'BOSS Card'\",IF(AND(Z11=\"Nutanix\",N73=\"\"),\"Utilizzando il controller HBA355 in una soluzione Nutanix, per il boot si deve utilizzare la 'BOSS Card'\",\"\"))","v":""},null,{"$f":"IF(Riepilogo_Ordine!P8>0,\"Compilare i Dati nel Foglio Riepilogo per Stampare in PDF\",\"\")","v":"Compilare i Dati nel Foglio Riepilogo per Stampare in PDF"},null,null,{"$f":"N148+N149","v":0},null,"Totale Ordine\nIva Esclusa",null,null,null,{"$f":"N7+Lotto4_R7525_2!L7","v":0}]
[null,null,null,null,null,null,null,null,null,null,"DELL POWEREDGE R7525",null,"Quantità Server",0,null,{"$f":"Riepilogo_Ordine!K142","v":0}]
{"$rows_left_out":145}
{"sheet":"Lotto4_R7525_3","index":3,"n_rows":152,"n_cols":32,"rows_kept":152,"cut":false,"hidden":false,"merged":[[3,12,4,12],[5,12,6,12],[9,9,10,9],[15,9,16,9],[18,9,19,9],[39,9,40,9],[1,10,2,10],[3,10,5,10],[112,8,119,8],[122,10,123,13],[9,11,10,11],[15,11,16,11],[18,11,19,11],[39,11,40,11],[39,12,39,15],[42,10,43,10],[42,15,43,15],[60,12,60,13],[60,15,62,15],[74,11,75,11],[76,15,78,16],[125,8,135,8],[125,9,126,9],[125,11,126,11],[125,12,125,15],[128,9,129,9],[128,11,129,11],[131,9,132,9],[131,11,132,11],[134,9,135,9],[77,11,78,11],[82,10,83,13],[85,8,89,8],[85,12,85,13],[77,9,78,9],[91,12,91,13],[94,8,98,8],[94,12,94,13],[100,12,100,13],[103,8,107,8],[103,12,103,13],[151,10,151,13],[152,10,158,13],[134,11,135,11],[138,10,139,13],[141,9,142,9],[141,11,142,11],[144,9,145,9],[144,11,145,11]]}
[]
[null,null,null,null,null,null,null,null,null,null,"Convenzione \nTecnologie Server 4 - Lotto 4",null,{"$f":"IF(W108>1,\"ERRORE NELLA CONFIGURAZIONE\",\"\")","v":""},null,null,{"$f":"IF(Riepilogo_Ordine!K141>Riepilogo_Ordine!G141,\"Superata Quota 20%\",\"\")","v":""},null,null,null,null,null,null,null,null,null,null,null,null,null,"SALVAPDF"]
[null,null,null,null,null,null,null,null,null,null,null,null,null,null,null,"Articoli 20% Totali",null,null,"Check HD 2","Check HDD Nut","Check CPU","Check RAM","Check NVME","Check PCI","Check Win","Check Warr","Check nVME","Check Tot",null,{"$f":"IF(N8>0,1,0)","v":0}]
[null,null,null,null,null,null,null,null,null,null,{"$f":"IF(Z11=\"Nutanix\",\"Selezionando la soluzione Nutanix si accetta la sostituzione del server base con la versione XC comprensivo di HBA355 (Non RAID), BOSS Card e LAN 10 GB su slot OCP\",IF(W15=\"vsan\",\"Selezionando la soluzione vSAN si accetta la sostituzione del controller 745 con il HBA355 (Non RAID), comprensivo di BOSS Card\",\"Selezionare Il server Base e cliccare su 'Compila Configurazione' per inserire le opzioni necessarie e obbligatorie a soddisfare la configurazione selezionata\"))","v":"Selezionare Il server Base e cliccare su 'Compila Configurazione' per inserire le opzioni necessarie e obbligatorie a soddisfare la configurazione selezionata"},null,{"$f":"IF(AB4>1,\"Errori nella Configurazione\",IF(AA4>0,\"Troppi Dischi nVME\",IF(S4>0,\"Troppi Dischi SAS\",IF(U4>0,\"Errore nella Selezione della CPU\",IF(V4>0,\"Errore Nella Selezione della RAM\",IF(W4>0,\"Errore Nella selezione dello Chassis per Dischi nVME\",IF(X4>0,\"Errore nella Selezione Slot PCI\",IF(Y4>0,\"Errore nella Selezione Licenze Windows\",IF(Z4>0,\"Errore Selezione Garanzia o HDD Retention\",IF(T4>0,\"Errore Selezione Dischi\",IF(T6=1,\"Errore Selezione dischi NVMe\",\"\")))))))))))","v":""},"Totale Altre Opzioni",null,{"$f":"Riepilogo_Ordine!K141","v":0},null,null,{"$f":"IF(N44<0,1,0)","v":0},{"$f":"IF(AND(Z11=\"Nutanix\",AF46>1),1,0)","v":0},{"$f":"IF(N22<>\"\",1,0)","v":0},{"$f":"IF(N25<>\"\",1,0)","v":0},{"$f":"IF(M61<>\"\",1,0)","v":0},{"$f":"IF(M86<>\"\",1,0)","v":0},{"$f":"IF(N28<>\"\",1,0)","v":0},{"$f":"IF(N145<>\"\",1,0)","v":0},{"$f":"IF(N63<0,1,0)","v":0},{"$f":"SUM(S4:AA4)+T6","v":0}]
[null,null,null,null,null,null,null,null,null,null,null,null,null,{"$f":"'Altre Opzioni'!L3","v":0},null,"Quota Residua 20 %",null,null,null,"Check NVMe GPU"]
[null,null,null,null,null,null,null,null,null,null,null,null,"Guida alla Convenzione","Totale Configurazione",null,{"$f":"Riepilogo_Ordine!G142","v":0},null,null,null,{"$f":"IF(AND(N64=0,AA11=\"GPUReady\"),1,0)","v":0}]
[null,null,null,null,null,null,null,null,{"$f":"IF(AND(Y11=\"Vsan\",N73=\"\"),\"Utilizzando il controller HBA355 in una soluzione vSAN, per il boot si deve utilizzare la 'BOSS Card'\",IF(AND(Z11=\"Nutanix\",N73=\"\"),\"Utilizzando il controller HBA355 in una soluzione Nutanix, per il boot si deve utilizzare la 'BOSS Card'\",\"\"))","v":""},null,{"$f":"IF(Riepilogo_Ordine!P8>0,\"Compilare i Dati nel Foglio Riepilogo per Stampare in PDF\",\"\")","v":"Compilare i Dati nel Foglio Riepilogo per Stampare in PDF"},null,null,{"$f":"N148+N149","v":0},null,"Totale Ordine\nIva Esclusa",null,null,null,{"$f":"N7+Lotto4_R7525_2!L7","v":0}]
[null,null,null,null,null,null,null,null,null,null,"DELL POWEREDGE R7525",null,"Quantità Server",0,null,{"$f":"Riepilogo_Ordine!K142","v":0}]
{"$rows_left_out":145}
{"sheet":"Altre Opzioni","index":4,"n_rows":34,"n_cols":30,"rows_kept":34,"cut":false,"hidden":false,"merged":[[1,11,1,13],[5,9,6,9],[8,9,9,9],[11,9,12,9],[14,9,15,9],[28,9,29,9],[32,9,33,9],[21,9,22,9],[24,9,25,9],[17,9,18,9]]}
[]
[null,null,null,null,null,null,null,null,"Altre Opzioni",null,null,"Totale altre opzioni"]
[null,null,null,null,null,null,null,null,null,null,null,{"$f":"SUM(P6:Q34)","v":0},null,null,null,null,null,null,null,null,null,null,null,null,null,null,null,null,null,{"$f":"IF(L3<>0,1,0)","v":0}]
[]
[]
[null,null,null,null,null,null,null,null,"OpzRack DELL"]
[null,null,null,null,null,null,null,null,{"$f":"Tabella_prezzi!H74","v":"Rack 42RU DellEmc"},null,{"$f":"VLOOKUP(I7,TS4L4_20X100,13,FALSE)","v":"TS4L4-RACK-D"},0,null,{"$f":"P7+Q7","v":0},null,{"$f":"VLOOKUP($I7,TS4L4_20X100,10,FALSE)*L7","v":0},{"$f":"VLOOKUP($I7,TS4L4_20X100,11,FALSE)*L7","v":0},{"$f":"VLOOKUP($I7,TS4L4_20X100,12,FALSE)","v":"L4N116"}]
[]
{"$rows_left_out":27}
{"sheet":"Riepilogo_Ordine","index":5,"n_rows":144,"n_cols":30,"rows_kept":144,"cut":false,"hidden":false,"merged":[[4,10,5,10],[1,5,1,7],[1,8,3,10],[2,5,2,7],[3,5,3,7],[4,5,4,7],[4,8,4,9],[5,5,5,7],[5,8,5,9],[6,5,6,6],[6,7,6,8],[6,9,6,10],[7,5,7,6],[7,7,7,8],[7,9,7,10],[8,5,8,6],[8,7,8,8],[8,9,8,10],[9,5,9,6],[9,7,9,8],[9,9,9,10],[140,8,140,9],[141,8,141,9],[142,5,142,6],[142,8,142,9],[10,5,10,6],[10,8,10,10],[11,5,11,10],[91,5,91,10],[92,5,92,10],[139,5,139,6],[139,8,139,9]]}
[]
[null,null,null,null,null,"Convenzione \nTecnologie Server 4 - Lotto 4",null,null,{"$f":"IF(P8>0,\"Compilare i Dati Necessari (*) all'Ordine o controllare le Configurazioni per Stampare in PDF\",\"Dati Completi\")","v":"Compilare i Dati Necessari (*) all'Ordine o controllare le Configurazioni per Stampare in PDF"},null,null,null,null,null,null,null,null,null,null,null,null,null,null,null,"SI"]
[null,null,null,null,null,"Riepilogo Ordine Consip N° (*)",null,null,null,null,null,null,null,null,null,null,null,{"$f":"IF(Lotto4_R7525_1!N8>0,1,0)","v":0},{"$f":"IF(Lotto4_R7525_2!N8>0,1,0)","v":0},{"$f":"IF(Lotto4_R7525_3!N8>0,1,0)","v":0},null,{"$f":"SUM(R3:T3)","v":0},null,null,"SI",null,null,null,null,1]
[null,null,null,null,null,null,null,null,null,null,null,null,null,null,null,null,null,null,null,null,null,null,null,null,"SI"]
[null,null,null,null,null,"Ente Ordinante (*)",null,null,"Data Ordine  (*)",null,null,null,null,null,null,"Ordine","Ente","data","Ref Cons","mail","tel","Ref Inst","mail","Tel","SI"]
[null,null,null,null,null,null,null,null,null,null,null,null,null,null,null,{"$f":"IF(F4>0,0,1)","v":1},{"$f":"IF(F6>0,0,1)","v":1},{"$f":"IF(I6>0,0,1)","v":1},{"$f":"IF(F8>0,0,1)","v":1},{"$f":"IF(H8>0,0,1)","v":1},{"$f":"IF(J8>0,0,1)","v":1},{"$f":"IF(F10>0,0,1)","v":1},{"$f":"IF(H10>0,0,1)","v":1},{"$f":"IF(J10>0,0,1)","v":1},"SI"]
[null,null,null,null,null,"Referente Consegna  (*)",null,"Mail  (*)",null,"Tel  (*)",null,null,null,null,null,null,null,null,null,null,null,null,null,0.2,"SI"]
[null,null,null,null,null,null,null,null,null,null,null,null,null,null,null,{"$f":"SUM(P6:X6)+SUM(R10:T10)+X8","v":9},null,{"$f":"IF(F11<>\"\",1,0)","v":0},{"$f":"IF(H11<>\"\",1,0)","v":0},{"$f":"IF(I11<>\"\",1,0)","v":0},null,{"$f":"SUM(R8:T8)","v":0},null,{"$f":"IF(F92<>\"\",1,0)","v":0},"SI"]
{"$rows_left_out":137}
{"sheet":"Config","index":6,"n_rows":154,"n_cols":18,"rows_kept":154,"cut":false,"hidden":true,"merged":[[1,3,1,10],[3,3,3,4],[4,3,4,4],[6,3,6,4],[5,3,5,4],[7,9,7,10],[10,9,10,10],[5,6,5,7],[6,6,6,7],[10,3,10,4],[9,3,9,4],[7,3,7,4],[8,3,8,4],[7,6,7,7],[8,6,8,7],[9,6,9,7],[10,6,10,7],[8,9,8,10]]}
[]
[null,null,null,"Informazioni di Servizio per processamento Ordine",null,null,null,null,null,null,null,null,null,null,null,null,null,"SI"]
[null,null,null,null,null,null,null,null,null,null,null,null,null,null,null,null,null,"SI"]
[null,null,null,{"$f":"Riepilogo_Ordine!F3","v":"Riepilogo Ordine Consip N° (*)"},null,null,null,null,null,null,null,null,null,null,null,null,null,"SI"]
[null,null,null,{"$f":"Riepilogo_Ordine!F4","v":0},null,null,null,null,null,null,null,null,null,null,null,null,null,"SI"]
[null,null,null,{"$f":"Riepilogo_Ordine!F5","v":"Ente Ordinante (*)"},null,null,{"$f":"Riepilogo_Ordine!I5","v":"Data Ordine  (*)"},null,null,null,null,null,null,null,null,null,null,"SI"]
[null,null,null,{"$f":"Riepilogo_Ordine!F6","v":0},null,null,{"$f":"Riepilogo_Ordine!I6","v":"00:00:00"},null,null,null,null,null,null,null,null,null,null,"SI"]
[null,null,null,{"$f":"Riepilogo_Ordine!F7","v":"Referente Consegna  (*)"},null,null,{"$f":"Riepilogo_Ordine!H7","v":"Mail  (*)"},null,null,{"$f":"Riepilogo_Ordine!J7","v":"Tel  (*)"},null,null,null,null,null,null,null,"SI"]
{"$rows_left_out":147}
{"sheet":"ConfigurationTS4L4","index":7,"n_rows":236,"n_cols":30,"rows_kept":236,"cut":false,"hidden":true,"merged":[[18,0,18,12]]}
[]
[null,"Module Name","Option ID","Option Name","Option List Price","SKUs","Qty","SKU Customer Kit","Attributo","Valore inserito",null,"N°","Codice Convenzione"]
["PowerEdge R7525 Server (General Purpose)","Chassis with Up to 16 x 2.5 Hard Drives for 1CPU Configuration","Chassis with Up to 16 x 2.5 Hard Drives for 2CPU Configuration",{"$f":"VLOOKUP(L3,Tabella_prezzi!$A$2:$L$73,8,FALSE)","v":"PowerEdge R7525 Server"},null,null,null,{"$f":"VLOOKUP(L3,Tabella_prezzi!$A$2:$L$73,9,FALSE)","v":"PowerEdge R7525 Server"},"TS4L4-Opz1CPU",{"$f":"VLOOKUP(L3,Tabella_prezzi!$A$2:$L$73,4,FALSE)","v":3637.17},"TS4L4-Opz2CPU","L4N01",{"$f":"VLOOKUP(L3,Tabella_prezzi!$A$2:$L$73,6,FALSE)","v":"TS4L4-SRV"}]
["PowerEdge R7525 Server (nVME)","Chassis with Up to 16X 2.5 SAS/SATA + 8X 2.5 NVME for 2CPU Configuration","Chassis with Up to 16X 2.5 SAS/SATA + 8X 2.5 NVME for 2CPU Configuration",{"$f":"VLOOKUP(L4,Tabella_prezzi!$A$2:$L$73,8,FALSE)","v":"PowerEdge R7525 Server NVMe"},null,null,null,{"$f":"VLOOKUP(L4,Tabella_prezzi!$A$2:$L$73,9,FALSE)","v":"PowerEdge R7525 Server NVMe"},"TS4L4-Opz2CPU_NVMe",{"$f":"VLOOKUP(L4,Tabella_prezzi!$A$2:$L$73,4,FALSE)","v":3782.6568000000002},"TS4L4-Opz2CPU_NVMe","L4N01-NVME","TS4L4-SRV-NVME"]
["PowerEdge R7525 Server (vSAN Ready 512 GB RAM)","Chassis with Up to 16X 2.5 SAS/SATA + 8X 2.5 NVME for 2CPU Configuration","Chassis with Up to 16X 2.5 SAS/SATA + 8X 2.5 NVME for 2CPU Configuration",{"$f":"VLOOKUP(L5,Tabella_prezzi!$A$2:$L$73,8,FALSE)","v":"PowerEdge R7525 Server NVMe"},null,null,1,{"$f":"VLOOKUP(L5,Tabella_prezzi!$A$2:$L$73,9,FALSE)","v":"PowerEdge R7525 Server NVMe"},"TS4L4-Opz2CPU_vSAN",{"$f":"VLOOKUP(L5,Tabella_prezzi!$A$2:$L$73,4,FALSE)","v":3782.6568000000002},"TS4L4-Opz2CPU_vSAN","L4N01-NVME","TS4L4-SRV-NVME"]
["PowerEdge R7525 Server (vSAN Ready 1 TB RAM)","Chassis with Up to 16X 2.5 SAS/SATA + 8X 2.5 NVME for 2CPU Configuration","Chassis with Up to 16X 2.5 SAS/SATA + 8X 2.5 NVME for 2CPU Configuration",{"$f":"VLOOKUP(L6,Tabella_prezzi!$A$2:$L$73,8,FALSE)","v":"PowerEdge R7525 Server NVMe"},null,null,1,{"$f":"VLOOKUP(L6,Tabella_prezzi!$A$2:$L$73,9,FALSE)","v":"PowerEdge R7525 Server NVMe"},"TS4L4-Opz2CPU_vSAN",{"$f":"VLOOKUP(L6,Tabella_prezzi!$A$2:$L$73,4,FALSE)","v":3782.6568000000002},"TS4L4-Opz2CPU_vSAN","L4N01-NVME","TS4L4-SRV-NVME"]
["PowerEdge R7525 Server (vSAN Ready 2 TB RAM)","Chassis with Up to 16X 2.5 SAS/SATA + 8X 2.5 NVME for 2CPU Configuration","Chassis with Up to 16X 2.5 SAS/SATA + 8X 2.5 NVME for 2CPU Configuration",{"$f":"VLOOKUP(L7,Tabella_prezzi!$A$2:$L$73,8,FALSE)","v":"PowerEdge R7525 Server NVMe"},null,null,1,{"$f":"VLOOKUP(L7,Tabella_prezzi!$A$2:$L$73,9,FALSE)","v":"PowerEdge R7525 Server NVMe"},"TS4L4-Opz2CPU_vSAN",{"$f":"VLOOKUP(L7,Tabella_prezzi!$A$2:$L$73,4,FALSE)","v":3782.6568000000002},"TS4L4-Opz2CPU_vSAN","L4N01-NVME","TS4L4-SRV-NVME"]
["PowerEdge R7525 Server (Nutanix Ready)","Chassis with Up to 16X 2.5 SAS/SATA + 8X 2.5 NVME for 2CPU Configuration","Chassis with Up to 16X 2.5 SAS/SATA + 8X 2.5 NVME for 2CPU Configuration",{"$f":"VLOOKUP(L8,Tabella_prezzi!$A$2:$L$73,8,FALSE)","v":"PowerEdge R7525 Server NVMe"},null,null,1,{"$f":"VLOOKUP(L8,Tabella_prezzi!$A$2:$L$73,9,FALSE)","v":"PowerEdge R7525 Server NVMe"},{"$f":"VLOOKUP(L8,Tabella_prezzi!$A$2:$L$73,3,FALSE)","v":"Server rackable bi-processore prest."},{"$f":"VLOOKUP(L8,Tabella_prezzi!$A$2:$L$73,4,FALSE)","v":3782.6568000000002},"TS4L4-Opz2CPU_NUT","L4N01-NVME","TS4L4-SRV-NVME"]
{"$rows_left_out":229}
{"sheet":"Tabella_prezzi","index":8,"n_rows":87,"n_cols":18,"rows_kept":87,"cut":false,"hidden":true,"merged":[[26,0,27,0],[24,0,25,0],[5,0,11,0],[16,0,17,0],[22,0,23,0],[20,0,21,0],[18,0,19,0]]}
["N°",null,"Attributo","Valore inserito","N°","Codice Convenzione","Qty:",null,"Description:","Manufacturer Part","Sku Number:","Brand"]
["L4N01",1,"Server rackable bi-processore prest.",3637.17,"L4N01","TS4L4-SRV",1,"PowerEdge R7525 Server","PowerEdge R7525 Server","L4N01-ServerR7525","210-AUVQ","DELL",null,null,null,null,"210-321-BCPX","-"]
["L4N01-NVME",1,"Server rackable bi-processore prest.",{"$f":"D2+(D2*4%)","v":3782.6568000000002},"L4N01-NVME","TS4L4-SRV-NVMe",1,"PowerEdge R7525 Server NVMe","PowerEdge R7525 Server NVMe","L4N01-ServerR7525-NVMe","210-AUVQ","DELL",null,null,null,null,"210-321-BCPX","-"]
["L4N01-NVME",1,"Server rackable bi-processore prest.",{"$f":"D2+(D2*4%)","v":3782.6568000000002},"L4N01-vSAN","TS4L4-SRV-vSAN",1,"PowerEdge R7525 Server vSAN","PowerEdge R7525 Server vSAN NVMe","L4N01-ServerR7525-vSAN","210-AUVQ","DELL",null,null,null,null,"210-321-BCPX","-"]
["L4N01-NVME",1,"Server rackable bi-processore prest.",{"$f":"D2+(D2*4%)","v":3782.6568000000002},"L4N01-NUT","TS4L4-SRV-NUT",1,"PowerEdge R7525 Server Nutanix","PowerEdge R7525 Server Nutanix NVMe","L4N01-ServerR7525-NUT","210-AUVQ","DELL",null,null,null,null,"210-321-BCPX","-"]
["L4N02",2,"Kit n. 1 Processore aggiuntivo",858.53,"L4N02","TS4L4-CPU",1,"AMD 7413 2.65GHz,24C/48T,128M,180W,3200","AMD 7413 2.65GHz,24C/48T,128M,180W,3200","L4N02-OpzCPU","338-BZSB","DELL",{"$f":"CONCATENATE(F6,\"-NVME\")","v":"TS4L4-CPU-NVME"},null,null,null,"338-BZSB","WX6G7"]
[null,null,null,null,null,null,1,"L Shape Heatsink for 2nd CPU equal to or greater than 180W,PowerEdge R6525/R7525, Customer Install","L Shape Heatsink for 2nd CPU equal to or greater than 180W,PowerEdge R6525/R7525, Customer Install",null,"412-AASW","DELL",null,null,null,null,"412-AASW","4RCGC"]
[null,null,null,null,null,null,1,"PowerEdge R7525 High Performance Fan Customer Kit V3","PowerEdge R7525 High Performance Fan Customer Kit V3",null,"121-BBBI","DELL",null,null,null,null,"121-BBBI","HVVRP"]
{"$rows_left_out":79}