{"text_format":"1","workbook":"xlsx","n_sheets":8,"sheets":["Benvenuto","SR650_Iper_Convergenza","Lotto3_SR650_1","Lotto3_SR650_2","Altre_Opzioni","Riepilogo_Ordine","ConfigurationTS4L3","Tabella_prezzi"],"not_rendered":{"charts":0,"images":12,"macros":1,"external_links":1,"defined_names":65,"comments":0,"pivot_tables":0},"unopened":[],"bounds":{"document_bytes":16777216,"sheet_cells":100000,"rows_first":2000,"rows_last":500,"rows_between":2000,"halvings":0,"cell_chars":16384,"cell_head_chars":4096},"cells_cut":0,"cells_raw":0,"read":"whole","date_system":"1900"}

{"sheet":"Benvenuto","index":0,"n_rows":8,"n_cols":17,"rows_kept":8,"cut":false,"hidden":false,"merged":[[2,4,42,13],[2,15,2,16],[4,15,4,16],[6,15,6,16]]}
[]
[]
[null,null,null,null,null,null,null,null,null,null,null,null,null,null,null,"LEGENDA"]
[null,null,null,null,null,null,null,null,null,null,null,null,null,null,null,"Campi Non Editabili","Campi Editabili"]
[]
[null,null,null,null,null,null,null,null,null,null,null,null,null,null,null,"Opzioni 20%","Qtà 20%"]
[]
[null,null,null,null,null,null,null,null,null,null,null,null,null,null,null,"Errore nella Selezione","Verifica Positiva"]

{"sheet":"SR650_Iper_Convergenza","index":1,"n_rows":123,"n_cols":30,"rows_kept":123,"cut":false,"hidden":false,"merged":[[112,6,113,6],[115,6,116,6],[122,5,122,8],[123,5,134,8],[80,6,81,6],[82,10,84,11],[83,6,84,6],[88,7,88,8],[94,4,95,4],[94,7,94,8],[35,6,36,6],[35,7,35,10],[38,6,39,6],[38,7,38,10],[41,5,42,5],[41,10,42,10],[18,6,19,6],[1,5,2,5],[3,7,4,7],[5,7,6,7],[9,6,10,6],[15,6,16,6],[3,5,5,5]]}
[]
[null,null,null,null,null,"Convenzione \nTecnologie Server 4 - Lotto 3",null,{"$f":"IF(R111>1,\"ERRORE NELLA CONFIGURAZIONE\",\"\")","v":""},null,null,{"$f":"IF(Riepilogo_Ordine!K98>Riepilogo_Ordine!G98,\"Superata Quota 20%\",\"\")","v":""},null,null,null,null,null,null,null,null,null,null,null,null,null,null,null,null,null,null,"SalvaPDF"]
[null,null,null,null,null,null,null,null,null,null,"Articoli 20% Totali",null,null,null,null,"Check CPU","Check RAM","Check Dischi","Check PCI","Check Win","Check Gar","Check Tot",null,null,null,null,null,null,null,{"$f":"IF(I8>0,1,0)","v":0}]
[null,null,null,null,null,"In questo foglio sono disponibili le configurazioni Iper Convergenti per le macchine ThinkAgile HX e VX, selezionando queste configurazioni si accetta la sostituzione della macchina base con la relativa versione HX o VX",null,{"$f":"IF(V4<>0,\"Cliccare su 'Compila Configurazione'\",\"\")","v":""},"Totale Altre Opzioni",null,{"$f":"Riepilogo_Ordine!K98","v":0},null,null,null,null,{"$f":"IF(I22<>\"\",1,0)","v":0},{"$f":"IF(I25<>\"\",1,0)","v":0},{"$f":"IF(OR(I44<>\"\",I50<>\"\",I52<>\"\",I54<>\"\"),1,0)","v":0},{"$f":"IF(I89<>\"\",1,0)","v":0},{"$f":"IF(I28<>\"\",1,0)","v":0},{"$f":"IF(I116<>\"\",1,0)","v":0},{"$f":"SUM(P4:U4)","v":0}]
[null,null,null,null,null,null,null,null,{"$f":"Altre_Opzioni!H10","v":0},null,"Quota Residua 20 %"]
[null,null,null,null,null,null,null,"Guida alla Convenzione","Totale Configurazione",null,{"$f":"Riepilogo_Ordine!G99","v":0}]
[null,null,null,null,null,{"$f":"IF(Riepilogo_Ordine!P8>0,\"Compilare i Dati nel Foglio Riepilogo per Stampare in PDF\",\"\")","v":"Compilare i Dati nel Foglio Riepilogo per Stampare in PDF"},null,null,{"$f":"IF(H4<>\"\",0,I119+I120)","v":0},null,"Totale Ordine\nIva Esclusa",null,null,null,null,{"$f":"IF(F11=ConfigurationTS4L3!A15,\"NUT1\",IF(F11=ConfigurationTS4L3!A16,\"NUT2\",IF(F11=ConfigurationTS4L3!A17,\"VSAN1\",IF(F11=ConfigurationTS4L3!A18,\"VSAN2\",FALSE))))","v":"NUT1"}]
[null,null,null,null,null,"LENOVO THINKAGILE \nHX/VX",null,"Quantità Server",0,null,{"$f":"Riepilogo_Ordine!K99","v":0}]
[]
[null,null,null,null,null,"Base",null,null,null,null,null,null,null,null,null,null,null,null,"Lenovo ThinkSystem SR650 V2 Server"]
{"$rows_left_out":114}
{"sheet":"Lotto3_SR650_1","index":2,"n_rows":123,"n_cols":30,"rows_kept":123,"cut":false,"hidden":false,"merged":[[1,5,2,5],[122,5,122,8],[123,5,134,8],[41,5,42,5],[9,6,10,6],[115,6,116,6],[83,6,84,6],[80,6,81,6],[35,7,35,10],[15,6,16,6],[18,6,19,6],[35,6,36,6],[82,10,84,11],[112,6,113,6],[41,10,42,10],[38,6,39,6],[38,7,38,10],[94,4,95,4],[94,7,94,8],[3,7,4,7],[88,7,88,8],[5,7,6,7]]}
[]
[null,null,null,null,null,"Convenzione \nTecnologie Server 4 - Lotto 3",null,{"$f":"IF(R111>1,\"ERRORE NELLA CONFIGURAZIONE\",\"\")","v":""},null,null,{"$f":"IF(Riepilogo_Ordine!K98>Riepilogo_Ordine!G98,\"Superata Quota 20%\",\"\")","v":""},null,null,null,null,null,null,null,null,null,null,null,null,null,null,null,null,null,null,"SalvaPDF"]
[null,null,null,null,null,null,null,null,null,null,"Articoli 20% Totali",null,null,null,null,"Check CPU","Check RAM","Check Dischi","Check PCI","Check Win","Check Gar","Check Tot",null,null,null,null,null,null,null,{"$f":"IF(I8>0,1,0)","v":0}]
[null,null,null,null,null,null,null,{"$f":"IF(V4>1,\"Errori nella Configurazione\",IF(P4>0,\"Errore nella Selezione della CPU\",IF(Q4>0,\"Errore Nella Selezione della RAM\",IF(R4>0,\"Errore Nella selezione dei Dischi\",IF(S4>0,\"Errore nella Selezione Slot PCI\",IF(T4>0,\"Errore nella Selezione Licenze Windows\",IF(U4>0,\"Errore nella Selezione Estensione di Garanzia\",\"\")))))))","v":""},"Totale Altre Opzioni",null,{"$f":"Riepilogo_Ordine!K98","v":0},null,null,null,null,{"$f":"IF(I22<>\"\",1,0)","v":0},{"$f":"IF(I25<>\"\",1,0)","v":0},{"$f":"IF(K42<>\"\",1,0)","v":0},{"$f":"IF(I89<>\"\",1,0)","v":0},{"$f":"IF(I27<>\"\",1,0)","v":0},{"$f":"IF(I116<>\"\",1,0)","v":0},{"$f":"SUM(P4:U4)","v":0}]
[null,null,null,null,null,null,null,null,{"$f":"Altre_Opzioni!H10","v":0},null,"Quota Residua 20 %"]
[null,null,null,null,null,null,null,"Guida alla Convenzione","Totale Configurazione",null,{"$f":"Riepilogo_Ordine!G99","v":0}]
[null,null,null,null,null,{"$f":"IF(Riepilogo_Ordine!P8>0,\"Compilare i Dati nel Foglio Riepilogo per Stampare in PDF\",\"\")","v":"Compilare i Dati nel Foglio Riepilogo per Stampare in PDF"},null,null,{"$f":"IF(H4<>\"\",0,I119+I120)","v":0},null,"Totale Ordine\nIva Esclusa"]
[null,null,null,null,null,"LENOVO THINKSYSTEM \nSR650 V2",null,"Quantità Server",0,null,{"$f":"Riepilogo_Ordine!K99","v":0}]
[]
[null,null,null,null,null,"Base",null,null,null,null,null,null,null,null,null,null,null,null,"Lenovo ThinkSystem SR650 V2 Server"]
{"$rows_left_out":114}
{"sheet":"Lotto3_SR650_2","index":3,"n_rows":123,"n_cols":30,"rows_kept":123,"cut":false,"hidden":false,"merged":[[112,6,113,6],[115,6,116,6],[122,5,122,8],[123,5,134,8],[80,6,81,6],[82,10,84,11],[83,6,84,6],[88,7,88,8],[94,4,95,4],[94,7,94,8],[35,6,36,6],[35,7,35,10],[38,6,39,6],[38,7,38,10],[41,5,42,5],[41,10,42,10],[18,6,19,6],[1,5,2,5],[3,7,4,7],[5,7,6,7],[9,6,10,6],[15,6,16,6]]}
[]
[null,null,null,null,null,"Convenzione \nTecnologie Server 4 - Lotto 3",null,{"$f":"IF(R111>1,\"ERRORE NELLA CONFIGURAZIONE\",\"\")","v":""},null,null,{"$f":"IF(Riepilogo_Ordine!K98>Riepilogo_Ordine!G98,\"Superata Quota 20%\",\"\")","v":""},null,null,null,null,null,null,null,null,null,null,null,null,null,null,null,null,null,null,"SalvaPDF"]
[null,null,null,null,null,null,null,null,null,null,"Articoli 20% Totali",null,null,null,null,"Check CPU","Check RAM","Check Dischi","Check PCI","Check Win","Check Gar","Check Tot",null,null,null,null,null,null,null,{"$f":"IF(I8>0,1,0)","v":0}]
[null,null,null,null,null,null,null,{"$f":"IF(V4>1,\"Errori nella Configurazione\",IF(P4>0,\"Errore nella Selezione della CPU\",IF(Q4>0,\"Errore Nella Selezione della RAM\",IF(R4>0,\"Errore Nella selezione dei Dischi\",IF(S4>0,\"Errore nella Selezione Slot PCI\",IF(T4>0,\"Errore nella Selezione Licenze Windows\",IF(U4>0,\"Errore nella Selezione Estensione di Garanzia\",\"\")))))))","v":""},"Totale Altre Opzioni",null,{"$f":"Riepilogo_Ordine!K98","v":0},null,null,null,null,{"$f":"IF(I22<>\"\",1,0)","v":0},{"$f":"IF(I25<>\"\",1,0)","v":0},{"$f":"IF(K42<>\"\",1,0)","v":0},{"$f":"IF(I89<>\"\",1,0)","v":0},{"$f":"IF(I28<>\"\",1,0)","v":0},{"$f":"IF(I116<>\"\",1,0)","v":0},{"$f":"SUM(P4:U4)","v":0}]
[null,null,null,null,null,null,null,null,{"$f":"Altre_Opzioni!H10","v":0},null,"Quota Residua 20 %"]
[null,null,null,null,null,null,null,"Guida alla Convenzione","Totale Configurazione",null,{"$f":"Riepilogo_Ordine!G99","v":0}]
[null,null,null,null,null,{"$f":"IF(Riepilogo_Ordine!P8>0,\"Compilare i Dati nel Foglio Riepilogo per Stampare in PDF\",\"\")","v":"Compilare i Dati nel Foglio Riepilogo per Stampare in PDF"},null,null,{"$f":"I119+I120","v":0},null,"Totale Ordine\nIva Esclusa"]
[null,null,null,null,null,"LENOVO THINKSYSTEM \nSR650 V2",null,"Quantità Server",0,null,{"$f":"Riepilogo_Ordine!K99","v":0}]
[]
[null,null,null,null,null,"Base",null,null,null,null,null,null,null,null,null,null,null,null,"Lenovo ThinkSystem SR650 V2 Server"]
{"$rows_left_out":114}
{"sheet":"Altre_Opzioni","index":4,"n_rows":77,"n_cols":14,"rows_kept":77,"cut":false,"hidden":false,"merged":[[71,5,72,5],[75,5,76,5],[44,5,45,5],[28,5,30,5],[1,7,1,9],[4,5,5,5],[7,5,8,5],[11,5,12,5],[67,5,68,5]]}
[]
[null,null,null,null,"Opzioni",null,null,"Totale altre opzioni"]
[]
[]
[null,null,null,null,"Opzione Rack APC con PDU Monofase"]
[null,null,null,null,"Armadio Rack 42U 600x1200, 2 x PDU Monofase 2G, ZeroU, 32A, 230V, (36) C13 & (6) C19",null,{"$f":"VLOOKUP($E6,TS4L4_ALL,13,FALSE)","v":{"$error":"#NAME?"}},null,null,null,null,{"$f":"VLOOKUP($E6,TS4L4_ALL,10,FALSE)*H6","v":{"$error":"#NAME?"}},{"$f":"VLOOKUP($E6,TS4L4_ALL,11,FALSE)*H6","v":{"$error":"#NAME?"}},{"$f":"VLOOKUP($E6,TS4L4_ALL,12,FALSE)","v":{"$error":"#NAME?"}}]
[]
[null,null,null,null,"Opzione Rack APC con PDU Trifase"]
[null,null,null,null,"Armadio Rack 42U 600x1200, 2 x PDU Trifase 2G, ZeroU, 22.0kW(32A) 17.3kW(24A), 230V, (30) C13 & (12) C19",null,{"$f":"VLOOKUP($E9,TS4L4_ALL,13,FALSE)","v":{"$error":"#NAME?"}},null,null,null,null,{"$f":"VLOOKUP($E9,TS4L4_ALL,10,FALSE)*H9","v":{"$error":"#NAME?"}},{"$f":"VLOOKUP($E9,TS4L4_ALL,11,FALSE)*H9","v":{"$error":"#NAME?"}},{"$f":"VLOOKUP($E9,TS4L4_ALL,12,FALSE)","v":{"$error":"#NAME?"}}]
[null,null,null,null,null,null,null,{"$f":"SUM(L13:L77)","v":0}]
{"$rows_left_out":68}
{"sheet":"Riepilogo_Ordine","index":5,"n_rows":101,"n_cols":25,"rows_kept":101,"cut":false,"hidden":false,"merged":[[97,8,97,9],[98,8,98,9],[99,5,99,6],[99,8,99,9],[10,5,10,6],[10,8,10,10],[11,5,11,10],[44,5,44,10],[45,5,45,10],[96,5,96,6],[96,8,96,9],[8,5,8,6],[8,7,8,8],[8,9,8,10],[9,5,9,6],[9,7,9,8],[9,9,9,10],[6,5,6,6],[6,7,6,8],[6,9,6,10],[7,5,7,6],[7,7,7,8],[7,9,7,10],[1,5,1,7],[1,8,3,10],[2,5,2,7],[3,5,3,7],[4,5,4,7],[4,8,4,9],[4,10,5,10],[5,5,5,7],[5,8,5,9]]}
[]
[null,null,null,null,null,"Convenzione \nTecnologie Server 4 - Lotto 3",null,null,{"$f":"IF(P8>0,\"Compilare i Dati Necessari (*) all'Ordine o controllare le Configurazioni per Stampare in PDF\",\"Dati Completi\")","v":"Compilare i Dati Necessari (*) all'Ordine o controllare le Configurazioni per Stampare in PDF"},null,null,null,null,null,null,null,null,null,null,null,null,null,null,null,"SI"]
[null,null,null,null,null,"Riepilogo Ordine Consip N° (*)",null,null,null,null,null,null,null,null,null,null,null,0,0,1,null,{"$f":"SUM(R3:T3)","v":1},null,null,"SI"]
[null,null,null,null,null,null,null,null,null,null,null,null,null,null,null,null,null,null,null,null,null,null,null,null,"SI"]
[null,null,null,null,null,"Ente Ordinante (*)",null,null,"Data Ordine  (*)",null,null,null,null,null,null,"Ordine","Ente","data","Ref Cons","mail","tel","Ref Inst","mail","Tel","SI"]
[null,null,null,null,null,null,null,null,null,null,null,null,null,null,null,{"$f":"IF(F4>0,0,1)","v":1},{"$f":"IF(F6>0,0,1)","v":1},{"$f":"IF(I6>0,0,1)","v":1},{"$f":"IF(F8>0,0,1)","v":1},{"$f":"IF(H8>0,0,1)","v":1},{"$f":"IF(J8>0,0,1)","v":1},{"$f":"IF(F10>0,0,1)","v":1},{"$f":"IF(H10>0,0,1)","v":1},{"$f":"IF(J10>0,0,1)","v":1},"SI"]
[null,null,null,null,null,"Referente Consegna  (*)",null,"Mail  (*)",null,"Tel  (*)",null,null,null,null,null,null,null,null,null,null,null,null,null,0.2,"SI"]
[null,null,null,null,null,null,null,null,null,null,null,null,null,null,null,{"$f":"SUM(P6:X6)+SUM(R10:T10)+X8","v":9},null,{"$f":"IF(F11<>\"\",1,0)","v":0},{"$f":"IF(H11<>\"\",1,0)","v":0},{"$f":"IF(I11<>\"\",1,0)","v":0},null,{"$f":"SUM(R8:T8)","v":0},null,0,"SI"]
[null,null,null,null,null,"Referente Installazione  (*)",null,"Mail  (*)",null,"Tel  (*)",null,null,null,null,null,null,null,null,null,null,null,null,null,null,"SI"]
[null,null,null,null,null,null,null,null,null,null,null,null,null,null,null,null,null,{"$f":"IF(Lotto3_SR650_1!H4<>\"\",1,0)","v":0},{"$f":"IF(Lotto3_SR650_2!H4<>\"\",1,0)","v":0},{"$f":"IF(SR650_Iper_Convergenza!H4<>\"\",1,0)","v":0},null,null,null,null,"SI"]
{"$rows_left_out":92}
{"sheet":"ConfigurationTS4L3","index":6,"n_rows":162,"n_cols":16384,"rows_kept":162,"cut":false,"hidden":true,"merged":[[18,0,18,12]]}
[]
[null,"Module Name","Option ID","Option Name","Option List Price","SKUs","Qty","SKU Customer Kit","Attributo","Valore inserito",null,"N°","Codice Convenzione"]
["Lenovo ThinkSystem SR650 V2 Server","Chassis with Up to 16 x 2.5 Hard Drives for 1CPU Configuration","Chassis with Up to 16 x 2.5 Hard Drives for 2CPU Configuration",{"$f":"VLOOKUP(L3,Tabella_prezzi!$A$2:$L$65,8,FALSE)","v":"Lenovo ThinkSystem SR650 V2 Server"},null,null,null,{"$f":"VLOOKUP(L3,Tabella_prezzi!$A$2:$L$65,9,FALSE)","v":"Lenovo ThinkSystem SR650 V2 Server"},"TS4L4-Opz1CPU",{"$f":"VLOOKUP(L3,Tabella_prezzi!$A$2:$L$65,4,FALSE)","v":2050.54},"TS4L4-Opz2CPU","L3N01",{"$f":"VLOOKUP(L3,Tabella_prezzi!$A$2:$L$65,6,FALSE)","v":"TS4L3-SRV"}]
["Lenovo ThinkSystem SR650 V2 Server (nutanix)","Chassis with Up to 16 x 2.5 Hard Drives for 2CPU Configuration","Chassis with Up to 16 x 2.5 Hard Drives for 2CPU Configuration",{"$f":"VLOOKUP(L4,Tabella_prezzi!$A$2:$L$65,8,FALSE)","v":0},null,null,1,{"$f":"VLOOKUP(L4,Tabella_prezzi!$A$2:$L$65,9,FALSE)","v":"Lenovo ThinkSystem SR650 V2 Server"},"TS4L4-Opz2CPU",{"$f":"VLOOKUP(L3,Tabella_prezzi!$A$2:$L$65,4,FALSE)","v":2050.54},"TS4L4-Opz2CPU","L3N200",{"$f":"VLOOKUP(L4,Tabella_prezzi!$A$2:$L$65,6,FALSE)","v":"TS4L3-SRV"}]
[{"$f":"Tabella_prezzi!H56","v":"Conversion Kit a sistemi HX (Hybrid)"},{"$f":"VLOOKUP(L5,Tabella_prezzi!$A$2:$L$65,8,FALSE)","v":"Lenovo ThinkSystem SR650 V2 Server"},"Kit Conversione Nutanix Chassis with Up to 16 x 2.5 Hard Drives for 2CPU Configuration",{"$f":"VLOOKUP(L5,Tabella_prezzi!$A$2:$L$65,8,FALSE)","v":"Lenovo ThinkSystem SR650 V2 Server"},null,null,1,{"$f":"VLOOKUP(L5,Tabella_prezzi!$A$2:$L$65,9,FALSE)","v":"Lenovo ThinkSystem SR650 V2 Server"},"TS4L3-KIT-NUTANIX",{"$f":"VLOOKUP(L5,Tabella_prezzi!$A$2:$L$65,4,FALSE)","v":2050.54},"TS4L3-KIT-NUTANIX","L3N01",{"$f":"VLOOKUP(L5,Tabella_prezzi!$A$2:$L$65,6,FALSE)","v":"TS4L3-SRV"}]
[{"$f":"Tabella_prezzi!#REF!","v":{"$error":"#REF!"}},{"$f":"VLOOKUP(L6,Tabella_prezzi!$A$2:$L$65,8,FALSE)","v":"Lenovo ThinkSystem SR650 V2 Server"},"Chassis fino a 12 x 3.5 Hard Drives",{"$f":"VLOOKUP(L6,Tabella_prezzi!$A$2:$L$65,8,FALSE)","v":"Lenovo ThinkSystem SR650 V2 Server"},null,null,1,{"$f":"VLOOKUP(L6,Tabella_prezzi!$A$2:$L$65,9,FALSE)","v":"Lenovo ThinkSystem SR650 V2 Server"},"TS4L3-Opz1CPU",{"$f":"VLOOKUP(L6,Tabella_prezzi!$A$2:$L$65,4,FALSE)","v":2050.54},"TS4L3-Opz2CPU","L3N01",{"$f":"VLOOKUP(L6,Tabella_prezzi!$A$2:$L$65,6,FALSE)","v":"TS4L3-SRV"}]
[{"$f":"Tabella_prezzi!H57","v":"Conversion Kit sistemi HX (All-Flash Medium-Large)"},{"$f":"VLOOKUP(L7,Tabella_prezzi!$A$2:$L$65,8,FALSE)","v":"Lenovo ThinkSystem SR650 V2 Server"},"Kit Conversione Nutanix Chassis with Up to 16 x 2.5 Hard Drives for 2CPU Configuration",{"$f":"VLOOKUP(L7,Tabella_prezzi!$A$2:$L$65,8,FALSE)","v":"Lenovo ThinkSystem SR650 V2 Server"},null,null,1,{"$f":"VLOOKUP(L7,Tabella_prezzi!$A$2:$L$65,9,FALSE)","v":"Lenovo ThinkSystem SR650 V2 Server"},"TS4L3-KIT-NUTANIX",{"$f":"VLOOKUP(L7,Tabella_prezzi!$A$2:$L$65,4,FALSE)","v":2050.54},"TS4L3-KIT-NUTANIX","L3N01",{"$f":"VLOOKUP(L7,Tabella_prezzi!$A$2:$L$65,6,FALSE)","v":"TS4L3-SRV"}]
[{"$f":"Tabella_prezzi!H58","v":"Conversion Kit a sistemi VX (Hybrid Storage)"},{"$f":"VLOOKUP(L8,Tabella_prezzi!$A$2:$L$65,8,FALSE)","v":"Lenovo ThinkSystem SR650 V2 Server"},"Chassis fino a 12 x 3.5 Hard Drives",{"$f":"VLOOKUP(L8,Tabella_prezzi!$A$2:$L$65,8,FALSE)","v":"Lenovo ThinkSystem SR650 V2 Server"},null,null,1,{"$f":"VLOOKUP(L8,Tabella_prezzi!$A$2:$L$65,9,FALSE)","v":"Lenovo ThinkSystem SR650 V2 Server"},"TS4L3-Opz1CPU",{"$f":"VLOOKUP(L8,Tabella_prezzi!$A$2:$L$65,4,FALSE)","v":2050.54},"TS4L3-Opz2CPU","L3N01",{"$f":"VLOOKUP(L8,Tabella_prezzi!$A$2:$L$65,6,FALSE)","v":"TS4L3-SRV"}]
[{"$f":"Tabella_prezzi!#REF!","v":{"$error":"#REF!"}},{"$f":"VLOOKUP(L9,Tabella_prezzi!$A$2:$L$65,8,FALSE)","v":"Lenovo ThinkSystem SR650 V2 Server"},"Kit Conversione Nutanix Chassis with Up to 16 x 2.5 Hard Drives for 2CPU Configuration",{"$f":"VLOOKUP(L9,Tabella_prezzi!$A$2:$L$65,8,FALSE)","v":"Lenovo ThinkSystem SR650 V2 Server"},null,null,1,{"$f":"VLOOKUP(L9,Tabella_prezzi!$A$2:$L$65,9,FALSE)","v":"Lenovo ThinkSystem SR650 V2 Server"},"TS4L3-KIT-NUTANIX",{"$f":"VLOOKUP(L9,Tabella_prezzi!$A$2:$L$65,4,FALSE)","v":2050.54},"TS4L3-KIT-NUTANIX","L3N01",{"$f":"VLOOKUP(L9,Tabella_prezzi!$A$2:$L$65,6,FALSE)","v":"TS4L3-SRV"}]
[{"$f":"Tabella_prezzi!H59","v":"Conversion Kit a sistemi VX (All-Flash Medium-Large)"},{"$f":"VLOOKUP(L10,Tabella_prezzi!$A$2:$L$65,8,FALSE)","v":"Lenovo ThinkSystem SR650 V2 Server"},"Kit Conversione Nutanix Chassis with Up to 16 x 2.5 Hard Drives for 2CPU Configuration",{"$f":"VLOOKUP(L10,Tabella_prezzi!$A$2:$L$65,8,FALSE)","v":"Lenovo ThinkSystem SR650 V2 Server"},null,null,1,{"$f":"VLOOKUP(L10,Tabella_prezzi!$A$2:$L$65,9,FALSE)","v":"Lenovo ThinkSystem SR650 V2 Server"},"TS4L3-KIT-NUTANIX",{"$f":"VLOOKUP(L10,Tabella_prezzi!$A$2:$L$65,4,FALSE)","v":2050.54},"TS4L3-KIT-NUTANIX","L3N01",{"$f":"VLOOKUP(L10,Tabella_prezzi!$A$2:$L$65,6,FALSE)","v":"TS4L3-SRV"}]
{"$rows_left_out":153}
{"sheet":"Tabella_prezzi","index":7,"n_rows":89,"n_cols":17,"rows_kept":89,"cut":false,"hidden":true,"merged":[[6,0,12,0]]}
["N°",null,"Attributo","Valore inserito","N°","Codice Convenzione","Qty:",null,"Description:","Manufacturer Part","Sku Number:","Brand"]
["L3N01",1,"Server rackable bi-processore prest.",2050.54,"L3N01","TS4L3-SRV",1,"Lenovo ThinkSystem SR650 V2 Server","Lenovo ThinkSystem SR650 V2 Server","L3N01-ServerSR650","210-AUVQ","DELL",null,null,null,"210-321-BCPX","-"]
["L3N200",1,"Server rackable bi-processore prest.",6000,"L3N200","TS4L3-SRV",1,null,"Lenovo ThinkSystem SR650 V2 Server","L3N01-ServerSR650","210-AUVQ","DELL",null,null,null,"210-321-BCPX","-"]
["L3N01-NVME",1,"Server rackable bi-processore prest.",null,"L3N01-NVME","TS4L3-SRV-NVMe",1,"Lenovo ThinkSystem SR650 V2 Server NVMe","Lenovo ThinkSystem SR650 V2 Server NVMe","L3N01-ServerR7525-NVMe","210-AUVQ","DELL",null,null,null,"210-321-BCPX","-"]
["L3N01-NVME",1,"Server rackable bi-processore prest.",null,"L3N01-vSAN","TS4L3-SRV-vSAN",1,"Lenovo ThinkSystem SR650 V2 Server vSAN","Lenovo ThinkSystem SR650 V2 Server vSAN ","L3N01-ServerR7525-vSAN","210-AUVQ","DELL",null,null,null,"210-321-BCPX","-"]
["L3N01-NVME",1,"Server rackable bi-processore prest.",null,"L3N01-NUT","TS4L3-SRV-NUT",1,"Lenovo ThinkSystem SR650 V2 Server Nutanix","Lenovo ThinkSystem SR650 V2 Server Nutanix","L3N01-ServerR7525-NUT","210-AUVQ","DELL",null,null,null,"210-321-BCPX","-"]
["L3N02",2,"Kit n. 1 Processore aggiuntivo",623.57000000000005,"L3N02","TS4L3-CPU",1,"Intel Xeon Silver 4310 12C 120W 2.1GHz Processor","Intel Xeon Silver 4310 12C 120W 2.1GHz Processor","L3N02-OpzCPU","338-BZSB","DELL",null,null,null,"338-BZSB","WX6G7"]
[null,null,null,null,null,null,1,"L Shape Heatsink for 2nd CPU equal to or greater than 180W,PowerEdge R6525/R7525, Customer Install","L Shape Heatsink for 2nd CPU equal to or greater than 180W,PowerEdge R6525/R7525, Customer Install",null,"412-AASW","DELL",null,null,null,"412-AASW","4RCGC"]
[null,null,null,null,null,null,1,"PowerEdge R7525 High Performance Fan Customer Kit V3","PowerEdge R7525 High Performance Fan Customer Kit V3",null,"121-BBBI","DELL",null,null,null,"121-BBBI","HVVRP"]
[null,null,null,null,null,null,1,"Riser with Two x8(x16 connector) PCIe Gen4 (Slots 4 & 5), Customer Install","Riser with Two x8(x16 connector) PCIe Gen4 (Slots 4 & 5), Customer Install",null,"330-BBTM","DELL",null,null,null,"330-BBTM","234T7"]
{"$rows_left_out":79}