{"text_format":"1","workbook":"xlsx","n_sheets":5,"sheets":["CONSIP_Lotto5","CONSIP_Storage","Valori","L5Nxx","Prezzi"],"not_rendered":{"charts":0,"images":4,"macros":1,"external_links":0,"defined_names":58,"comments":0,"pivot_tables":0},"unopened":[],"bounds":{"document_bytes":16777216,"sheet_cells":100000,"rows_first":2000,"rows_last":500,"rows_between":2000,"halvings":0,"cell_chars":16384,"cell_head_chars":4096},"cells_cut":0,"cells_raw":0,"read":"whole","date_system":"1900"}

{"sheet":"CONSIP_Lotto5","index":0,"n_rows":77,"n_cols":15,"rows_kept":77,"cut":false,"hidden":false,"merged":[[28,6,28,8],[20,6,20,8],[18,6,18,8],[9,0,9,2],[7,1,7,3],[0,0,0,8],[1,0,1,8],[3,0,3,2],[4,0,4,2],[6,1,6,3]]}
["SERVER 3 - LOTTO 5\nServer rackable quad-processore (base)"]
["INSPUR NF8480M5"]
["Opzioni di gara Default Lotto 5"]
["Nuovo server o Upgrade server esistente ?",null,null,"Nuovo Server"]
[{"$f":"IF(D4=Valori!D5,\"Inserire S/N del server\",\"\")","v":""},null,null,null,null,null,null,null,null,null,null,null,"Opzione","CTRL-SHIFT-N"]
[null,null,null,null,null,null,null,null,null,null,null,null,"Base"]
["Cliente Finale:",null,null,null,null,null,"N. Ordine:",null,null,null,null,null,"one-shot"]
["Referente:",null,null,null,null,null,"Data Ordine:"]
[null,null,null,null,null,null,null,null,null,null,null,null,"Opzione","CTRL-SHIFT-S"]
[null,null,null,null,null,null,null,null,null,null,null,null,"Base"]
[null,null,null,{"$f":"IF(D4=Valori!D4,\"Indicare la Quantità dei Nuovi server (L5N01):\",\"Indicare la Quantità dei server da Upgradare (L5N01):\")","v":"Indicare la Quantità dei Nuovi server (L5N01):"},1,null,null,null,null,null,null,null,"add-on",null,0]
[null,null,null,"Prezzo Convenzione  - Server Base",{"$f":"IF(AND(D4 = Valori!D5,D5 <> \"\"),0,+Prezzi!G5*E11)","v":3554},null,null,null,null,null,null,null,"one-shot"]
[null,null,null,"Prezzo Opzioni Aggiuntive",{"$f":"SUM(G18:G77)*E11","v":0}]
[null,null,null,"Prezzo  Totale Server",{"$f":"+E13+E12","v":3554},null,null,null,null,null,null,null,"Opzione","CTRL-SHIFT-H"]
[null,null,null,null,null,null,null,null,null,null,null,null,"Base"]
["Type","Product Code","Main Part PN","Name","QTY","Prezzo Convenzione","Differenza Configurazione Base","Parametro Consip","Denominazione Consip","Opzione",null,null,"one-shot"]
["CPU",null,null,null,null,null,null,null,null,"Base",null,null,"add-on"]
["CPU",{"$f":"IFERROR((VLOOKUP($D18,Prezzi,2,FALSE)),\"\")","v":"S00CPU00000T"},{"$f":"IFERROR((VLOOKUP($D18,Prezzi,3,FALSE)),\"\")","v":"V00106Y000000000"},"5218 (22M cache, 16 Cores, 32 Threads, 2.30 GHz, (125W), 10.40 GT/sec Intel® UPI) ",2,{"$f":"IF($E18=2,VLOOKUP($D18,Prezzi,8,FALSE),VLOOKUP($D18,Prezzi,10,FALSE))","v":"Base Config"},{"$f":"IF($E18=2,VLOOKUP($D18,Prezzi,9,FALSE),VLOOKUP($D18,Prezzi,11,FALSE))","v":"Base Config"},{"$f":"IF(AND(MID($D18,1,4)=\"5218\",$E18=2),\"Base Config\",(VLOOKUP($D18,Prezzi,5,FALSE)))","v":"Base Config"},{"$f":"IF(AND(MID($D18,1,4)=\"5218\",$E18=2),\"Base Config\",(VLOOKUP($D18,Prezzi,6,FALSE)))","v":"Base Config"},"Base",null,null,"Hidden"]
["RAM",null,null,{"$f":"IF(ERRORE_RAM,\"Con 4 CPU necessarie almeno 4 DIMM RAM\",\"\")","v":""},{"$f":"IF(MID(D20,1,2) = \"32\",32*E20,64*E20)","v":64},null,{"$f":"IF(AND(E18=2,E20>24),\"Con 2 CPUs fino a 24 DIMMs RAM\",\"\")","v":""},null,null,"Base"]
["Memory",{"$f":"IFERROR((VLOOKUP($D20,Prezzi,2,FALSE)),\"\")","v":"S00MEM000008"},{"$f":"IFERROR((VLOOKUP($D20,Prezzi,3,FALSE)),\"\")","v":"V00407R000000000"},"32GB DDR4-2933MHz RDIMM (Configurabile solo in caso di nuovo server)",2,{"$f":"IF(AND(MID($D20,1,2)=\"32\",$E20=2),\"Base Config\",VLOOKUP($D20,Prezzi,7,FALSE)*$E20)","v":"Base Config"},{"$f":"IF(AND(MID($D20,1,2)=\"32\",$E20=2),\"Base Config\",VLOOKUP($D20,Prezzi,7,FALSE)*$E20-(Prezzi!G8*2))","v":"Base Config"},{"$f":"IF(AND(MID($D20,1,2)=\"32\",$E20=2),\"Base Config\",(VLOOKUP($D20,Prezzi,5,FALSE)))","v":"Base Config"},{"$f":"IF(AND(MID($D20,1,2)=\"32\",$E20=2),\"Base Config\",(VLOOKUP($D20,Prezzi,6,FALSE)))","v":"Base Config"},"Base"]
["Schede di Rete",null,null,{"$f":"IF(AND(E21>4,E18<4),\"Con più di 4 schede (LAN/HBA) necessarie 4 CPU e 4 DIMM RAM\",\"\")","v":""},{"$f":"SUM(E22:E28)","v":1},null,{"$f":"IF(E21> 9,\"Superato il limite massimo di 9 slots\",\"\")","v":""},null,null,"Base"]
["1 x Network Interface Card dual-port PCI 1000-Mbps full-duplex","BN8156","V022035000000000","Network Interface card Dual-Port PCI 1000 MBPS Full Duplex OCP",1,null,"Base Config","Base Config","Base Config","Base"]
["OpzGigabit ",{"$f":"IFERROR((VLOOKUP($D23,Prezzi,2,FALSE)),\"\")","v":""},{"$f":"IFERROR((VLOOKUP($D23,Prezzi,3,FALSE)),\"\")","v":""},"NONE",0,null,{"$f":"IF(AND($E23=0,$D23=\"NONE\"),\"\",VLOOKUP(CONSIP_Lotto5!$D23,Prezzi,7,FALSE)*$E23)","v":""},{"$f":"IF(AND(E23=0,$D23=\"NONE\"),\"\",VLOOKUP(CONSIP_Lotto5!$D23,Prezzi,5,FALSE))","v":""},{"$f":"IF(AND(E23=0,$D23=\"NONE\"),\"\",VLOOKUP(CONSIP_Lotto5!$D23,Prezzi,6,FALSE))","v":""},"Base"]
["OpzGigabit10Gbps ","","","NONE",0,null,{"$f":"IF(AND($E24=0,$D24=\"NONE\"),\"\",VLOOKUP(CONSIP_Lotto5!$D24,Prezzi,7,FALSE)*$E24)","v":""},{"$f":"IF(AND(E24=0,$D24=\"NONE\"),\"\",VLOOKUP(CONSIP_Lotto5!$D24,Prezzi,5,FALSE))","v":""},{"$f":"IF(AND(E24=0,$D24=\"NONE\"),\"\",VLOOKUP(CONSIP_Lotto5!$D24,Prezzi,6,FALSE))","v":""},"Base"]
["OpzGigabit25Gbps ","","","NONE",0,null,{"$f":"IF(AND($E25=0,$D25=\"NONE\"),\"\",VLOOKUP(CONSIP_Lotto5!$D25,Prezzi,7,FALSE)*$E25)","v":""},{"$f":"IF(AND(E25=0,$D25=\"NONE\"),\"\",VLOOKUP(CONSIP_Lotto5!$D25,Prezzi,5,FALSE))","v":""},{"$f":"IF(AND(E25=0,$D25=\"NONE\"),\"\",VLOOKUP(CONSIP_Lotto5!$D25,Prezzi,6,FALSE))","v":""},"Base"]
["OpzGigabit10Gbps CNA ","","","NONE",0,null,{"$f":"IF(AND($E26=0,$D26=\"NONE\"),\"\",VLOOKUP(CONSIP_Lotto5!$D26,Prezzi,7,FALSE)*$E26)","v":""},{"$f":"IF(AND(E26=0,$D26=\"NONE\"),\"\",VLOOKUP(CONSIP_Lotto5!$D26,Prezzi,5,FALSE))","v":""},{"$f":"IF(AND(E26=0,$D26=\"NONE\"),\"\",VLOOKUP(CONSIP_Lotto5!$D26,Prezzi,6,FALSE))","v":""},"Base"]
["HBA",null,null,null,null,null,null,null,null,"Base"]
["OpzFibreChannel","","","NONE",null,null,{"$f":"IF(AND($E28=0,$D28=\"NONE\"),\"\",VLOOKUP(CONSIP_Lotto5!$D28,Prezzi,7,FALSE)*$E28)","v":""},{"$f":"IF(AND(E28=0,$D28=\"NONE\"),\"\",VLOOKUP(CONSIP_Lotto5!$D28,Prezzi,5,FALSE))","v":""},{"$f":"IF(AND(E28=0,$D28=\"NONE\"),\"\",VLOOKUP(CONSIP_Lotto5!$D28,Prezzi,6,FALSE))","v":""},"Base"]
["DISCHI",null,null,{"$f":"IF(AND($E30 > 0,$D30 <> \"NONE\",$E18 = 2),\"Con NVMe necessarie 4 CPU e almeno 4 DIMM RAM\",\"\")","v":""},{"$f":"SUM(E30:E39)","v":2},null,{"$f":"IF(Total_SSD_SAS_Disk > 24,\"Superato il limite massimo di 24 dischi\",\"\")","v":""},null,null,"Base"]
["NVME_SSD",{"$f":"IFERROR((VLOOKUP($D30,Prezzi,2,FALSE)),\"\")","v":""},{"$f":"IFERROR((VLOOKUP($D30,Prezzi,3,FALSE)),\"\")","v":""},"NONE",0,{"$f":"IFERROR(IF(AND($E30=0,$D30=\"NONE\"),\"\",VLOOKUP(CONSIP_Lotto5!$D30,Prezzi,7,FALSE)*$E30),\"Selezionare Tipologia Disco e Quantità\")","v":""},{"$f":"IF(AND($E30=0,$D30=\"NONE\"),\"\",VLOOKUP(CONSIP_Lotto5!$D30,Prezzi,7,FALSE)*$E30)","v":""},{"$f":"IF(AND(E30=0,$D30=\"NONE\"),\"\",VLOOKUP(CONSIP_Lotto5!$D30,Prezzi,5,FALSE))","v":""},{"$f":"IF(AND(E30=0,$D30=\"NONE\"),\"\",VLOOKUP(CONSIP_Lotto5!$D30,Prezzi,6,FALSE))","v":""},"add-on"]
{"$rows_left_out":48}
{"sheet":"CONSIP_Storage","index":1,"n_rows":26,"n_cols":4,"rows_kept":26,"cut":false,"hidden":true,"merged":[]}
[]
[null,"Storage AFA INSPUR AS2600G2"]
[]
["Tipo","Descrizione","QTY","Capacità RAW"]
["Modello","Model0_G2_E02_2U25_EN",1]
["Controllerlo","Controller",2]
["Memoria","MEM_32G_ECC-RDIMM_E1",1]
["Dischi SSD","SSD_960G_SAS_12Gbps_Samsung_2.5in_2U25_E",24,{"$f":"+(C8*960)/1000","v":23.04}]
["HBA","HBA_2Port_FC16Gb_E",2]
["NIC","NIC_10Gbps_2Port_RJ45_Inspur_X540_PCIe_OCP_E",2]
["PowerSupply","PowerSupply_850W_Platinum_220VACor240VDC_110VAC",2]
["PowerCord","PowerCord_1.9m_Bend_C13_EU",2]
["Software","Software_Intelligent Base Software_AS2600G2(25)_EN",1]
[]
[null,"Storage INSPUR AS2600G2"]
[]
["Tipo","Descrizione","QTY","Capacità RAW"]
["Modello","Model0_G2_E02_2U25_EN",1]
["Controllerlo","Controller",2]
["Memoria","MEM_32G_ECC-RDIMM_E1",1]
["Dischi SSD","HDD_1.2T_SAS_12Gbps_10Krpm_2.5in_2U25_E",24,{"$f":"+(C21*1.2)","v":28.799999999999997}]
["HBA","HBA_2Port_FC16Gb_E",2]
["NIC","NIC_10Gbps_2Port_RJ45_Inspur_X540_PCIe_OCP_E",2]
["PowerSupply","PowerSupply_850W_Platinum_220VACor240VDC_110VAC",2]
["PowerCord","PowerCord_1.9m_Bend_C13_EU",2]
["Software","Software_Intelligent Base Software_AS2600G2(25)_EN",1]

{"sheet":"Valori","index":2,"n_rows":122,"n_cols":30,"rows_kept":122,"cut":false,"hidden":true,"merged":[[99,1,100,1],[102,1,103,1],[105,1,106,1],[84,1,85,1],[87,1,88,1],[90,1,91,1],[93,1,94,1],[96,1,97,1],[51,1,52,1],[54,1,55,1],[75,1,76,1],[78,1,79,1],[81,1,82,1],[36,1,37,1],[39,1,40,1],[42,1,43,1],[45,1,46,1],[48,1,49,1],[115,1,117,1],[108,1,110,1],[3,1,4,1],[57,1,61,1],[119,1,121,1],[22,1,23,1],[28,1,29,1],[19,1,20,1],[66,1,71,1],[6,1,7,1],[9,1,10,1],[12,1,14,1],[63,1,64,1],[25,1,26,1],[16,1,17,1],[33,1,34,1]]}
[null,"Parametro","NONE"]
[null,"NONE",0,0,null,"[Green]+#.##0,00 [$€-it-IT];[Red]-#.##0,00 [$€-it-IT]"]
[]
[null,"Tipo Acquisto",null,"Nuovo Server"]
[null,null,null,"Upgrade Server"]
[null,null,null,null,null,null,null,"In caso NVMe"]
[null,"CPU",{"$f":"MID(D7,1,FIND(\"(\",D7)-2)","v":"5218"},{"$f":"+Prezzi!A6","v":"5218 (22M cache, 16 Cores, 32 Threads, 2.30 GHz, (125W), 10.40 GT/sec Intel® UPI) "},null,2,4,4]
[null,null,"6252N",{"$f":"+Prezzi!A7","v":"6252N (35.75M cache, 24 Cores, 48 Threads, 2.30 GHz, (150W), 10.40 GT/sec Intel® UPI) "}]
[null,null,null,null,null,null,null,"In caso NVMe"]
[null,"RAM",null,{"$f":"+Prezzi!A8","v":"32GB DDR4-2933MHz RDIMM (Configurabile solo in caso di nuovo server)"},null,2,2,4,6,8,10,12,14,16,18,20,22,24]
[null,null,null,{"$f":"+Prezzi!A9","v":"64GB DDR4-2933MHz RDIMM (Configurabile solo in caso di nuovo server)"},null,4,2,4,6,8,10,12,14,16,18,20,22,24,26,28,30,32,34,36,38,40,42,44,46,48]
[]
[null,"NVME_SSD",null,"NONE",null,null,0,1,2,3,4,5,6,7,8,9,10]
[null,null,null,{"$f":"+Prezzi!A24","v":"NVMe/SSD_P451 2.5 2TB Ent NVMe U.2 HS SSD in 3.5 - \"Mixed Use\""}]
[null,null,null,{"$f":"+Prezzi!A25","v":"NVMe/SSD_P451 2.5 1TB Ent NVMe U.2 HS SSD in 3.5 - \"Mixed Use\" "}]
[]
[null,"OpzGigabit",null,"NONE"]
[null,null,null,{"$f":"+Prezzi!A10","v":"Network Interface card Dual-Port PCI 1000 MBPS Full Duplex"}]
[]
[null,"OpzGigabit10Gbps ",null,"NONE"]
[null,null,null,{"$f":"+Prezzi!A11","v":"Network Interface card Dual-Port PCI 10 GBPS Full Duplex SFP+"}]
[]
[null,"OpzGigabit25Gbps",null,"NONE",null,"PCI_QTY",0,1,2]
[null,null,null,{"$f":"+Prezzi!A12","v":"Network Interface Card Dual-Port PCI 25 GBPS Full Duplex SFP"}]
[]
[null,"OpzGigabit10Gbps_CNA",null,"NONE"]
[null,null,null,{"$f":"+Prezzi!A13","v":"QLogic Converged Network Adapter Dual Port 10 GBPS SFP"}]
[]
[null,"HBA",null,"NONE"]
[null,null,null,{"$f":"+Prezzi!A14","v":"QLE2562 Dual Port 8Gb Fibre Channel HBA by Qlogic"}]
{"$rows_left_out":93}
{"sheet":"L5Nxx","index":3,"n_rows":33,"n_cols":4,"rows_kept":33,"cut":false,"hidden":true,"merged":[[1,0,1,3],[3,0,3,3]]}
[]
["La colonna “C/S” indica:\n“C” - la componente opzionale potrà essere acquistata solo in maniera contestuale all’apparecchiatura;\n“S” - la componente opzionale potrà essere acquistata sia in maniera contestuale all’apparecchiatura sia successivamente (nell’arco di 12 mesi dalla data di accettazione della fornitura)"]
[]
["la dimensione dei dischi e delle memorie interne (ad esclusione della componente opzionale RAM) presenti nelle componenti opzionali può variare fino al 10% in difetto o al 50% in eccesso qualora la dimensione riportata in tabella non sia fra le componenti costituenti il server oggetto di offerta."]
["4.2.5 Lotto 5"]
["N°","Denominazione delle componenti opzionali","C/S","Descrizione delle caratteristiche tecniche minime"]
["L5N02 ","Kit n. 2 Processori aggiuntivi","S","n. 2 processori aggiuntivi della stessa tipologia dei processori installati, comprendenti tutta la componentistica meccanica, elettrica ed elettronica, mantenendo inalterate le funzionalità del sottosistema di I/O della configurazione iniziale."]
["L5N03 ","OpzRAM32GB ","S","Modulo di espansione di 32GB di memoria RAM, comprendente tutta la componentistica meccanica, elettrica ed elettronica."]
["L5N04 ","OpzRAM64GB ","S","Modulo di espansione di 64GB di memoria RAM, comprendente tutta la componentistica meccanica, elettrica ed elettronica."]
["L5N05 ","OpzGigabit ","S","Controller aggiuntivo dual-port PCI per Network Gigabit-Ethernet 10/100/1000-Mbps full-duplex."]
["L5N06 ","OpzGigabit10Gbps ","S","Controller aggiuntivo dual port PCI per Network Gigabit- Ethernet di almeno 10 Gbit o migliorativa, fullduplex, con 2 moduli ottici 10 Gbps short-range SFP+."]
["L5N07 ","OpzGigabit25Gbps ","S","Controller aggiuntivo dual port PCI per Network Gigabit- Ethernet di almeno 25 Gbit o migliorativa, fullduplex, con 2 moduli ottici 25 Gbps short-range SFP+."]
["L5N08","OpzGigabit10GbpsCNA","S","Controller aggiuntivo dual port PCI per Network Gigabit- Ethernet di almeno 10 Gbit o migliorativa, di tipo CNA, abilitata al FCoE, con 2 moduli ottici da 10 Gbps short-range SFP+"]
["L5N09 ","OpzFibreChannel ","S","Scheda SAN dual-port Fibre Channel min. 8Gbps, con connessione SFP+ comprensiva di transceiver."]
["L5N10 ","OpzHDD2TB ","S","Unità disco interna aggiuntiva di tipo SAS “hot swap” di 2TB, con transfer teorico a 6Gb e velocità di rotazione di almeno 10 krpm."]
["L5N11 ","OpzHDD1TB ","S","Unità disco interna aggiuntiva di tipo SAS “hot swap” di 1TB, con transfer teorico a 6Gb e velocità di rotazione di almeno 10 krpm."]
["L5N12 ","OpzHDD300GB ","S","Unità disco interna aggiuntiva di tipo SAS “hot swap” di 300 GB, con transfer teorico a 6Gb e velocità di rotazione di almeno 10 krpm."]
["L5N13 ","OpzSSD-RI1,6TB ","S","Unità memoria interna aggiuntiva di tipo SAS SSD Read Intensive “hot swap” di 1,6TB. Endurance DWPD >=0.9 "]
["L5N14 ","OpzSSD-MU1,6TB ","S","Unità memoria interna aggiuntiva di tipo SAS SSD Mixed Use “hot swap” di 1,6TB. Endurance DWPD >=3.0"]
["L5N15 ","OpzSSD-RI800GB ","S","Unità memoria interna aggiuntiva di tipo SAS SSD Read Intensive “hot swap” di 800GB. Endurance DWPD >=0.9"]
["L5N16 ","OpzSSD-MU800GB ","S","Unità memoria interna aggiuntiva di tipo SAS SSD Mixed Use “hot swap” di 800GB. Endurance DWPD >=3.0"]
["L5N17 ","OpzSSD-RI400GB ","S","Unità memoria interna aggiuntiva di tipo SAS SSD Read Intensive “hot swap” di 400GB. Endurance DWPD >=0.9"]
["L5N18 ","OpzUps (3000VA) ","C","Dispositivo UPS di tipo On-line doppia conversione, strutturato per il montaggio a rack da 19”, con:\n- potenza di almeno 3.000 VA/2.700W;\n- autonomia di almeno 5 minuti a pieno carico;\n- con batterie senza manutenzione sostituibili a caldo (hotswap);\n- ingresso monofase;\n- bypass automatico e manuale;\n- porta di comunicazione USB o RS232 e 10/100 BaseT RJ45;\n- test di batteria automatico e manuale;\n- funzioni di autodiagnostica;\n- gestione SNMP;\n- software di gestione in ambiente Windows e Linux per la configurazione dei parametri operativi e per monitoraggio;\n- possibilità di programmare l'accensione e lo shutdown automatico;\n- possibilità d'impostazione, diretta o da software, della modalità di funzionamento più adeguata alla qualità di alimentazione;\n- implementazione della funzionalità di spegnimento UPS da pulsante remoto di emergenza.\nIl dispositivo UPS dovrà esser fornito e consegnato con tutti gli accessori (rotaie e guide telescopiche, viti specifiche, dadi, etc.) atti al montaggio dell’apparecchiatura ed alla sua estraibilità dal rack per le opportune attività di ispezione/manutenzione."]
["L5N19 ","OpzGUI ","C","Kit Graphical User Interface (GUI), contenuto in un cassetto da rack estraibile con guide telescopiche (dimensione massima 1U), contenente un monitor TFT 17” con risoluzioni pari a 1280x800 o superiori, ripiegabile a scomparsa, tastiera e dispositivo di puntamento, completamente compatibili con l’apparecchiatura server offerta e con la scheda grafica prevista nei precedenti paragrafi delle relative tipologie dei singoli lotti della relativa tabella, comprensivi di cavi di interfaccia e di alimentazione."]
["L5N20 ","OpzKVM ","C","Apparato switch Kvm 16 porte overIP con possibilità di gestione da remoto attraverso interfaccia Ethernet comprensiva di staffe, di cavi, di accessori per il montaggio a rack e dei cavi di collegamento tra KVM e server oggetto di fornitura. Controllabile da remoto attraverso opportunità console di gestione."]
["L5N21 ","OpzWinServSTD ","S","Sistema Operativo Windows Server 2019 Standard Edition 2CPU/16core con licenza OEM, comprensivo di licenza d’uso, completo dell’ultima versione di “Service Pack” disponibile al momento dell’installazione, nonché di tutti i driver e le utilities necessarie per il corretto funzionamento dell’apparecchiatura base. Dovranno essere inoltre forniti i supporti di installazione e la manualistica originale."]
["L5N22 ","OpzDeviceCal ","S","Singola CAL Device per sistema Operativo Windows Server 2019 con licenza OEM, comprensivo di licenza d’uso."]
["L5N23 ","OpzUserCal ","S","Singola CAL User per sistema Operativo Windows Server 2016 con licenza OEM, comprensivo di licenza d’uso."]
["L5N24 ","OpzWinServSTD2core ","S","Licenses pack di 2 core per Windows Server 2019."]
["L5N25 ","OpzWinServDC ","S","Sistema Operativo Windows Server 2019 Datacenter con licenza OEM, comprensivo di licenza d’uso, completo dell’ultima versione di “Service Pack” disponibile al momento dell’installazione, nonché di tutti i driver e le utilities necessarie per il corretto funzionamento dell’apparecchiatura base.\nDovranno essere inoltre forniti i supporti di installazione e la manualistica originale."]
{"$rows_left_out":4}
{"sheet":"Prezzi","index":4,"n_rows":53,"n_cols":23,"rows_kept":53,"cut":false,"hidden":true,"merged":[]}
[]
["Componente","Product Code","Main Part PN",null,"Parametro Consip","Attributo ","Valore inserito (Prezzo Unitario)","Kit Base","Differenza","Kit Aggiuntivi","Differenza 4 CPU"]
[{"$f":"+G3","v":"INSPUR NF8480M5"},null,null,1,"Marca e modello del server offerto","Marca e modello del server offerto","INSPUR NF8480M5",null,null,0]
[{"$f":"+G4","v":"Intel Xeon Gold 5218"},null,null,2,"Marca e modello del processore offerto","Marca e modello del processore offerto","Intel Xeon Gold 5218",null,null,0]
[null,null,null,3,"L5N01","Server rackable quad-processore base ",3554,null,null,0]
["5218 (22M cache, 16 Cores, 32 Threads, 2.30 GHz, (125W), 10.40 GT/sec Intel® UPI) ","S00CPU00000T","V00106Y000000000",4,"L5N02","Kit CPU 5218",1382,"Base Config","Base Config",{"$f":"+G6","v":1382},{"$f":"+J6","v":1382}]
["6252N (35.75M cache, 24 Cores, 48 Threads, 2.30 GHz, (150W), 10.40 GT/sec Intel® UPI) ",null,"V00108V000000000","4a","L5N02a","Kit CPU 6252N",2475,{"$f":"+G7","v":2475},{"$f":"+G7-G6","v":1093},{"$f":"+G7*2","v":4950},{"$f":"+J7-G6","v":3568},"Price To be defined/confirmed. It's the competitor price for 2 CPUs"]
["32GB DDR4-2933MHz RDIMM (Configurabile solo in caso di nuovo server)","S00MEM000008","V00407R000000000",5,"L5N03","OpzRam32GB ",194,null,null,{"$f":"+G8","v":194},null,{"$f":"+G8*2","v":388}]
["64GB DDR4-2933MHz RDIMM (Configurabile solo in caso di nuovo server)","S00MEM000000","V00404E000000000",6,"L5N04","OpzRam64GB ",411,null,{"$f":"+G9-G8","v":217},{"$f":"+G9*2","v":822},null,{"$f":"+G9*2","v":822}]
["Network Interface card Dual-Port PCI 1000 MBPS Full Duplex","SPT0POC00W01","V05HS10000000025",7,"L5N05","OpzGigabit ",27]
["Network Interface card Dual-Port PCI 10 GBPS Full Duplex SFP+","SPT0POC00W0L","YZCA-00606-102",8,"L5N06","OpzGigabit10Gbps ",188]
["Network Interface Card Dual-Port PCI 25 GBPS Full Duplex SFP","MCX4121A-ACAT","V022005000000000",9,"L5N07","OpzGigabit25Gbps ",1034]
["QLogic Converged Network Adapter Dual Port 10 GBPS SFP","BC0110402-08C","V022009000000000",10,"L5N08","OpzGigabit10Gbps CNA ",332]
["QLE2562 Dual Port 8Gb Fibre Channel HBA by Qlogic","SPT0POC00B06","V25YT10000000000",11,"L5N09","OpzFibreChannel ",256]
["SSD_480G_SATA_6Gbps_Samsung_2.5in_SM883","MZ7KH480HAHQ-00005","V0231NH000000000",null,"Base Config","Base Config",278]
["SAS “Hot Swap” capacità 2.4TB, SAS 12Gb, 10 krpm","SPT0STG25S16","V0231B5000000000",12,"L5N10","OpzHDD2TB ",188]
["SAS “Hot Swap” capacità 1.2TB, SAS 12Gb, 10 krpm","SPT0STG25001","V0230U2000000000",13,"L5N11","OpzHDD1TB ",110]
["SAS “Hot Swap” capacità 300 GB, SAS 12Gb, 10 krpm","SPT0STG25S0D","V0230WA000000000",14,"L5N12","OpzHDD300GB ",83]
["SAS/SSD \"Read Intensive - Hot Swap” capacità 1,92TB, - DWPD > 0.9","MZ-ILT1T90","V02316C000000000",15,"L5N13","OpzSSD-RI1,6TB ",742]
["SAS/SSD \"Mixed Use - Hot Swap” capacità 1,6TB, - DWPD > 3.0      ","DC-SS530","V02318L000000000",16,"L5N14","OpzSSD-MU1,6TB ",1340,null,null,null,null,"da chiarire con mail di Vincent"]
["SAS/SSD \"Read Intensive - Hot Swap” capacità 960GB, - DWPD > 0.9","MZ-ILT9600","V02316A000000000",17,"L5N15","OpzSSD-RI800GB ",595]
["SAS/SSD \"Mixed Use - Hot Swap” capacità 800GB, - DWPD > 3.0","DCSS530","V02318M000000000",18,"L5N16","OpzSSD-MU800GB ",908,null,null,null,null,"da chiarire con mail di Vincent"]
["SAS/SSD \"Read Intensive - Hot Swap” capacità 480GB, - DWPD > 0.9","MZILS480HEGR-00007","V0230M9000000000",19,"L5N17","OpzSSD-RI400GB ",321]
["NVMe/SSD_P451 2.5 2TB Ent NVMe U.2 HS SSD in 3.5 - \"Mixed Use\"","S00HDD000009000",null,"19a","Add-on","OpzNVME1,6TB ",874,null,null,null,null,"Price To be confirmed. Our proposed price for Lot6"]
["NVMe/SSD_P451 2.5 1TB Ent NVMe U.2 HS SSD in 3.5 - \"Mixed Use\" ","S00HDD000017000",null,"19b","Add-on","OpzNVME800GB ",478,null,null,null,null,"Price To be confirmed. Our proposed price for Lot6"]
["RAID_PM8204-8i_2G_12Gbps_6 (con Batteria)","S00RAID00001000","YZRA-01188-101",null,"Base","RAID 8i_2G_12Gbps",250,"Base Config","Base Config",null,null,"PRICE TO BE DEFINED"]
["RAID_PM8204-8i_4G_12Gbps_6 (con Batteria)","S00RAID00002000","YZRA-01188-102","19c","Add-on","RAID 8i_4G_12Gbps",{"$f":"262+80","v":342},{"$f":"+G27","v":342},{"$f":"+H27-G26","v":92},null,null,"PRICE TO BE DEFINED"]
["Nvidia_Tesla-P100-PCIe_16G","X01700C000000000 ",null,"19d","Add-on","P100-PCIe_16G",5480,null,null,null,null,"PRICE TO BE DEFINED"]
["Nvidia_Tesla-T4_16G","X017016000000000",null,"19e","Add-on","T4_16G",1959,null,null,null,null,"PRICE TO BE DEFINED"]
["Nvidia_Tesla-V100-PCIe_16G","X01700L000000000 ",null,"19f","Add-on","V100-PCIe_16G",7037,null,null,null,null,"PRICE TO BE DEFINED"]
{"$rows_left_out":23}